All pastes #399981 Raw Edit

Compilation error

public text v1 · immutable
·published 2007-03-18 11:59 UTC
rendered paste body
/home/vincent/Application/cmake/bin/cmake -E cmake_progress_report /home/vincent/Project/strigi-build/CMakeFiles
[  0%] Building CXX object src/streams/CMakeFiles/decodebase64.dir/decodebase64.o
/usr/bin/c++   -Wall -g3 -O0 -ansi -I/home/vincent/Project/strigi-build/src/streams -I/home/vincent/Project/KDE/strigi/src/streams -I/home/vincent/Project/strigi-build -I/home/vincent/Project/strigi-build/src/streams/compat -I/home/vincent/Project/KDE/strigi/src/streams/compat   -fPIC -DHAVE_CONFIG_H -DMAKE_STREAMS_LIB -o src/streams/CMakeFiles/decodebase64.dir/decodebase64.o -c /home/vincent/Project/KDE/strigi/src/streams/decodebase64.cpp
/usr/lib/gcc/x86_64-linux-gnu/4.1.2/include/stddef.h:214: error: conflicting declaration ‘typedef long unsigned int size_t’
/home/vincent/Project/strigi-build/src/streams/compat/jstreamsconfig.h:108: error: ‘size_t’ has a previous declaration as ‘typedef int size_t’
/usr/include/sys/types.h:110: error: conflicting declaration ‘typedef __ssize_t ssize_t’
/home/vincent/Project/strigi-build/src/streams/compat/jstreamsconfig.h:113: error: ‘ssize_t’ has a previous declaration as ‘typedef int ssize_t’
/usr/lib/gcc/x86_64-linux-gnu/4.1.2/../../../../include/c++/4.1.2/new:84: error: ‘operator new’ takes type ‘size_t’ (‘long unsigned int’) as first parameter
/usr/lib/gcc/x86_64-linux-gnu/4.1.2/../../../../include/c++/4.1.2/new:85: error: ‘operator new’ takes type ‘size_t’ (‘long unsigned int’) as first parameter
/usr/lib/gcc/x86_64-linux-gnu/4.1.2/../../../../include/c++/4.1.2/new:88: error: ‘operator new’ takes type ‘size_t’ (‘long unsigned int’) as first parameter
/usr/lib/gcc/x86_64-linux-gnu/4.1.2/../../../../include/c++/4.1.2/new:89: error: ‘operator new’ takes type ‘size_t’ (‘long unsigned int’) as first parameter
/usr/lib/gcc/x86_64-linux-gnu/4.1.2/../../../../include/c++/4.1.2/new:94: error: ‘operator new’ takes type ‘size_t’ (‘long unsigned int’) as first parameter
/usr/lib/gcc/x86_64-linux-gnu/4.1.2/../../../../include/c++/4.1.2/new:95: error: ‘operator new’ takes type ‘size_t’ (‘long unsigned int’) as first parameter
make[2]: *** [src/streams/CMakeFiles/decodebase64.dir/decodebase64.o] Erreur 1
make[2]: quittant le répertoire « /home/vincent/Project/strigi-build »
make[1]: *** [src/streams/CMakeFiles/decodebase64.dir/all] Erreur 2
make[1]: quittant le répertoire « /home/vincent/Project/strigi-build »
make: *** [all] Erreur 2