rendered paste bodymake[2]: Entering directory `/var/tmp/portage/sys-devel/gcc-4.1.2/work/build/gcc'
gawk -f /var/tmp/portage/sys-devel/gcc-4.1.2/work/gcc-4.1.2/gcc/opt-gather.awk /var/tmp/portage/sys-devel/gcc-4.1.2/work/gcc-4.1.2/gcc/c.opt /var/tmp/portage/sys-devel/gcc-4.1.2/work/gcc-4.1.2/gcc/common.opt /var/tmp/portage/sys-devel/gcc-4.1.2/work/gcc-4.1.2/gcc/config/i386/i386.opt > tmp-optionlist
/bin/sh /var/tmp/portage/sys-devel/gcc-4.1.2/work/gcc-4.1.2/gcc/../move-if-change tmp-optionlist optionlist
optionlist is unchanged
echo timestamp > s-options
gawk -f /var/tmp/portage/sys-devel/gcc-4.1.2/work/gcc-4.1.2/gcc/opt-functions.awk -f /var/tmp/portage/sys-devel/gcc-4.1.2/work/gcc-4.1.2/gcc/opth-gen.awk \
< optionlist > tmp-options.h
/bin/sh /var/tmp/portage/sys-devel/gcc-4.1.2/work/gcc-4.1.2/gcc/../move-if-change tmp-options.h options.h
options.h is unchanged
echo timestamp > s-options-h
stage1/xgcc -Bstage1/ -B/usr/i586-pc-linux-gnu/bin/ -c -march=pentium-mmx -O2 -pipe -fprofile-generate -DIN_GCC -W -Wall -Wwrite-strings -Wstrict-prototypes -Wmissing-prototypes -pedantic -Wno-long-long -Wno-variadic-macros -Wold-style-definition -Wmissing-format-attribute -DHAVE_CONFIG_H -DGENERATOR_FILE -I. -Ibuild -I/var/tmp/portage/sys-devel/gcc-4.1.2/work/gcc-4.1.2/gcc -I/var/tmp/portage/sys-devel/gcc-4.1.2/work/gcc-4.1.2/gcc/build -I/var/tmp/portage/sys-devel/gcc-4.1.2/work/gcc-4.1.2/gcc/../include -I/var/tmp/portage/sys-devel/gcc-4.1.2/work/gcc-4.1.2/gcc/../libcpp/include -o build/genmodes.o /var/tmp/portage/sys-devel/gcc-4.1.2/work/gcc-4.1.2/gcc/genmodes.c
stage1/xgcc -Bstage1/ -B/usr/i586-pc-linux-gnu/bin/ -c -march=pentium-mmx -O2 -pipe -fprofile-generate -DIN_GCC -W -Wall -Wwrite-strings -Wstrict-prototypes -Wmissing-prototypes -pedantic -Wno-long-long -Wno-variadic-macros -Wold-style-definition -Wmissing-format-attribute -DHAVE_CONFIG_H -DGENERATOR_FILE -I. -Ibuild -I/var/tmp/portage/sys-devel/gcc-4.1.2/work/gcc-4.1.2/gcc -I/var/tmp/portage/sys-devel/gcc-4.1.2/work/gcc-4.1.2/gcc/build -I/var/tmp/portage/sys-devel/gcc-4.1.2/work/gcc-4.1.2/gcc/../include -I/var/tmp/portage/sys-devel/gcc-4.1.2/work/gcc-4.1.2/gcc/../libcpp/include -o build/errors.o /var/tmp/portage/sys-devel/gcc-4.1.2/work/gcc-4.1.2/gcc/errors.c
stage1/xgcc -Bstage1/ -B/usr/i586-pc-linux-gnu/bin/ -march=pentium-mmx -O2 -pipe -fprofile-generate -DIN_GCC -W -Wall -Wwrite-strings -Wstrict-prototypes -Wmissing-prototypes -pedantic -Wno-long-long -Wno-variadic-macros -Wold-style-definition -Wmissing-format-attribute -DHAVE_CONFIG_H -DGENERATOR_FILE -o build/genmodes \
build/genmodes.o build/errors.o ../build-i586-pc-linux-gnu/libiberty/libiberty.a
build/genmodes -h > tmp-modes.h
/bin/sh: build/genmodes: No such file or directory
make[2]: *** [s-modes] Error 127
make[2]: Leaving directory `/var/tmp/portage/sys-devel/gcc-4.1.2/work/build/gcc'
make[1]: *** [stageprofile_build] Error 2
make[1]: Leaving directory `/var/tmp/portage/sys-devel/gcc-4.1.2/work/build/gcc'
make: *** [profiledbootstrap] Error 2
!!! ERROR: sys-devel/gcc-4.1.2 failed.
Call stack:
ebuild.sh, line 1614: Called dyn_compile
ebuild.sh, line 971: Called qa_call 'src_compile'
environment, line 5363: Called src_compile
ebuild.sh, line 1304: Called toolchain_src_compile
toolchain.eclass, line 26: Called gcc_src_compile
toolchain.eclass, line 1550: Called gcc_do_make
toolchain.eclass, line 1424: Called die
!!! emake failed with profiledbootstrap
!!! If you need support, post the topmost build error, and the call stack if relevant.
!!! A complete build log is located at '/var/tmp/portage/sys-devel/gcc-4.1.2/temp/build.log'.