All pastes #399671 Raw Edit

Anonymous

public text v1 · immutable
·published 2007-03-18 04:11 UTC
rendered paste body
udderweb ~ # emerge -a mod_security
--- Invalid atom in /etc/portage/package.keywords: games-action/dungeon-3.2.3
--- Invalid atom in /etc/portage/package.keywords: dev-java/sun-jdk-1.4.2.12-r2

These are the packages that would be merged, in order:

Calculating dependencies... done!
[ebuild  N    ] net-www/mod_security-1.8.7  USE="apache2 -doc" 

Would you like to merge these packages? [Yes/No] yes


>>> Emerging (1 of 1) net-www/mod_security-1.8.7 to /
>>> Downloading 'http://gentoo.mirrors.tds.net/gentoo/distfiles/modsecurity-1.8.7.tar.gz'
--23:08:50--  http://gentoo.mirrors.tds.net/gentoo/distfiles/modsecurity-1.8.7.tar.gz
           => `/usr/portage/distfiles/modsecurity-1.8.7.tar.gz'
Resolving gentoo.mirrors.tds.net... 216.165.129.134
Connecting to gentoo.mirrors.tds.net|216.165.129.134|:80... connected.
HTTP request sent, awaiting response... 200 OK
Length: 313,004 (306K) [application/x-gzip]

100%[==========================================================================>] 313,004       90.08K/s    ETA 00:00

23:08:54 (90.04 KB/s) - `/usr/portage/distfiles/modsecurity-1.8.7.tar.gz' saved [313004/313004]

 * checking ebuild checksums ;-) ...                                                                            [ ok ]
 * checking auxfile checksums ;-) ...                                                                           [ ok ]
 * checking miscfile checksums ;-) ...                                                                          [ ok ]
 * checking modsecurity-1.8.7.tar.gz ;-) ...                                                                    [ ok ]
>>> Unpacking source...
>>> Unpacking modsecurity-1.8.7.tar.gz to /var/portage_tmp/portage/net-www/mod_security-1.8.7/work
>>> Source unpacked.
>>> Compiling source in /var/portage_tmp/portage/net-www/mod_security-1.8.7/work/modsecurity-1.8.7 ...
/usr/bin/libtool --silent --mode=compile x86_64-pc-linux-gnu-gcc -prefer-pic -march=athlon64 -O2 -pipe -fomit-frame-pointer  -DLINUX=2 -D_REENTRANT -D_GNU_SOURCE -pthread -I/usr/include/apache2  -I/usr/include/apr-1   -I/usr/include/apr-1 -I/usr/include/db4.2  -c -o /var/portage_tmp/portage/net-www/mod_security-1.8.7/work/modsecurity-1.8.7/apache2/mod_security.lo /var/portage_tmp/portage/net-www/mod_security-1.8.7/work/modsecurity-1.8.7/apache2/mod_security.c && touch /var/portage_tmp/portage/net-www/mod_security-1.8.7/work/modsecurity-1.8.7/apache2/mod_security.slo
/var/portage_tmp/portage/net-www/mod_security-1.8.7/work/modsecurity-1.8.7/apache2/mod_security.c:284: error: syntax error before "regex_t"
/var/portage_tmp/portage/net-www/mod_security-1.8.7/work/modsecurity-1.8.7/apache2/mod_security.c:284: warning: no semicolon at end of struct or union
/var/portage_tmp/portage/net-www/mod_security-1.8.7/work/modsecurity-1.8.7/apache2/mod_security.c:291: error: syntax error before '}' token
/var/portage_tmp/portage/net-www/mod_security-1.8.7/work/modsecurity-1.8.7/apache2/mod_security.c:291: warning: data definition has no type or storage class
/var/portage_tmp/portage/net-www/mod_security-1.8.7/work/modsecurity-1.8.7/apache2/mod_security.c:450: error: syntax error before "signature"
/var/portage_tmp/portage/net-www/mod_security-1.8.7/work/modsecurity-1.8.7/apache2/mod_security.c:461: error: syntax error before "signature"
/var/portage_tmp/portage/net-www/mod_security-1.8.7/work/modsecurity-1.8.7/apache2/mod_security.c: In function `sec_create_dir_config':
/var/portage_tmp/portage/net-www/mod_security-1.8.7/work/modsecurity-1.8.7/apache2/mod_security.c:1375: error: syntax error before ')' token
/var/portage_tmp/portage/net-www/mod_security-1.8.7/work/modsecurity-1.8.7/apache2/mod_security.c: At top level:
/var/portage_tmp/portage/net-www/mod_security-1.8.7/work/modsecurity-1.8.7/apache2/mod_security.c:2274: error: syntax error before "signature"
/var/portage_tmp/portage/net-www/mod_security-1.8.7/work/modsecurity-1.8.7/apache2/mod_security.c: In function `check_single_signature':
/var/portage_tmp/portage/net-www/mod_security-1.8.7/work/modsecurity-1.8.7/apache2/mod_security.c:2283: error: `sig' undeclared (first use in this function)
/var/portage_tmp/portage/net-www/mod_security-1.8.7/work/modsecurity-1.8.7/apache2/mod_security.c:2283: error: (Each undeclared identifier is reported only once
/var/portage_tmp/portage/net-www/mod_security-1.8.7/work/modsecurity-1.8.7/apache2/mod_security.c:2283: error: for each function it appears in.)
/var/portage_tmp/portage/net-www/mod_security-1.8.7/work/modsecurity-1.8.7/apache2/mod_security.c:2284: error: `msr' undeclared (first use in this function)
/var/portage_tmp/portage/net-www/mod_security-1.8.7/work/modsecurity-1.8.7/apache2/mod_security.c: In function `sec_check_all_signatures':
/var/portage_tmp/portage/net-www/mod_security-1.8.7/work/modsecurity-1.8.7/apache2/mod_security.c:2576: error: `signatures' undeclared (first use in this function)
/var/portage_tmp/portage/net-www/mod_security-1.8.7/work/modsecurity-1.8.7/apache2/mod_security.c:2583: error: syntax error before ')' token
/var/portage_tmp/portage/net-www/mod_security-1.8.7/work/modsecurity-1.8.7/apache2/mod_security.c: At top level:
/var/portage_tmp/portage/net-www/mod_security-1.8.7/work/modsecurity-1.8.7/apache2/mod_security.c:2838: error: syntax error before "signature"
/var/portage_tmp/portage/net-www/mod_security-1.8.7/work/modsecurity-1.8.7/apache2/mod_security.c: In function `check_sig_against_string':
/var/portage_tmp/portage/net-www/mod_security-1.8.7/work/modsecurity-1.8.7/apache2/mod_security.c:2839: error: `msr' undeclared (first use in this function)
/var/portage_tmp/portage/net-www/mod_security-1.8.7/work/modsecurity-1.8.7/apache2/mod_security.c:2843: error: `_sig' undeclared (first use in this function)
/var/portage_tmp/portage/net-www/mod_security-1.8.7/work/modsecurity-1.8.7/apache2/mod_security.c:2848: error: `s' undeclared (first use in this function)
/var/portage_tmp/portage/net-www/mod_security-1.8.7/work/modsecurity-1.8.7/apache2/mod_security.c:2859: error: `var_type' undeclared (first use in this function)
/var/portage_tmp/portage/net-www/mod_security-1.8.7/work/modsecurity-1.8.7/apache2/mod_security.c: In function `cmd_filter':
/var/portage_tmp/portage/net-www/mod_security-1.8.7/work/modsecurity-1.8.7/apache2/mod_security.c:3234: error: `sig' undeclared (first use in this function)
/var/portage_tmp/portage/net-www/mod_security-1.8.7/work/modsecurity-1.8.7/apache2/mod_security.c:3243: error: `REG_EXTENDED' undeclared (first use in this function)
/var/portage_tmp/portage/net-www/mod_security-1.8.7/work/modsecurity-1.8.7/apache2/mod_security.c:3243: error: `REG_ICASE' undeclared (first use in this function)
/var/portage_tmp/portage/net-www/mod_security-1.8.7/work/modsecurity-1.8.7/apache2/mod_security.c:3243: error: `REG_NOSUB' undeclared (first use in this function)
/var/portage_tmp/portage/net-www/mod_security-1.8.7/work/modsecurity-1.8.7/apache2/mod_security.c:3264: error: syntax error before ')' token
/var/portage_tmp/portage/net-www/mod_security-1.8.7/work/modsecurity-1.8.7/apache2/mod_security.c: In function `cmd_filter_selective':
/var/portage_tmp/portage/net-www/mod_security-1.8.7/work/modsecurity-1.8.7/apache2/mod_security.c:3295: error: `sig' undeclared (first use in this function)
/var/portage_tmp/portage/net-www/mod_security-1.8.7/work/modsecurity-1.8.7/apache2/mod_security.c:3310: error: `REG_EXTENDED' undeclared (first use in this function)
/var/portage_tmp/portage/net-www/mod_security-1.8.7/work/modsecurity-1.8.7/apache2/mod_security.c:3310: error: `REG_ICASE' undeclared (first use in this function)
/var/portage_tmp/portage/net-www/mod_security-1.8.7/work/modsecurity-1.8.7/apache2/mod_security.c:3310: error: `REG_NOSUB' undeclared (first use in this function)
/var/portage_tmp/portage/net-www/mod_security-1.8.7/work/modsecurity-1.8.7/apache2/mod_security.c:3435: error: syntax error before ')' token
/var/portage_tmp/portage/net-www/mod_security-1.8.7/work/modsecurity-1.8.7/apache2/mod_security.c: In function `sec_filter_out':
/var/portage_tmp/portage/net-www/mod_security-1.8.7/work/modsecurity-1.8.7/apache2/mod_security.c:4877: error: `signatures' undeclared (first use in this function)
/var/portage_tmp/portage/net-www/mod_security-1.8.7/work/modsecurity-1.8.7/apache2/mod_security.c:4880: error: syntax error before ')' token
apxs:Error: Command failed with rc=65536
.

!!! ERROR: net-www/mod_security-1.8.7 failed.
Call stack:
  ebuild.sh, line 1614:   Called dyn_compile
  ebuild.sh, line 971:   Called qa_call 'src_compile'
  environment, line 2087:   Called src_compile
  ebuild.sh, line 1304:   Called apache-module_src_compile
  apache-module.eclass, line 384:   Called apache2_src_compile
  apache-module.eclass, line 275:   Called die

!!! /usr/sbin/apxs2 -S LIBEXECDIR=/var/portage_tmp/portage/net-www/mod_security-1.8.7/work/modsecurity-1.8.7 -c /var/portage_tmp/portage/net-www/mod_security-1.8.7/work/modsecurity-1.8.7/apache2/mod_security.c failed
!!! If you need support, post the topmost build error, and the call stack if relevant.
!!! A complete build log is located at '/var/portage_tmp/portage/net-www/mod_security-1.8.7/temp/build.log'.

udderweb ~ #