rendered paste bodycc -O2 -Wall -fPIC -DWINAMPEXEPATH=\"/usr/bin\" -D_REENTRANT -DWINELIB -I/usr/X1 1R6/include/wine/windows -I/usr/X11R6/include -I/usr/include/gtk-1.2 -I/usr/incl ude/glib-1.2 -I/usr/lib/glib/include -c -o winamp.o winamp.c
cc -O2 -Wall -fPIC -DWINAMPEXEPATH=\"/usr/bin\" -D_REENTRANT -DWINELIB -I/usr/X1 1R6/include/wine/windows -I/usr/X11R6/include -I/usr/include/gtk-1.2 -I/usr/incl ude/glib-1.2 -I/usr/lib/glib/include -c -o list.o list.c
winebuild -fPIC -DSTRICT -o winamp.spec.c winamp.o list.o --exe -F winamp -mgui -L/usr/lib/wine -lkernel32 -luser32 -lgdi32
cc -O2 -Wall -fPIC -DWINAMPEXEPATH=\"/usr/bin\" -D_REENTRANT -DWINELIB -I/usr/X1 1R6/include/wine/windows -I/usr/X11R6/include -I/usr/include/gtk-1.2 -I/usr/incl ude/glib-1.2 -I/usr/lib/glib/include -c -o winamp.spec.o winamp.spec.c
winamp.spec.c:4: error: parse error before '.' token
winamp.spec.c:140: error: stray '@' in program
winamp.spec.c:145:42: invalid suffix "b" on integer constant
winamp.spec.c:149: error: stray '@' in program
winamp.spec.c:154:42: invalid suffix "b" on integer constant
winamp.spec.c:158: error: stray '@' in program
winamp.spec.c:163:42: invalid suffix "b" on integer constant
winamp.spec.c:167: error: stray '@' in program
winamp.spec.c:172:43: invalid suffix "b" on integer constant
winamp.spec.c:176: error: stray '@' in program
winamp.spec.c:181:43: invalid suffix "b" on integer constant
winamp.spec.c:185: error: stray '@' in program
winamp.spec.c:190:43: invalid suffix "b" on integer constant
winamp.spec.c:196: error: stray '@' in program
make: *** [winamp.spec.o] Error 1