All pastes #397708 Raw Edit

Unnamed

public text v1 · immutable
·published 2007-03-16 18:22 UTC
rendered paste body
wmii build options:
CFLAGS   = -g -Wall -I. -I/usr/local/include -I/usr/include -I/usr/X11R6/include -DVERSION="snap20070304"
LDFLAGS  = -g -L/usr/lib -lc -lm -L/usr/X11R6/lib -lX11
CC       = cc
CC fs.c
fs.c: In function ‘write_buf’:
fs.c:179: error: ‘Fcall’ has no member named ‘offset’
fs.c:182: error: ‘Fcall’ has no member named ‘offset’
fs.c:183: error: ‘Fcall’ has no member named ‘count’
fs.c:184: error: ‘Fcall’ has no member named ‘count’
fs.c:185: error: incompatible types in assignment
fs.c:186: error: ‘Fcall’ has no member named ‘offset’
fs.c:186: error: incompatible type for argument 1 of ‘memcpy’
fs.c:187: error: ‘Fcall’ has no member named ‘count’
fs.c: In function ‘write_to_buf’:
fs.c:195: error: ‘Fcall’ has no member named ‘offset’
fs.c:196: error: ‘Fcall’ has no member named ‘count’
fs.c:197: error: ‘Fcall’ has no member named ‘count’
fs.c:201: error: ‘Fcall’ has no member named ‘count’
fs.c:212: error: incompatible type for argument 2 of ‘memcpy’
fs.c:213: error: ‘Fcall’ has no member named ‘count’
fs.c: In function ‘data_to_cstring’:
fs.c:221: error: ‘Fcall’ has no member named ‘count’
fs.c:222: error: subscripted value is neither array nor pointer
fs.c:223: error: incompatible type for argument 1 of ‘erealloc’
fs.c:223: error: incompatible types in assignment
fs.c:224: error: used union type value where scalar is required
fs.c:225: error: subscripted value is neither array nor pointer
fs.c: In function ‘respond_event’:
fs.c:302: error: incompatible types in assignment
fs.c:303: error: ‘Fcall’ has no member named ‘count’
fs.c: In function ‘fs_attach’:
fs.c:514: error: ‘Fcall’ has no member named ‘qid’
fs.c: In function ‘fs_walk’:
fs.c:525: error: ‘Fcall’ has no member named ‘nwname’
fs.c:526: error: ‘Fcall’ has no member named ‘wname’
fs.c:533: error: ‘Fcall’ has no member named ‘wname’
fs.c:537: error: ‘Fcall’ has no member named ‘wname’
fs.c:542: error: ‘Fcall’ has no member named ‘wqid’
fs.c:543: error: ‘Fcall’ has no member named ‘wqid’
fs.c:546: error: ‘Fcall’ has no member named ‘nwname’
fs.c:555: error: ‘Fcall’ has no member named ‘newfid’
fs.c:564: error: ‘Fcall’ has no member named ‘nwqid’
fs.c: In function ‘fs_stat’:
fs.c:598: error: ‘Fcall’ has no member named ‘nstat’
fs.c:600: error: ‘Fcall’ has no member named ‘stat’
fs.c: In function ‘fs_read’:
fs.c:623: error: ‘Fcall’ has no member named ‘count’
fs.c:625: error: incompatible types in assignment
fs.c:631: error: ‘Fcall’ has no member named ‘offset’
fs.c:642: error: ‘Fcall’ has no member named ‘count’
fs.c:642: error: ‘Fcall’ has no member named ‘count’
fs.c:679: error: ‘Fcall’ has no member named ‘offset’
fs.c:683: error: incompatible types in assignment
fs.c:684: error: incompatible type for argument 1 of ‘snprintf’
fs.c:686: error: ‘Fcall’ has no member named ‘count’
fs.c: In function ‘fs_write’:
fs.c:712: error: ‘Fcall’ has no member named ‘count’
fs.c:735: error: incompatible type for argument 2 of ‘apply_tags’
fs.c:736: error: ‘Fcall’ has no member named ‘count’
fs.c:736: error: ‘Fcall’ has no member named ‘count’
fs.c:743: error: ‘Fcall’ has no member named ‘count’
fs.c:743: error: ‘Fcall’ has no member named ‘offset’
fs.c:748: error: incompatible type for argument 2 of ‘message_client’
fs.c:752: error: ‘Fcall’ has no member named ‘count’
fs.c:752: error: ‘Fcall’ has no member named ‘count’
fs.c:757: error: incompatible type for argument 2 of ‘message_view’
fs.c:761: error: ‘Fcall’ has no member named ‘count’
fs.c:761: error: ‘Fcall’ has no member named ‘count’
fs.c:768: error: incompatible type for argument 3 of ‘tokenize’
fs.c:782: error: ‘Fcall’ has no member named ‘count’
fs.c:782: error: ‘Fcall’ has no member named ‘count’
fs.c:786: error: ‘Fcall’ has no member named ‘count’
fs.c:787: error: ‘Fcall’ has no member named ‘count’
fs.c:789: error: ‘Fcall’ has no member named ‘count’
fs.c:790: error: ‘Fcall’ has no member named ‘count’
fs.c:790: error: ‘Fcall’ has no member named ‘count’
fs.c: In function ‘fs_open’:
fs.c:817: error: ‘Fcall’ has no member named ‘mode’
fs.c:821: error: ‘Fcall’ has no member named ‘mode’
fs.c:825: error: ‘Fcall’ has no member named ‘mode’
fs.c:829: error: ‘Fcall’ has no member named ‘mode’
fs.c: In function ‘fs_create’:
fs.c:846: error: ‘Fcall’ has no member named ‘name’
fs.c:850: error: ‘Fcall’ has no member named ‘name’
fs.c:851: error: ‘Fcall’ has no member named ‘name’
fs.c:856: error: ‘Fcall’ has no member named ‘qid’
fs.c:857: error: ‘Fcall’ has no member named ‘qid’
make: *** [fs.o] Erreur 1