All pastes #397541 Raw Edit

Someone

public text v1 · immutable
·published 2007-03-16 15:48 UTC
rendered paste body
make[2]: Entering directory `/home/faustov/Krulowa_2.0/eggdrop1.6.18/src/mod/kf.mod'
gcc -pipe -fPIC -g -O2 -Wall -I. -I../../.. -I../../.. -I../../../src/mod -DHAVE_CONFIG_H   -DMAKING_MODS `xml2-config --cflags` -c .././kf.mod/kf.c `xml2-config --libs`
.././kf.mod/kf.c:24: error: expected identifier or ‘(’ before ‘char’
.././kf.mod/kf.c:24: error: expected ‘)’ before ‘(’ token
.././kf.mod/kf.c:25: error: expected ‘;’ before ‘int’
.././kf.mod/kf.c: In function ‘kf_start’:
.././kf.mod/kf.c:62: error: ‘kf_table’ undeclared (first use in this function)
.././kf.mod/kf.c:62: error: (Each undeclared identifier is reported only once
.././kf.mod/kf.c:62: error: for each function it appears in.)
.././kf.mod/kf.c:69: error: ‘mydcc’ undeclared (first use in this function)
.././kf.mod/kf.c: In function ‘kf_close’:
.././kf.mod/kf.c:75: error: ‘mydcc’ undeclared (first use in this function)
.././kf.mod/kf.c: At top level:
.././kf.mod/kf.c:100: error: ‘kf_main’ undeclared here (not in a function)
.././kf.mod/kf.c: In function ‘StripColors’:
.././kf.mod/kf.c:122: warning: implicit declaration of function ‘dont_use_old_malloc’
.././kf.mod/kf.c:122: warning: assignment makes pointer from integer without a cast
.././kf.mod/kf.c: In function ‘DealWithServerInfo’:
.././kf.mod/kf.c:238: warning: assignment makes pointer from integer without a cast
.././kf.mod/kf.c:241: error: ‘struct serverinfo’ has no member named ‘deathmatch’
.././kf.mod/kf.c:241: warning: statement with no effect
.././kf.mod/kf.c:242: error: expected identifier before ‘(’ token
.././kf.mod/kf.c:242: warning: passing argument 1 of ‘strcpy’ from incompatible pointer type
.././kf.mod/kf.c:242: error: too few arguments to function ‘strcpy’
.././kf.mod/kf.c:242: warning: statement with no effect
.././kf.mod/kf.c:243: error: ‘struct serverinfo’ has no member named ‘map’
.././kf.mod/kf.c:243: warning: passing argument 1 of ‘strcpy’ from incompatible pointer type
.././kf.mod/kf.c:244: error: ‘struct serverinfo’ has no member named ‘status’
.././kf.mod/kf.c:244: warning: passing argument 1 of ‘strcpy’ from incompatible pointer type
.././kf.mod/kf.c: In function ‘AddNewPlayer’:
.././kf.mod/kf.c:253: warning: assignment makes pointer from integer without a cast
.././kf.mod/kf.c: In function ‘AddNewServer’:
.././kf.mod/kf.c:272: warning: assignment makes pointer from integer without a cast
.././kf.mod/kf.c: In function ‘DealWithPlayerInfo’:
.././kf.mod/kf.c:308: warning: unused variable ‘i’
.././kf.mod/kf.c: In function ‘ShowPlayerListTeam’:
.././kf.mod/kf.c:422: warning: unused variable ‘num’
.././kf.mod/kf.c: In function ‘SendMassQuery’:
.././kf.mod/kf.c:536: warning: unused variable ‘timeout’
.././kf.mod/kf.c: In function ‘ProcessReply’:
.././kf.mod/kf.c:625: error: expected identifier before ‘(’ token
.././kf.mod/kf.c:625: error: expected identifier before ‘(’ token
.././kf.mod/kf.c:625: warning: statement with no effect
.././kf.mod/kf.c:626: error: ‘struct serverinfo’ has no member named ‘playerlist’
.././kf.mod/kf.c:626: warning: statement with no effect
.././kf.mod/kf.c:627: error: expected identifier before ‘(’ token
.././kf.mod/kf.c:631: error: ‘struct serverinfo’ has no member named ‘status’
.././kf.mod/kf.c:631: error: ‘struct serverinfo’ has no member named ‘status’
.././kf.mod/kf.c:631: warning: passing argument 1 of ‘strlen’ from incompatible pointer type
.././kf.mod/kf.c:631: error: ‘struct serverinfo’ has no member named ‘status’
.././kf.mod/kf.c:631: error: ‘struct serverinfo’ has no member named ‘status’
.././kf.mod/kf.c:631: error: ‘struct serverinfo’ has no member named ‘status’
.././kf.mod/kf.c:631: warning: passing argument 1 of ‘__builtin_strcmp’ from incompatible pointer type
.././kf.mod/kf.c:631: error: ‘struct serverinfo’ has no member named ‘status’
.././kf.mod/kf.c:631: error: ‘struct serverinfo’ has no member named ‘status’
.././kf.mod/kf.c:631: error: ‘struct serverinfo’ has no member named ‘status’
.././kf.mod/kf.c:631: error: ‘struct serverinfo’ has no member named ‘status’
.././kf.mod/kf.c:631: warning: passing argument 1 of ‘strlen’ from incompatible pointer type
.././kf.mod/kf.c:631: error: ‘struct serverinfo’ has no member named ‘status’
.././kf.mod/kf.c:631: warning: passing argument 1 of ‘__builtin_strcmp’ from incompatible pointer type
.././kf.mod/kf.c:631: error: ‘struct serverinfo’ has no member named ‘status’
.././kf.mod/kf.c:631: error: ‘struct serverinfo’ has no member named ‘status’
.././kf.mod/kf.c:631: error: ‘struct serverinfo’ has no member named ‘status’
.././kf.mod/kf.c:631: error: ‘struct serverinfo’ has no member named ‘status’
.././kf.mod/kf.c:631: error: ‘struct serverinfo’ has no member named ‘status’
.././kf.mod/kf.c:631: error: ‘struct serverinfo’ has no member named ‘status’
.././kf.mod/kf.c:631: error: ‘struct serverinfo’ has no member named ‘status’
.././kf.mod/kf.c:631: error: ‘struct serverinfo’ has no member named ‘status’
.././kf.mod/kf.c:631: warning: passing argument 1 of ‘__builtin_strcmp’ from incompatible pointer type
.././kf.mod/kf.c:631: error: ‘struct serverinfo’ has no member named ‘status’
.././kf.mod/kf.c:631: error: ‘struct serverinfo’ has no member named ‘status’
.././kf.mod/kf.c:631: warning: passing argument 1 of ‘__builtin_strcmp’ from incompatible pointer type
.././kf.mod/kf.c:632: error: ‘struct serverinfo’ has no member named ‘playerlist’
.././kf.mod/kf.c:632: warning: passing argument 1 of ‘ShowPlayerListOther’ from incompatible pointer type
.././kf.mod/kf.c:634: error: ‘struct serverinfo’ has no member named ‘playerlist’
.././kf.mod/kf.c:634: warning: passing argument 1 of ‘ShowPlayerListDuel’ from incompatible pointer type
.././kf.mod/kf.c:636: error: ‘struct serverinfo’ has no member named ‘playerlist’
.././kf.mod/kf.c:636: warning: passing argument 1 of ‘ShowPlayerListTeam’ from incompatible pointer type
.././kf.mod/kf.c:640: warning: implicit declaration of function ‘dont_use_old_free’
.././kf.mod/kf.c:618: warning: unused variable ‘playerlist’
.././kf.mod/kf.c: In function ‘ParseServers’:
.././kf.mod/kf.c:668: warning: pointer targets in passing argument 1 of ‘atoi’ differ in signedness
.././kf.mod/kf.c:675: warning: pointer targets in passing argument 2 of ‘strcpy’ differ in signedness
.././kf.mod/kf.c:682: warning: pointer targets in passing argument 1 of ‘atoi’ differ in signedness
.././kf.mod/kf.c:689: warning: pointer targets in passing argument 2 of ‘strcpy’ differ in signedness
.././kf.mod/kf.c: At top level:
.././kf.mod/kf.c:709: warning: return type of ‘main’ is not ‘int’
.././kf.mod/kf.c: In function ‘main’:
.././kf.mod/kf.c:715: error: expected identifier or ‘(’ before ‘char’
.././kf.mod/kf.c:715: error: expected ‘)’ before ‘(’ token
.././kf.mod/kf.c:730: warning: format ‘%d’ expects type ‘int *’, but argument 3 has type ‘short unsigned int *’
.././kf.mod/kf.c:730: warning: format ‘%d’ expects type ‘int *’, but argument 4 has type ‘short unsigned int *’
.././kf.mod/kf.c:730: warning: format ‘%d’ expects type ‘int *’, but argument 5 has type ‘short unsigned int *’
.././kf.mod/kf.c:730: warning: format ‘%d’ expects type ‘int *’, but argument 6 has type ‘short unsigned int *’
.././kf.mod/kf.c:730: warning: format ‘%d’ expects type ‘int *’, but argument 7 has type ‘short unsigned int *’
.././kf.mod/kf.c: At top level:
.././kf.mod/kf.c:782: warning: initialization from incompatible pointer type
make[2]: *** [../kf.o] Error 1
make[2]: Leaving directory `/home/faustov/Krulowa_2.0/eggdrop1.6.18/src/mod/kf.mod'
make[1]: *** [kf.mod_so] Error 2
make[1]: Leaving directory `/home/faustov/Krulowa_2.0/eggdrop1.6.18/src/mod'
make: *** [modules] Error 2