make -C /usr/src/linux-headers-2.6.17-10-generic/ O=./ SUBDIRS=`pwd`
make[1]: Entering directory `/usr/src/linux-headers-2.6.17-10-generic'
LD /home/enverex/src/a828-install/built-in.o
CC [M] /home/enverex/src/a828-install/aver/osdep.o
CC [M] /home/enverex/src/a828-install/a828-core.o
CC [M] /home/enverex/src/a828-install/aver/osdep_usb.o
CC [M] /home/enverex/src/a828-install/aver/osdep_dvb.o
/home/enverex/src/a828-install/aver/osdep_dvb.c:88:20: error: dvbdev.h: No such file or directory
/home/enverex/src/a828-install/aver/osdep_dvb.c:89:19: error: demux.h: No such file or directory
/home/enverex/src/a828-install/aver/osdep_dvb.c:90:23: error: dvb_demux.h: No such file or directory
/home/enverex/src/a828-install/aver/osdep_dvb.c:91:20: error: dmxdev.h: No such file or directory
/home/enverex/src/a828-install/aver/osdep_dvb.c:92:24: error: dvb_filter.h: No such file or directory
/home/enverex/src/a828-install/aver/osdep_dvb.c:93:21: error: dvb_net.h: No such file or directory
/home/enverex/src/a828-install/aver/osdep_dvb.c:94:28: error: dvb_ringbuffer.h: No such file or directory
/home/enverex/src/a828-install/aver/osdep_dvb.c:95:26: error: dvb_frontend.h: No such file or directory
In file included from /home/enverex/src/a828-install/aver/osdep_dvb.c:101:
/home/enverex/src/a828-install/aver/osdep_dvb.h:98: warning: âstruct dvb_frontend_infoâ declared inside parameter list
/home/enverex/src/a828-install/aver/osdep_dvb.h:98: warning: its scope is only this definition or declaration, which is probably not what you want
/home/enverex/src/a828-install/aver/osdep_dvb.h:110: error: expected declaration specifiers or â...â before âfe_status_tâ
/home/enverex/src/a828-install/aver/osdep_dvb.h:114: warning: âstruct dvb_frontend_parametersâ declared inside parameter list
/home/enverex/src/a828-install/aver/osdep_dvb.h:115: warning: âstruct dvb_frontend_parametersâ declared inside parameter list
/home/enverex/src/a828-install/aver/osdep_dvb.h:122: warning: âstruct dvb_diseqc_master_cmdâ declared inside parameter list
/home/enverex/src/a828-install/aver/osdep_dvb.h:123: warning: âstruct dvb_diseqc_slave_replyâ declared inside parameter list
/home/enverex/src/a828-install/aver/osdep_dvb.h:124: error: expected declaration specifiers or â...â before âfe_sec_mini_cmd_tâ
/home/enverex/src/a828-install/aver/osdep_dvb.h:125: error: expected declaration specifiers or â...â before âfe_sec_tone_mode_tâ
/home/enverex/src/a828-install/aver/osdep_dvb.h:126: error: expected declaration specifiers or â...â before âfe_sec_voltage_tâ
/home/enverex/src/a828-install/aver/osdep_dvb.c:123: error: field âfeâ has incomplete type
/home/enverex/src/a828-install/aver/osdep_dvb.c:124: error: field âdmxdev_swâ has incomplete type
/home/enverex/src/a828-install/aver/osdep_dvb.c:125: error: field âdemux_swâ has incomplete type
/home/enverex/src/a828-install/aver/osdep_dvb.c:127: error: field âhw_frontendâ has incomplete type
/home/enverex/src/a828-install/aver/osdep_dvb.c:128: error: field âmem_frontendâ has incomplete type
/home/enverex/src/a828-install/aver/osdep_dvb.c:131: error: field âdvbfe_opsâ has incomplete type
/home/enverex/src/a828-install/aver/osdep_dvb.c:149: warning: âstruct dvb_demux_feedâ declared inside parameter list
/home/enverex/src/a828-install/aver/osdep_dvb.c:150: warning: âstruct dvb_demux_feedâ declared inside parameter list
/home/enverex/src/a828-install/aver/osdep_dvb.c:152: warning: âstruct dvb_frontend_parametersâ declared inside parameter list
/home/enverex/src/a828-install/aver/osdep_dvb.c:154: warning: âstruct dvb_frontend_parametersâ declared inside parameter list
/home/enverex/src/a828-install/aver/osdep_dvb.c:155: error: expected declaration specifiers or â...â before âfe_status_tâ
/home/enverex/src/a828-install/aver/osdep_dvb.c:161: warning: âstruct dvb_frontend_tune_settingsâ declared inside parameter list
/home/enverex/src/a828-install/aver/osdep_dvb.c:168: warning: âstruct dvb_diseqc_master_cmdâ declared inside parameter list
/home/enverex/src/a828-install/aver/osdep_dvb.c:169: warning: âstruct dvb_diseqc_slave_replyâ declared inside parameter list
/home/enverex/src/a828-install/aver/osdep_dvb.c:170: error: expected declaration specifiers or â...â before âfe_sec_mini_cmd_tâ
/home/enverex/src/a828-install/aver/osdep_dvb.c:171: error: expected declaration specifiers or â...â before âfe_sec_tone_mode_tâ
/home/enverex/src/a828-install/aver/osdep_dvb.c:172: error: expected declaration specifiers or â...â before âfe_sec_voltage_tâ
/home/enverex/src/a828-install/aver/osdep_dvb.c:220: warning: âstruct dvb_frontend_infoâ declared inside parameter list
/home/enverex/src/a828-install/aver/osdep_dvb.c:221: error: conflicting types for âSysDVBRegisterFrontendâ
/home/enverex/src/a828-install/aver/osdep_dvb.h:98: error: previous declaration of âSysDVBRegisterFrontendâ was here
/home/enverex/src/a828-install/aver/osdep_dvb.c: In function âSysDVBRegisterFrontendâ:
/home/enverex/src/a828-install/aver/osdep_dvb.c:259: error: dereferencing pointer to incomplete type
/home/enverex/src/a828-install/aver/osdep_dvb.c:274: error: âFE_QPSKâ undeclared (first use in this function)
/home/enverex/src/a828-install/aver/osdep_dvb.c:274: error: (Each undeclared identifier is reported only once
/home/enverex/src/a828-install/aver/osdep_dvb.c:274: error: for each function it appears in.)
/home/enverex/src/a828-install/aver/osdep_dvb.c:274: error: dereferencing pointer to incomplete type
/home/enverex/src/a828-install/aver/osdep_dvb.c:306: warning: implicit declaration of function âdvb_register_frontendâ
/home/enverex/src/a828-install/aver/osdep_dvb.c: In function âSysDVBRegisterAdapterâ:
/home/enverex/src/a828-install/aver/osdep_dvb.c:346: error: invalid application of âsizeofâ to incomplete type âstruct dvb_adapterâ
/home/enverex/src/a828-install/aver/osdep_dvb.c:359: warning: implicit declaration of function âdvb_register_adapterâ
/home/enverex/src/a828-install/aver/osdep_dvb.c:359: error: âTHIS_MODULEâ undeclared (first use in this function)
/home/enverex/src/a828-install/aver/osdep_dvb.c:373: error: dereferencing pointer to incomplete type
/home/enverex/src/a828-install/aver/osdep_dvb.c:390: error: invalid application of âsizeofâ to incomplete type âstruct dvb_demuxâ
/home/enverex/src/a828-install/aver/osdep_dvb.c:390: error: invalid application of âsizeofâ to incomplete type âstruct dvb_demuxâ
/home/enverex/src/a828-install/aver/osdep_dvb.c:390: error: invalid application of âsizeofâ to incomplete type âstruct dvb_demuxâ
/home/enverex/src/a828-install/aver/osdep_dvb.c:390: error: invalid application of âsizeofâ to incomplete type âstruct dvb_demuxâ
/home/enverex/src/a828-install/aver/osdep_dvb.c:390: error: invalid application of âsizeofâ to incomplete type âstruct dvb_demuxâ
/home/enverex/src/a828-install/aver/osdep_dvb.c:390: error: invalid application of âsizeofâ to incomplete type âstruct dvb_demuxâ
/home/enverex/src/a828-install/aver/osdep_dvb.c:398: error: âDMX_TS_FILTERINGâ undeclared (first use in this function)
/home/enverex/src/a828-install/aver/osdep_dvb.c:399: error: âDMX_SECTION_FILTERINGâ undeclared (first use in this function)
/home/enverex/src/a828-install/aver/osdep_dvb.c:400: error: âDMX_MEMORY_BASED_FILTERINGâ undeclared (first use in this function)
/home/enverex/src/a828-install/aver/osdep_dvb.c:403: warning: implicit declaration of function âdvb_dmx_initâ
/home/enverex/src/a828-install/aver/osdep_dvb.c:416: warning: implicit declaration of function âdvb_dmxdev_initâ
/home/enverex/src/a828-install/aver/osdep_dvb.c:425: error: âDMX_FRONTEND_0â undeclared (first use in this function)
/home/enverex/src/a828-install/aver/osdep_dvb.c:436: error: âDMX_MEMORY_FEâ undeclared (first use in this function)
/home/enverex/src/a828-install/aver/osdep_dvb.c:464: warning: implicit declaration of function âdvb_dmxdev_releaseâ
/home/enverex/src/a828-install/aver/osdep_dvb.c:466: warning: implicit declaration of function âdvb_dmx_releaseâ
/home/enverex/src/a828-install/aver/osdep_dvb.c:472: warning: implicit declaration of function âdvb_unregister_adapterâ
/home/enverex/src/a828-install/aver/osdep_dvb.c: In function âSysDVBUnRegisterFrontendâ:
/home/enverex/src/a828-install/aver/osdep_dvb.c:489: warning: implicit declaration of function âdvb_unregister_frontendâ
/home/enverex/src/a828-install/aver/osdep_dvb.c: In function âSysDVBFeedTSPacketsâ:
/home/enverex/src/a828-install/aver/osdep_dvb.c:528: warning: implicit declaration of function âdvb_dmx_swfilter_packetsâ
/home/enverex/src/a828-install/aver/osdep_dvb.c: At top level:
/home/enverex/src/a828-install/aver/osdep_dvb.c:545: warning: âstruct dvb_demux_feedâ declared inside parameter list
/home/enverex/src/a828-install/aver/osdep_dvb.c:546: error: conflicting types for âdemux_sw_start_feedâ
/home/enverex/src/a828-install/aver/osdep_dvb.c:149: error: previous declaration of âdemux_sw_start_feedâ was here
/home/enverex/src/a828-install/aver/osdep_dvb.c: In function âdemux_sw_start_feedâ:
/home/enverex/src/a828-install/aver/osdep_dvb.c:547: error: dereferencing pointer to incomplete type
/home/enverex/src/a828-install/aver/osdep_dvb.c:548: error: dereferencing pointer to incomplete type
/home/enverex/src/a828-install/aver/osdep_dvb.c:555: error: dereferencing pointer to incomplete type
/home/enverex/src/a828-install/aver/osdep_dvb.c: At top level:
/home/enverex/src/a828-install/aver/osdep_dvb.c:579: warning: âstruct dvb_demux_feedâ declared inside parameter list
/home/enverex/src/a828-install/aver/osdep_dvb.c:580: error: conflicting types for âdemux_sw_stop_feedâ
/home/enverex/src/a828-install/aver/osdep_dvb.c:150: error: previous declaration of âdemux_sw_stop_feedâ was here
/home/enverex/src/a828-install/aver/osdep_dvb.c: In function âdemux_sw_stop_feedâ:
/home/enverex/src/a828-install/aver/osdep_dvb.c:581: error: dereferencing pointer to incomplete type
/home/enverex/src/a828-install/aver/osdep_dvb.c:582: error: dereferencing pointer to incomplete type
/home/enverex/src/a828-install/aver/osdep_dvb.c: At top level:
/home/enverex/src/a828-install/aver/osdep_dvb.c:603: warning: âstruct dvb_frontend_parametersâ declared inside parameter list
/home/enverex/src/a828-install/aver/osdep_dvb.c:604: error: conflicting types for âdvbfe_set_parametersâ
/home/enverex/src/a828-install/aver/osdep_dvb.c:152: error: previous declaration of âdvbfe_set_parametersâ was here
/home/enverex/src/a828-install/aver/osdep_dvb.c: In function âdvbfe_set_parametersâ:
/home/enverex/src/a828-install/aver/osdep_dvb.c:605: error: dereferencing pointer to incomplete type
/home/enverex/src/a828-install/aver/osdep_dvb.c:607: warning: passing argument 2 of âSetParametersâ from incompatible pointer type
/home/enverex/src/a828-install/aver/osdep_dvb.c: At top level:
/home/enverex/src/a828-install/aver/osdep_dvb.c:611: warning: âstruct dvb_frontend_parametersâ declared inside parameter list
/home/enverex/src/a828-install/aver/osdep_dvb.c:612: error: conflicting types for âdvbfe_get_parametersâ
/home/enverex/src/a828-install/aver/osdep_dvb.c:154: error: previous declaration of âdvbfe_get_parametersâ was here
/home/enverex/src/a828-install/aver/osdep_dvb.c: In function âdvbfe_get_parametersâ:
/home/enverex/src/a828-install/aver/osdep_dvb.c:613: error: dereferencing pointer to incomplete type
/home/enverex/src/a828-install/aver/osdep_dvb.c:615: warning: passing argument 2 of âGetParametersâ from incompatible pointer type
/home/enverex/src/a828-install/aver/osdep_dvb.c: At top level:
/home/enverex/src/a828-install/aver/osdep_dvb.c:618: error: expected declaration specifiers or â...â before âfe_status_tâ
/home/enverex/src/a828-install/aver/osdep_dvb.c: In function âdvbfe_read_statusâ:
/home/enverex/src/a828-install/aver/osdep_dvb.c:620: error: dereferencing pointer to incomplete type
/home/enverex/src/a828-install/aver/osdep_dvb.c:622: error: âstatusâ undeclared (first use in this function)
/home/enverex/src/a828-install/aver/osdep_dvb.c:622: error: too many arguments to function âGetStatusâ
/home/enverex/src/a828-install/aver/osdep_dvb.c: In function âdvbfe_read_berâ:
/home/enverex/src/a828-install/aver/osdep_dvb.c:627: error: dereferencing pointer to incomplete type
/home/enverex/src/a828-install/aver/osdep_dvb.c: In function âdvbfe_read_signal_strengthâ:
/home/enverex/src/a828-install/aver/osdep_dvb.c:634: error: dereferencing pointer to incomplete type
/home/enverex/src/a828-install/aver/osdep_dvb.c: In function âdvbfe_read_snrâ:
/home/enverex/src/a828-install/aver/osdep_dvb.c:641: error: dereferencing pointer to incomplete type
/home/enverex/src/a828-install/aver/osdep_dvb.c: In function âdvbfe_read_ucblocksâ:
/home/enverex/src/a828-install/aver/osdep_dvb.c:648: error: dereferencing pointer to incomplete type
/home/enverex/src/a828-install/aver/osdep_dvb.c: In function âdvbfe_initâ:
/home/enverex/src/a828-install/aver/osdep_dvb.c:655: error: dereferencing pointer to incomplete type
/home/enverex/src/a828-install/aver/osdep_dvb.c: In function âdvbfe_sleepâ:
/home/enverex/src/a828-install/aver/osdep_dvb.c:662: error: dereferencing pointer to incomplete type
/home/enverex/src/a828-install/aver/osdep_dvb.c: At top level:
/home/enverex/src/a828-install/aver/osdep_dvb.c:668: warning: âstruct dvb_frontend_tune_settingsâ declared inside parameter list
/home/enverex/src/a828-install/aver/osdep_dvb.c:669: error: conflicting types for âdvbfe_get_tune_settingsâ
/home/enverex/src/a828-install/aver/osdep_dvb.c:161: error: previous declaration of âdvbfe_get_tune_settingsâ was here
/home/enverex/src/a828-install/aver/osdep_dvb.c: In function âdvbfe_get_tune_settingsâ:
/home/enverex/src/a828-install/aver/osdep_dvb.c:671: error: dereferencing pointer to incomplete type
/home/enverex/src/a828-install/aver/osdep_dvb.c:672: error: dereferencing pointer to incomplete type
/home/enverex/src/a828-install/aver/osdep_dvb.c:673: error: dereferencing pointer to incomplete type
/home/enverex/src/a828-install/aver/osdep_dvb.c: In function âdvbfe_diseqc_reset_overloadâ:
/home/enverex/src/a828-install/aver/osdep_dvb.c:682: error: dereferencing pointer to incomplete type
/home/enverex/src/a828-install/aver/osdep_dvb.c: At top level:
/home/enverex/src/a828-install/aver/osdep_dvb.c:687: warning: âstruct dvb_diseqc_master_cmdâ declared inside parameter list
/home/enverex/src/a828-install/aver/osdep_dvb.c:688: error: conflicting types for âdvbfe_diseqc_send_master_cmdâ
/home/enverex/src/a828-install/aver/osdep_dvb.c:168: error: previous declaration of âdvbfe_diseqc_send_master_cmdâ was here
/home/enverex/src/a828-install/aver/osdep_dvb.c: In function âdvbfe_diseqc_send_master_cmdâ:
/home/enverex/src/a828-install/aver/osdep_dvb.c:689: error: dereferencing pointer to incomplete type
/home/enverex/src/a828-install/aver/osdep_dvb.c:691: warning: passing argument 2 of âDiseqcSendMasterCMDâ from incompatible pointer type
/home/enverex/src/a828-install/aver/osdep_dvb.c: At top level:
/home/enverex/src/a828-install/aver/osdep_dvb.c:694: warning: âstruct dvb_diseqc_slave_replyâ declared inside parameter list
/home/enverex/src/a828-install/aver/osdep_dvb.c:695: error: conflicting types for âdvbfe_diseqc_recv_slave_replyâ
/home/enverex/src/a828-install/aver/osdep_dvb.c:169: error: previous declaration of âdvbfe_diseqc_recv_slave_replyâ was here
/home/enverex/src/a828-install/aver/osdep_dvb.c: In function âdvbfe_diseqc_recv_slave_replyâ:
/home/enverex/src/a828-install/aver/osdep_dvb.c:696: error: dereferencing pointer to incomplete type
/home/enverex/src/a828-install/aver/osdep_dvb.c:698: warning: passing argument 2 of âDiseqcRecvSlaveReplyâ from incompatible pointer type
/home/enverex/src/a828-install/aver/osdep_dvb.c: At top level:
/home/enverex/src/a828-install/aver/osdep_dvb.c:701: error: expected declaration specifiers or â...â before âfe_sec_mini_cmd_tâ
/home/enverex/src/a828-install/aver/osdep_dvb.c: In function âdvbfe_diseqc_send_burstâ:
/home/enverex/src/a828-install/aver/osdep_dvb.c:703: error: dereferencing pointer to incomplete type
/home/enverex/src/a828-install/aver/osdep_dvb.c:705: error: âargâ undeclared (first use in this function)
/home/enverex/src/a828-install/aver/osdep_dvb.c:705: error: too many arguments to function âDiseqcSendBurstâ
/home/enverex/src/a828-install/aver/osdep_dvb.c: At top level:
/home/enverex/src/a828-install/aver/osdep_dvb.c:708: error: expected declaration specifiers or â...â before âfe_sec_tone_mode_tâ
/home/enverex/src/a828-install/aver/osdep_dvb.c: In function âdvbfe_set_toneâ:
/home/enverex/src/a828-install/aver/osdep_dvb.c:710: error: dereferencing pointer to incomplete type
/home/enverex/src/a828-install/aver/osdep_dvb.c:712: error: âargâ undeclared (first use in this function)
/home/enverex/src/a828-install/aver/osdep_dvb.c:712: error: too many arguments to function âSetToneâ
/home/enverex/src/a828-install/aver/osdep_dvb.c: At top level:
/home/enverex/src/a828-install/aver/osdep_dvb.c:715: error: expected declaration specifiers or â...â before âfe_sec_voltage_tâ
/home/enverex/src/a828-install/aver/osdep_dvb.c: In function âdvbfe_set_voltageâ:
/home/enverex/src/a828-install/aver/osdep_dvb.c:717: error: dereferencing pointer to incomplete type
/home/enverex/src/a828-install/aver/osdep_dvb.c:719: error: âargâ undeclared (first use in this function)
/home/enverex/src/a828-install/aver/osdep_dvb.c:719: error: too many arguments to function âSetVoltageâ
/home/enverex/src/a828-install/aver/osdep_dvb.c: In function âdvbfe_enable_high_lnb_voltageâ:
/home/enverex/src/a828-install/aver/osdep_dvb.c:728: error: dereferencing pointer to incomplete type
make[3]: *** [/home/enverex/src/a828-install/aver/osdep_dvb.o] Error 1
make[2]: *** [_module_/home/enverex/src/a828-install] Error 2
make[1]: *** [_all] Error 2
make[1]: Leaving directory `/usr/src/linux-headers-2.6.17-10-generic'
make: *** [default] Error 2