-- Found Qt-Version 4.2.3
-- Found X11: /usr/lib/libX11.so
-- Found KDE4 include dir: /home/kde-devel/kde/include
-- Found KDE4 library dir: /home/kde-devel/kde/lib
-- Found KDE4 kconfig_compiler preprocessor: /home/kde-devel/kde/bin/kconfig_compiler
-- Could NOT find QCA2 includes in
-- Could not find QCA2 libraries in
-- /home/kde-devel/src/KDE/kdeaddons/kicker-applets: skipped subdir mediacontrol
-- remember to readd sidebar
-- Port when noatun will port
-- Configuring done
-- Generating done
-- Build files have been written to: /home/kde-devel/build/KDE/kdeaddons
makeobj[0]: Entering directory `/home/kde-devel/build/KDE/kdeaddons'
/usr/bin/cmake -H/home/kde-devel/src/KDE/kdeaddons -B/home/kde-devel/build/KDE/kdeaddons --check-build-system CMakeFiles/Makefile.cmake 0
/usr/bin/cmake -E cmake_progress_start /home/kde-devel/build/KDE/kdeaddons/CMakeFiles 100
/usr/bin/make -f CMakeFiles/Makefile2 all
make[1]: Entering directory `/home/kde-devel/build/KDE/kdeaddons'
/usr/bin/make -f atlantikdesigner/designer/CMakeFiles/atlantikdesigner.dir/build.make atlantikdesigner/designer/CMakeFiles/atlantikdesigner.dir/depend
make[2]: Entering directory `/home/kde-devel/build/KDE/kdeaddons'
make[2]: Nothing to be done for `atlantikdesigner/designer/CMakeFiles/atlantikdesigner.dir/depend'.
make[2]: Leaving directory `/home/kde-devel/build/KDE/kdeaddons'
/usr/bin/make -f atlantikdesigner/designer/CMakeFiles/atlantikdesigner.dir/build.make atlantikdesigner/designer/CMakeFiles/atlantikdesigner.dir/build
make[2]: Entering directory `/home/kde-devel/build/KDE/kdeaddons'
make[2]: Nothing to be done for `atlantikdesigner/designer/CMakeFiles/atlantikdesigner.dir/build'.
make[2]: Leaving directory `/home/kde-devel/build/KDE/kdeaddons'
/usr/bin/cmake -E cmake_progress_report /home/kde-devel/build/KDE/kdeaddons/CMakeFiles 1 2 3 4 5
[ 5%] Built target atlantikdesigner
/usr/bin/make -f doc/kicker-applets/CMakeFiles/handbook.dir/build.make doc/kicker-applets/CMakeFiles/handbook.dir/build
make[2]: Entering directory `/home/kde-devel/build/KDE/kdeaddons'
make[2]: Nothing to be done for `doc/kicker-applets/CMakeFiles/handbook.dir/build'.
make[2]: Leaving directory `/home/kde-devel/build/KDE/kdeaddons'
/usr/bin/cmake -E cmake_progress_report /home/kde-devel/build/KDE/kdeaddons/CMakeFiles 6
[ 6%] Built target handbook
/usr/bin/make -f doc/konq-plugins/CMakeFiles/handbook.dir/build.make doc/konq-plugins/CMakeFiles/handbook.dir/build
make[2]: Entering directory `/home/kde-devel/build/KDE/kdeaddons'
make[2]: Nothing to be done for `doc/konq-plugins/CMakeFiles/handbook.dir/build'.
make[2]: Leaving directory `/home/kde-devel/build/KDE/kdeaddons'
/usr/bin/cmake -E cmake_progress_report /home/kde-devel/build/KDE/kdeaddons/CMakeFiles 7
[ 7%] Built target handbook
/usr/bin/make -f doc/konq-plugins/babel/CMakeFiles/handbook.dir/build.make doc/konq-plugins/babel/CMakeFiles/handbook.dir/build
make[2]: Entering directory `/home/kde-devel/build/KDE/kdeaddons'
make[2]: Nothing to be done for `doc/konq-plugins/babel/CMakeFiles/handbook.dir/build'.
make[2]: Leaving directory `/home/kde-devel/build/KDE/kdeaddons'
/usr/bin/cmake -E cmake_progress_report /home/kde-devel/build/KDE/kdeaddons/CMakeFiles
[ 7%] Built target handbook
/usr/bin/make -f doc/konq-plugins/crashes/CMakeFiles/handbook.dir/build.make doc/konq-plugins/crashes/CMakeFiles/handbook.dir/build
make[2]: Entering directory `/home/kde-devel/build/KDE/kdeaddons'
make[2]: Nothing to be done for `doc/konq-plugins/crashes/CMakeFiles/handbook.dir/build'.
make[2]: Leaving directory `/home/kde-devel/build/KDE/kdeaddons'
/usr/bin/cmake -E cmake_progress_report /home/kde-devel/build/KDE/kdeaddons/CMakeFiles 8
[ 8%] Built target handbook
/usr/bin/make -f doc/konq-plugins/dirfilter/CMakeFiles/handbook.dir/build.make doc/konq-plugins/dirfilter/CMakeFiles/handbook.dir/build
make[2]: Entering directory `/home/kde-devel/build/KDE/kdeaddons'
make[2]: Nothing to be done for `doc/konq-plugins/dirfilter/CMakeFiles/handbook.dir/build'.
make[2]: Leaving directory `/home/kde-devel/build/KDE/kdeaddons'
/usr/bin/cmake -E cmake_progress_report /home/kde-devel/build/KDE/kdeaddons/CMakeFiles 9
[ 9%] Built target handbook
/usr/bin/make -f doc/konq-plugins/domtreeviewer/CMakeFiles/handbook.dir/build.make doc/konq-plugins/domtreeviewer/CMakeFiles/handbook.dir/build
make[2]: Entering directory `/home/kde-devel/build/KDE/kdeaddons'
make[2]: Nothing to be done for `doc/konq-plugins/domtreeviewer/CMakeFiles/handbook.dir/build'.
make[2]: Leaving directory `/home/kde-devel/build/KDE/kdeaddons'
/usr/bin/cmake -E cmake_progress_report /home/kde-devel/build/KDE/kdeaddons/CMakeFiles
[ 9%] Built target handbook
/usr/bin/make -f doc/konq-plugins/fsview/CMakeFiles/handbook.dir/build.make doc/konq-plugins/fsview/CMakeFiles/handbook.dir/build
make[2]: Entering directory `/home/kde-devel/build/KDE/kdeaddons'
make[2]: Nothing to be done for `doc/konq-plugins/fsview/CMakeFiles/handbook.dir/build'.
make[2]: Leaving directory `/home/kde-devel/build/KDE/kdeaddons'
/usr/bin/cmake -E cmake_progress_report /home/kde-devel/build/KDE/kdeaddons/CMakeFiles 10
[ 10%] Built target handbook
/usr/bin/make -f doc/konq-plugins/imgallery/CMakeFiles/handbook.dir/build.make doc/konq-plugins/imgallery/CMakeFiles/handbook.dir/build
make[2]: Entering directory `/home/kde-devel/build/KDE/kdeaddons'
make[2]: Nothing to be done for `doc/konq-plugins/imgallery/CMakeFiles/handbook.dir/build'.
make[2]: Leaving directory `/home/kde-devel/build/KDE/kdeaddons'
/usr/bin/cmake -E cmake_progress_report /home/kde-devel/build/KDE/kdeaddons/CMakeFiles 11
[ 11%] Built target handbook
/usr/bin/make -f doc/konq-plugins/khtmlsettings/CMakeFiles/handbook.dir/build.make doc/konq-plugins/khtmlsettings/CMakeFiles/handbook.dir/build
make[2]: Entering directory `/home/kde-devel/build/KDE/kdeaddons'
make[2]: Nothing to be done for `doc/konq-plugins/khtmlsettings/CMakeFiles/handbook.dir/build'.
make[2]: Leaving directory `/home/kde-devel/build/KDE/kdeaddons'
/usr/bin/cmake -E cmake_progress_report /home/kde-devel/build/KDE/kdeaddons/CMakeFiles
[ 11%] Built target handbook
/usr/bin/make -f doc/konq-plugins/mediaplayer/CMakeFiles/handbook.dir/build.make doc/konq-plugins/mediaplayer/CMakeFiles/handbook.dir/build
make[2]: Entering directory `/home/kde-devel/build/KDE/kdeaddons'
make[2]: Nothing to be done for `doc/konq-plugins/mediaplayer/CMakeFiles/handbook.dir/build'.
make[2]: Leaving directory `/home/kde-devel/build/KDE/kdeaddons'
/usr/bin/cmake -E cmake_progress_report /home/kde-devel/build/KDE/kdeaddons/CMakeFiles 12
[ 12%] Built target handbook
/usr/bin/make -f doc/konq-plugins/uachanger/CMakeFiles/handbook.dir/build.make doc/konq-plugins/uachanger/CMakeFiles/handbook.dir/build
make[2]: Entering directory `/home/kde-devel/build/KDE/kdeaddons'
make[2]: Nothing to be done for `doc/konq-plugins/uachanger/CMakeFiles/handbook.dir/build'.
make[2]: Leaving directory `/home/kde-devel/build/KDE/kdeaddons'
/usr/bin/cmake -E cmake_progress_report /home/kde-devel/build/KDE/kdeaddons/CMakeFiles
[ 12%] Built target handbook
/usr/bin/make -f doc/konq-plugins/validators/CMakeFiles/handbook.dir/build.make doc/konq-plugins/validators/CMakeFiles/handbook.dir/build
make[2]: Entering directory `/home/kde-devel/build/KDE/kdeaddons'
make[2]: Nothing to be done for `doc/konq-plugins/validators/CMakeFiles/handbook.dir/build'.
make[2]: Leaving directory `/home/kde-devel/build/KDE/kdeaddons'
/usr/bin/cmake -E cmake_progress_report /home/kde-devel/build/KDE/kdeaddons/CMakeFiles 13
[ 13%] Built target handbook
/usr/bin/make -f doc/konq-plugins/webarchiver/CMakeFiles/handbook.dir/build.make doc/konq-plugins/webarchiver/CMakeFiles/handbook.dir/build
make[2]: Entering directory `/home/kde-devel/build/KDE/kdeaddons'
make[2]: Nothing to be done for `doc/konq-plugins/webarchiver/CMakeFiles/handbook.dir/build'.
make[2]: Leaving directory `/home/kde-devel/build/KDE/kdeaddons'
/usr/bin/cmake -E cmake_progress_report /home/kde-devel/build/KDE/kdeaddons/CMakeFiles 14
[ 14%] Built target handbook
/usr/bin/make -f doc/ksig/CMakeFiles/handbook.dir/build.make doc/ksig/CMakeFiles/handbook.dir/build
make[2]: Entering directory `/home/kde-devel/build/KDE/kdeaddons'
make[2]: Nothing to be done for `doc/ksig/CMakeFiles/handbook.dir/build'.
make[2]: Leaving directory `/home/kde-devel/build/KDE/kdeaddons'
/usr/bin/cmake -E cmake_progress_report /home/kde-devel/build/KDE/kdeaddons/CMakeFiles
[ 14%] Built target handbook
/usr/bin/make -f kfile-plugins/txt/CMakeFiles/kfile_txt.dir/build.make kfile-plugins/txt/CMakeFiles/kfile_txt.dir/depend
make[2]: Entering directory `/home/kde-devel/build/KDE/kdeaddons'
make[2]: Nothing to be done for `kfile-plugins/txt/CMakeFiles/kfile_txt.dir/depend'.
make[2]: Leaving directory `/home/kde-devel/build/KDE/kdeaddons'
/usr/bin/make -f kfile-plugins/txt/CMakeFiles/kfile_txt.dir/build.make kfile-plugins/txt/CMakeFiles/kfile_txt.dir/build
make[2]: Entering directory `/home/kde-devel/build/KDE/kdeaddons'
/usr/bin/cmake -E cmake_progress_report /home/kde-devel/build/KDE/kdeaddons/CMakeFiles 15
[ 15%] Building CXX object kfile-plugins/txt/CMakeFiles/kfile_txt.dir/kfile_txt.o
/usr/bin/c++ -Dkfile_txt_EXPORTS -Wnon-virtual-dtor -Wno-long-long -ansi -Wundef -Wcast-align -Wchar-subscripts -Wall -W -Wpointer-arith -Wformat-security -fno-exceptions -fno-check-new -fno-common -fno-threadsafe-statics -fvisibility=hidden -g3 -fno-inline -fPIC -I/home/kde-devel/build/KDE/kdeaddons/kfile-plugins/txt -I/home/kde-devel/src/KDE/kdeaddons/kfile-plugins/txt -I/home/kde-devel/src/KDE/kdeaddons -I/home/kde-devel/build/KDE/kdeaddons -I/home/kde-devel/qt-copy/include -I/home/kde-devel/qt-copy/include/Qt -I/home/kde-devel/qt-copy/mkspecs/default -I/home/kde-devel/qt-copy/include/QtCore -I/home/kde-devel/qt-copy/include/QtGui -I/home/kde-devel/qt-copy/include/Qt3Support -I/home/kde-devel/qt-copy/include/QtAssistant -I/home/kde-devel/qt-copy/include/QtDesigner -I/home/kde-devel/qt-copy/include/QtNetwork -I/home/kde-devel/qt-copy/include/QtOpenGL -I/home/kde-devel/qt-copy/include/QtSql -I/home/kde-devel/qt-copy/include/QtXml -I/home/kde-devel/qt-copy/include/QtSvg -I/home/kde-devel/qt-copy/include/QtUiTools -I/home/kde-devel/qt-copy/include/QtTest -I/home/kde-devel/qt-copy/include/QtDBus -I/home/kde-devel/kde/include -I/home/kde-devel/kde/include/KDE -I/usr/local/include -D_BSD_SOURCE -DQT3_SUPPORT -DQT3_SUPPORT_WARNINGS -D_XOPEN_SOURCE=500 -D_BSD_SOURCE -D_GNU_SOURCE -DQT_NO_STL -DQT_NO_CAST_TO_ASCII -D_REENTRANT -DKDE_DEPRECATED_WARNINGS -o kfile-plugins/txt/CMakeFiles/kfile_txt.dir/kfile_txt.o -c /home/kde-devel/src/KDE/kdeaddons/kfile-plugins/txt/kfile_txt.cpp
/home/kde-devel/src/KDE/kdeaddons/kfile-plugins/txt/kfile_txt.h:28: error: expected class-name before { token
/home/kde-devel/src/KDE/kdeaddons/kfile-plugins/txt/kfile_txt.h:28: warning: class KTxtPlugin has virtual functions but non-virtual destructor
/home/kde-devel/src/KDE/kdeaddons/kfile-plugins/txt/kfile_txt.cpp: In constructor KTxtPlugin::KTxtPlugin(QObject*, const QStringList&):
/home/kde-devel/src/KDE/kdeaddons/kfile-plugins/txt/kfile_txt.cpp:34: error: class KTxtPlugin does not have any field named KFilePlugin
/home/kde-devel/src/KDE/kdeaddons/kfile-plugins/txt/kfile_txt.cpp: In member function void KTxtPlugin::makeMimeTypeInfo(const QString&):
/home/kde-devel/src/KDE/kdeaddons/kfile-plugins/txt/kfile_txt.cpp:42: error: KFileMimeTypeInfo was not declared in this scope
/home/kde-devel/src/KDE/kdeaddons/kfile-plugins/txt/kfile_txt.cpp:42: error: info was not declared in this scope
/home/kde-devel/src/KDE/kdeaddons/kfile-plugins/txt/kfile_txt.cpp:42: error: addMimeTypeInfo was not declared in this scope
/home/kde-devel/src/KDE/kdeaddons/kfile-plugins/txt/kfile_txt.cpp:44: error: KFileMimeTypeInfo is not a class or namespace
/home/kde-devel/src/KDE/kdeaddons/kfile-plugins/txt/kfile_txt.cpp:44: error: group was not declared in this scope
/home/kde-devel/src/KDE/kdeaddons/kfile-plugins/txt/kfile_txt.cpp:45: error: addGroupInfo was not declared in this scope
/home/kde-devel/src/KDE/kdeaddons/kfile-plugins/txt/kfile_txt.cpp:47: error: KFileMimeTypeInfo is not a class or namespace
/home/kde-devel/src/KDE/kdeaddons/kfile-plugins/txt/kfile_txt.cpp:47: error: item was not declared in this scope
/home/kde-devel/src/KDE/kdeaddons/kfile-plugins/txt/kfile_txt.cpp:48: error: addItemInfo was not declared in this scope
/home/kde-devel/src/KDE/kdeaddons/kfile-plugins/txt/kfile_txt.cpp:49: error: KFileMimeTypeInfo is not a class or namespace
/home/kde-devel/src/KDE/kdeaddons/kfile-plugins/txt/kfile_txt.cpp:49: error: setAttributes was not declared in this scope
/home/kde-devel/src/KDE/kdeaddons/kfile-plugins/txt/kfile_txt.cpp:51: error: KFileMimeTypeInfo is not a class or namespace
/home/kde-devel/src/KDE/kdeaddons/kfile-plugins/txt/kfile_txt.cpp:53: error: KFileMimeTypeInfo is not a class or namespace
/home/kde-devel/src/KDE/kdeaddons/kfile-plugins/txt/kfile_txt.cpp: In member function virtual bool KTxtPlugin::readInfo(KFileMetaInfo&, uint):
/home/kde-devel/src/KDE/kdeaddons/kfile-plugins/txt/kfile_txt.cpp:59: error: class KFileMetaInfo has no member named path
/home/kde-devel/src/KDE/kdeaddons/kfile-plugins/txt/kfile_txt.cpp:62: error: class KFileMetaInfo has no member named path
/home/kde-devel/src/KDE/kdeaddons/kfile-plugins/txt/kfile_txt.cpp:118: error: appendGroup was not declared in this scope
/home/kde-devel/src/KDE/kdeaddons/kfile-plugins/txt/kfile_txt.cpp:121: error: appendItem was not declared in this scope
/home/kde-devel/src/KDE/kdeaddons/kfile-plugins/txt/kfile_txt.cpp:124: error: appendItem was not declared in this scope
/home/kde-devel/build/KDE/kdeaddons/kfile-plugins/txt/kfile_txt.moc: At global scope:
/home/kde-devel/build/KDE/kdeaddons/kfile-plugins/txt/kfile_txt.moc:37: error: KFilePlugin has not been declared
/home/kde-devel/build/KDE/kdeaddons/kfile-plugins/txt/kfile_txt.moc: In member function virtual void* KTxtPlugin::qt_metacast(const char*):
/home/kde-devel/build/KDE/kdeaddons/kfile-plugins/txt/kfile_txt.moc:51: error: KFilePlugin has not been declared
/home/kde-devel/build/KDE/kdeaddons/kfile-plugins/txt/kfile_txt.moc: In member function virtual int KTxtPlugin::qt_metacall(QMetaObject::Call, int, void**):
/home/kde-devel/build/KDE/kdeaddons/kfile-plugins/txt/kfile_txt.moc:56: error: KFilePlugin has not been declared
/home/kde-devel/kde/include/kgenericfactory.h: In member function QObject* KGenericFactory<Product, ParentType>::createObject(QObject*, const char*, const QStringList&) [with Product = KTxtPlugin, ParentType = QObject]:
/home/kde-devel/build/KDE/kdeaddons/kfile-plugins/txt/kfile_txt.moc:59: instantiated from here
/home/kde-devel/kde/include/kgenericfactory.h:197: error: cannot convert KTxtPlugin* to QObject* in return
make[2]: *** [kfile-plugins/txt/CMakeFiles/kfile_txt.dir/kfile_txt.o] Error 1
make[2]: Leaving directory `/home/kde-devel/build/KDE/kdeaddons'
make[1]: *** [kfile-plugins/txt/CMakeFiles/kfile_txt.dir/all] Error 2
make[1]: Leaving directory `/home/kde-devel/build/KDE/kdeaddons'
make: *** [all] Error 2
makeobj[0]: Leaving directory `/home/kde-devel/build/KDE/kdeaddons'