root@vamitrou-desktop:/home/vamitrou/Desktop/2.3.3-E4-B2# make
make -C driver
make[1]: Entering directory `/home/vamitrou/Desktop/2.3.3-E4-B2/driver'
if test ! -f .depend ; then make dep ; exit 0 ; fi
cc -DLINUX -D__KERNEL__ -DMODULE -I/lib/modules/2.6.20.1/build/include '-DEAGLEUSBVERSION="2.3.3_E4_B2"' -Wall -Wstrict-prototypes -fomit-frame-pointer -fno-strict-aliasing -pipe -mpreferred-stack-boundary=2 -DUSE_CMVS -O2 -c -o eu_main.o eu_main.c
In file included from eu_main.c:34:
Adiutil.h:39:26: error: linux/config.h: No such file or directory
In file included from /lib/modules/2.6.20.1/build/include/asm/thread_info.h:16,
from /lib/modules/2.6.20.1/build/include/linux/thread_info.h:21,
from /lib/modules/2.6.20.1/build/include/linux/preempt.h:9,
from /lib/modules/2.6.20.1/build/include/linux/spinlock.h:49,
from /lib/modules/2.6.20.1/build/include/linux/mmzone.h:7,
from /lib/modules/2.6.20.1/build/include/linux/gfp.h:4,
from /lib/modules/2.6.20.1/build/include/linux/slab.h:14,
from Adiutil.h:51,
from eu_main.c:34:
/lib/modules/2.6.20.1/build/include/asm/processor.h:82: error: CONFIG_X86_L1_CACHE_SHIFT undeclared here (not in a function)
/lib/modules/2.6.20.1/build/include/asm/processor.h:82: error: requested alignment is not a constant
/lib/modules/2.6.20.1/build/include/asm/processor.h: In function cpuid_count:
/lib/modules/2.6.20.1/build/include/asm/processor.h:611: warning: pointer targets in passing argument 1 of native_cpuid differ in signedness
/lib/modules/2.6.20.1/build/include/asm/processor.h:611: warning: pointer targets in passing argument 2 of native_cpuid differ in signedness
/lib/modules/2.6.20.1/build/include/asm/processor.h:611: warning: pointer targets in passing argument 3 of native_cpuid differ in signedness
/lib/modules/2.6.20.1/build/include/asm/processor.h:611: warning: pointer targets in passing argument 4 of native_cpuid differ in signedness
In file included from /lib/modules/2.6.20.1/build/include/linux/sched.h:51,
from /lib/modules/2.6.20.1/build/include/asm/irq.h:13,
from /lib/modules/2.6.20.1/build/include/linux/irq.h:22,
from /lib/modules/2.6.20.1/build/include/asm/hardirq.h:5,
from /lib/modules/2.6.20.1/build/include/linux/hardirq.h:7,
from /lib/modules/2.6.20.1/build/include/linux/interrupt.h:11,
from /lib/modules/2.6.20.1/build/include/linux/usb.h:15,
from Adiutil.h:53,
from eu_main.c:34:
/lib/modules/2.6.20.1/build/include/linux/jiffies.h:33:3: error: #error You lose.
/lib/modules/2.6.20.1/build/include/linux/jiffies.h:225:31: error: division by zero in #if
/lib/modules/2.6.20.1/build/include/linux/jiffies.h:225:31: error: division by zero in #if
/lib/modules/2.6.20.1/build/include/linux/jiffies.h:225:31: error: division by zero in #if
/lib/modules/2.6.20.1/build/include/linux/jiffies.h:225:31: error: division by zero in #if
/lib/modules/2.6.20.1/build/include/linux/jiffies.h:225:31: error: division by zero in #if
/lib/modules/2.6.20.1/build/include/linux/jiffies.h:225:31: error: division by zero in #if
/lib/modules/2.6.20.1/build/include/linux/jiffies.h:225:31: error: division by zero in #if
/lib/modules/2.6.20.1/build/include/linux/jiffies.h:225:31: error: division by zero in #if
/lib/modules/2.6.20.1/build/include/linux/jiffies.h:225:31: error: division by zero in #if
/lib/modules/2.6.20.1/build/include/linux/jiffies.h:225:31: error: division by zero in #if
/lib/modules/2.6.20.1/build/include/linux/jiffies.h:225:31: error: division by zero in #if
/lib/modules/2.6.20.1/build/include/linux/jiffies.h:225:31: error: division by zero in #if
/lib/modules/2.6.20.1/build/include/linux/jiffies.h:225:31: error: division by zero in #if
/lib/modules/2.6.20.1/build/include/linux/jiffies.h:225:31: error: division by zero in #if
/lib/modules/2.6.20.1/build/include/linux/jiffies.h:225:31: error: division by zero in #if
/lib/modules/2.6.20.1/build/include/linux/jiffies.h:225:31: error: division by zero in #if
/lib/modules/2.6.20.1/build/include/linux/jiffies.h:269:46: error: division by zero in #if
In file included from /lib/modules/2.6.20.1/build/include/linux/sched.h:51,
from /lib/modules/2.6.20.1/build/include/asm/irq.h:13,
from /lib/modules/2.6.20.1/build/include/linux/irq.h:22,
from /lib/modules/2.6.20.1/build/include/asm/hardirq.h:5,
from /lib/modules/2.6.20.1/build/include/linux/hardirq.h:7,
from /lib/modules/2.6.20.1/build/include/linux/interrupt.h:11,
from /lib/modules/2.6.20.1/build/include/linux/usb.h:15,
from Adiutil.h:53,
from eu_main.c:34:
/lib/modules/2.6.20.1/build/include/linux/jiffies.h: In function jiffies_to_msecs:
/lib/modules/2.6.20.1/build/include/linux/jiffies.h:274: error: CONFIG_HZ undeclared (first use in this function)
/lib/modules/2.6.20.1/build/include/linux/jiffies.h:274: error: (Each undeclared identifier is reported only once
/lib/modules/2.6.20.1/build/include/linux/jiffies.h:274: error: for each function it appears in.)
/lib/modules/2.6.20.1/build/include/linux/jiffies.h:280:46: error: division by zero in #if
/lib/modules/2.6.20.1/build/include/linux/jiffies.h: In function jiffies_to_usecs:
/lib/modules/2.6.20.1/build/include/linux/jiffies.h:285: error: CONFIG_HZ undeclared (first use in this function)
/lib/modules/2.6.20.1/build/include/linux/jiffies.h:293:46: error: division by zero in #if
/lib/modules/2.6.20.1/build/include/linux/jiffies.h: In function msecs_to_jiffies:
/lib/modules/2.6.20.1/build/include/linux/jiffies.h:298: error: CONFIG_HZ undeclared (first use in this function)
/lib/modules/2.6.20.1/build/include/linux/jiffies.h:306:46: error: division by zero in #if
/lib/modules/2.6.20.1/build/include/linux/jiffies.h: In function usecs_to_jiffies:
/lib/modules/2.6.20.1/build/include/linux/jiffies.h:311: error: CONFIG_HZ undeclared (first use in this function)
/lib/modules/2.6.20.1/build/include/linux/jiffies.h: In function timespec_to_jiffies:
/lib/modules/2.6.20.1/build/include/linux/jiffies.h:330: error: CONFIG_HZ undeclared (first use in this function)
/lib/modules/2.6.20.1/build/include/linux/jiffies.h:336: error: SHIFT_HZ undeclared (first use in this function)
/lib/modules/2.6.20.1/build/include/linux/jiffies.h: In function jiffies_to_timespec:
/lib/modules/2.6.20.1/build/include/linux/jiffies.h:349: error: CONFIG_HZ undeclared (first use in this function)
/lib/modules/2.6.20.1/build/include/linux/jiffies.h: In function timeval_to_jiffies:
/lib/modules/2.6.20.1/build/include/linux/jiffies.h:371: error: CONFIG_HZ undeclared (first use in this function)
/lib/modules/2.6.20.1/build/include/linux/jiffies.h:375: error: SHIFT_HZ undeclared (first use in this function)
/lib/modules/2.6.20.1/build/include/linux/jiffies.h: In function jiffies_to_timeval:
/lib/modules/2.6.20.1/build/include/linux/jiffies.h:387: error: CONFIG_HZ undeclared (first use in this function)
/lib/modules/2.6.20.1/build/include/linux/jiffies.h:400:6: error: division by zero in #if
/lib/modules/2.6.20.1/build/include/linux/jiffies.h:400:6: error: division by zero in #if
/lib/modules/2.6.20.1/build/include/linux/jiffies.h:400:6: error: division by zero in #if
/lib/modules/2.6.20.1/build/include/linux/jiffies.h:400:6: error: division by zero in #if
/lib/modules/2.6.20.1/build/include/linux/jiffies.h:400:6: error: division by zero in #if
/lib/modules/2.6.20.1/build/include/linux/jiffies.h:400:6: error: division by zero in #if
/lib/modules/2.6.20.1/build/include/linux/jiffies.h:400:6: error: division by zero in #if
/lib/modules/2.6.20.1/build/include/linux/jiffies.h:400:6: error: division by zero in #if
/lib/modules/2.6.20.1/build/include/linux/jiffies.h:400:6: error: division by zero in #if
/lib/modules/2.6.20.1/build/include/linux/jiffies.h:400:6: error: division by zero in #if
/lib/modules/2.6.20.1/build/include/linux/jiffies.h:400:6: error: division by zero in #if
/lib/modules/2.6.20.1/build/include/linux/jiffies.h:400:6: error: division by zero in #if
/lib/modules/2.6.20.1/build/include/linux/jiffies.h:400:6: error: division by zero in #if
/lib/modules/2.6.20.1/build/include/linux/jiffies.h:400:6: error: division by zero in #if
/lib/modules/2.6.20.1/build/include/linux/jiffies.h:400:6: error: division by zero in #if
/lib/modules/2.6.20.1/build/include/linux/jiffies.h:400:6: error: division by zero in #if
/lib/modules/2.6.20.1/build/include/linux/jiffies.h: In function jiffies_to_clock_t:
/lib/modules/2.6.20.1/build/include/linux/jiffies.h:401: error: CONFIG_HZ undeclared (first use in this function)
/lib/modules/2.6.20.1/build/include/linux/jiffies.h: In function clock_t_to_jiffies:
/lib/modules/2.6.20.1/build/include/linux/jiffies.h:412: error: CONFIG_HZ undeclared (first use in this function)
/lib/modules/2.6.20.1/build/include/linux/jiffies.h:431:6: error: division by zero in #if
/lib/modules/2.6.20.1/build/include/linux/jiffies.h:431:6: error: division by zero in #if
/lib/modules/2.6.20.1/build/include/linux/jiffies.h:431:6: error: division by zero in #if
/lib/modules/2.6.20.1/build/include/linux/jiffies.h:431:6: error: division by zero in #if
/lib/modules/2.6.20.1/build/include/linux/jiffies.h:431:6: error: division by zero in #if
/lib/modules/2.6.20.1/build/include/linux/jiffies.h:431:6: error: division by zero in #if
/lib/modules/2.6.20.1/build/include/linux/jiffies.h:431:6: error: division by zero in #if
/lib/modules/2.6.20.1/build/include/linux/jiffies.h:431:6: error: division by zero in #if
/lib/modules/2.6.20.1/build/include/linux/jiffies.h:431:6: error: division by zero in #if
/lib/modules/2.6.20.1/build/include/linux/jiffies.h:431:6: error: division by zero in #if
/lib/modules/2.6.20.1/build/include/linux/jiffies.h:431:6: error: division by zero in #if
/lib/modules/2.6.20.1/build/include/linux/jiffies.h:431:6: error: division by zero in #if
/lib/modules/2.6.20.1/build/include/linux/jiffies.h:431:6: error: division by zero in #if
/lib/modules/2.6.20.1/build/include/linux/jiffies.h:431:6: error: division by zero in #if
/lib/modules/2.6.20.1/build/include/linux/jiffies.h:431:6: error: division by zero in #if
/lib/modules/2.6.20.1/build/include/linux/jiffies.h:431:6: error: division by zero in #if
/lib/modules/2.6.20.1/build/include/linux/jiffies.h: In function jiffies_64_to_clock_t:
/lib/modules/2.6.20.1/build/include/linux/jiffies.h:432: error: CONFIG_HZ undeclared (first use in this function)
In file included from /lib/modules/2.6.20.1/build/include/asm/irq.h:13,
from /lib/modules/2.6.20.1/build/include/linux/irq.h:22,
from /lib/modules/2.6.20.1/build/include/asm/hardirq.h:5,
from /lib/modules/2.6.20.1/build/include/linux/hardirq.h:7,
from /lib/modules/2.6.20.1/build/include/linux/interrupt.h:11,
from /lib/modules/2.6.20.1/build/include/linux/usb.h:15,
from Adiutil.h:53,
from eu_main.c:34:
/lib/modules/2.6.20.1/build/include/linux/sched.h: In function dequeue_signal_lock:
/lib/modules/2.6.20.1/build/include/linux/sched.h:1309: warning: implicit declaration of function local_irq_save
/lib/modules/2.6.20.1/build/include/linux/sched.h:1311: warning: implicit declaration of function local_irq_restore
In file included from /lib/modules/2.6.20.1/build/include/linux/irq.h:22,
from /lib/modules/2.6.20.1/build/include/asm/hardirq.h:5,
from /lib/modules/2.6.20.1/build/include/linux/hardirq.h:7,
from /lib/modules/2.6.20.1/build/include/linux/interrupt.h:11,
from /lib/modules/2.6.20.1/build/include/linux/usb.h:15,
from Adiutil.h:53,
from eu_main.c:34:
/lib/modules/2.6.20.1/build/include/asm/irq.h:15:25: error: irq_vectors.h: No such file or directory
In file included from /lib/modules/2.6.20.1/build/include/asm/hardirq.h:5,
from /lib/modules/2.6.20.1/build/include/linux/hardirq.h:7,
from /lib/modules/2.6.20.1/build/include/linux/interrupt.h:11,
from /lib/modules/2.6.20.1/build/include/linux/usb.h:15,
from Adiutil.h:53,
from eu_main.c:34:
/lib/modules/2.6.20.1/build/include/linux/irq.h: At top level:
/lib/modules/2.6.20.1/build/include/linux/irq.h:172: error: requested alignment is not a constant
/lib/modules/2.6.20.1/build/include/linux/irq.h:174: error: NR_IRQS undeclared here (not in a function)
In file included from /lib/modules/2.6.20.1/build/include/linux/hardirq.h:7,
from /lib/modules/2.6.20.1/build/include/linux/interrupt.h:11,
from /lib/modules/2.6.20.1/build/include/linux/usb.h:15,
from Adiutil.h:53,
from eu_main.c:34:
/lib/modules/2.6.20.1/build/include/asm/hardirq.h:12: error: requested alignment is not a constant
In file included from /lib/modules/2.6.20.1/build/include/linux/usb.h:15,
from Adiutil.h:53,
from eu_main.c:34:
/lib/modules/2.6.20.1/build/include/linux/interrupt.h: In function cli:
/lib/modules/2.6.20.1/build/include/linux/interrupt.h:198: warning: implicit declaration of function local_irq_disable
/lib/modules/2.6.20.1/build/include/linux/interrupt.h: In function sti:
/lib/modules/2.6.20.1/build/include/linux/interrupt.h:202: warning: implicit declaration of function local_irq_enable
/lib/modules/2.6.20.1/build/include/linux/interrupt.h: In function save_flags:
/lib/modules/2.6.20.1/build/include/linux/interrupt.h:206: warning: implicit declaration of function local_save_flags
In file included from /lib/modules/2.6.20.1/build/include/linux/module.h:21,
from /lib/modules/2.6.20.1/build/include/linux/device.h:20,
from /lib/modules/2.6.20.1/build/include/linux/usb.h:18,
from Adiutil.h:53,
from eu_main.c:34:
/lib/modules/2.6.20.1/build/include/asm/module.h:62:2: error: #error unknown processor family
In file included from eagle-usb.h:30,
from eu_main.c:41:
eu_types.h: At top level:
eu_types.h:641: warning: kmem_cache_t is deprecated
eu_main.c:277: error: expected ) before string constant
eu_main.c:838:51: error: macro "INIT_WORK" passed 3 arguments, but takes just 2
eu_main.c: In function eu_init_postfirm:
eu_main.c:838: error: INIT_WORK undeclared (first use in this function)
eu_main.c:847:47: error: macro "INIT_WORK" passed 3 arguments, but takes just 2
eu_main.c: In function eu_user:
eu_main.c:1679: warning: passing argument 6 of usb_fill_int_urb from incompatible pointer type
eu_main.c: In function eu_process_rcv:
eu_main.c:2053: warning: pointer targets in passing argument 2 of eu_uni_process_in_data differ in signedness
make[1]: *** [eu_main.o] Error 1
make[1]: Leaving directory `/home/vamitrou/Desktop/2.3.3-E4-B2/driver'
make: *** [build] Error 2
root@vamitrou-desktop:/home/vamitrou/Desktop/2.3.3-E4-B2#