All pastes #394945 Raw Edit

Unnamed

public text v1 · immutable
·published 2007-03-14 18:00 UTC
rendered paste body
===>  Installing for ORBit2-2.14.7
===>   ORBit2-2.14.7 depends on executable in : pkg-config - found
===>   ORBit2-2.14.7 depends on shared library: glib-2.0.0 - found
===>   ORBit2-2.14.7 depends on shared library: IDL-2.0 - found
===>   Generating temporary packing list
===>  Checking if devel/ORBit2 already installed
Making install in linc2
gmake[1]: Entering directory `/usr/ports/devel/ORBit2/work/ORBit2-2.14.7/linc2'
Making install in include
gmake[2]: Entering directory `/usr/ports/devel/ORBit2/work/ORBit2-2.14.7/linc2/include'
Making install in linc
gmake[3]: Entering directory `/usr/ports/devel/ORBit2/work/ORBit2-2.14.7/linc2/include/linc'
gmake  install-am
gmake[4]: Entering directory `/usr/ports/devel/ORBit2/work/ORBit2-2.14.7/linc2/include/linc'
gmake[5]: Entering directory `/usr/ports/devel/ORBit2/work/ORBit2-2.14.7/linc2/include/linc'
gmake[5]: Nothing to be done for `install-exec-am'.
gmake[5]: Nothing to be done for `install-data-am'.
gmake[5]: Leaving directory `/usr/ports/devel/ORBit2/work/ORBit2-2.14.7/linc2/include/linc'
gmake[4]: Leaving directory `/usr/ports/devel/ORBit2/work/ORBit2-2.14.7/linc2/include/linc'
gmake[3]: Leaving directory `/usr/ports/devel/ORBit2/work/ORBit2-2.14.7/linc2/include/linc'
gmake[3]: Entering directory `/usr/ports/devel/ORBit2/work/ORBit2-2.14.7/linc2/include'
gmake[4]: Entering directory `/usr/ports/devel/ORBit2/work/ORBit2-2.14.7/linc2/include'
gmake[4]: Nothing to be done for `install-exec-am'.
gmake[4]: Nothing to be done for `install-data-am'.
gmake[4]: Leaving directory `/usr/ports/devel/ORBit2/work/ORBit2-2.14.7/linc2/include'
gmake[3]: Leaving directory `/usr/ports/devel/ORBit2/work/ORBit2-2.14.7/linc2/include'
gmake[2]: Leaving directory `/usr/ports/devel/ORBit2/work/ORBit2-2.14.7/linc2/include'
Making install in src
gmake[2]: Entering directory `/usr/ports/devel/ORBit2/work/ORBit2-2.14.7/linc2/src'
gmake[3]: Entering directory `/usr/ports/devel/ORBit2/work/ORBit2-2.14.7/linc2/src'
test -z "/usr/local/bin" || ../.././install-sh -c -d "/usr/local/bin"
  /bin/sh /usr/ports/devel/ORBit2/work/gnome-libtool --mode=install install  -s -o root -g wheel -m 555 'linc-cleanup-sockets' '/usr/local/bin/linc-cleanup-sockets'
install -o root -g wheel -m 555 -s linc-cleanup-sockets /usr/local/bin/linc-cleanup-sockets
gmake[3]: Nothing to be done for `install-data-am'.
gmake[3]: Leaving directory `/usr/ports/devel/ORBit2/work/ORBit2-2.14.7/linc2/src'
gmake[2]: Leaving directory `/usr/ports/devel/ORBit2/work/ORBit2-2.14.7/linc2/src'
Making install in test
gmake[2]: Entering directory `/usr/ports/devel/ORBit2/work/ORBit2-2.14.7/linc2/test'
gmake[3]: Entering directory `/usr/ports/devel/ORBit2/work/ORBit2-2.14.7/linc2/test'
gmake[3]: Nothing to be done for `install-exec-am'.
gmake[3]: Nothing to be done for `install-data-am'.
gmake[3]: Leaving directory `/usr/ports/devel/ORBit2/work/ORBit2-2.14.7/linc2/test'
gmake[2]: Leaving directory `/usr/ports/devel/ORBit2/work/ORBit2-2.14.7/linc2/test'
gmake[2]: Entering directory `/usr/ports/devel/ORBit2/work/ORBit2-2.14.7/linc2'
gmake[3]: Entering directory `/usr/ports/devel/ORBit2/work/ORBit2-2.14.7/linc2'
gmake[3]: Nothing to be done for `install-exec-am'.
gmake[3]: Nothing to be done for `install-data-am'.
gmake[3]: Leaving directory `/usr/ports/devel/ORBit2/work/ORBit2-2.14.7/linc2'
gmake[2]: Leaving directory `/usr/ports/devel/ORBit2/work/ORBit2-2.14.7/linc2'
gmake[1]: Leaving directory `/usr/ports/devel/ORBit2/work/ORBit2-2.14.7/linc2'
Making install in src
gmake[1]: Entering directory `/usr/ports/devel/ORBit2/work/ORBit2-2.14.7/src'
Making install in idl-compiler
gmake[2]: Entering directory `/usr/ports/devel/ORBit2/work/ORBit2-2.14.7/src/idl-compiler'
cc -DHAVE_CONFIG_H -I. -I../.. -I../.. -I../../include -I../.. -I../../include -DORBIT_BACKENDS_DIR="\"/usr/local/lib/orbit-2.0/idl-backends\"" -DVERSION=\"2.14.7\" -DORBIT2_INTERNAL_API -Wall -Wunused -Wmissing-prototypes -Wmissing-declarations -DG_DISABLE_DEPRECATED -I/usr/local/include/libIDL-2.0 -I/usr/local/include/glib-2.0 -I/usr/local/lib/glib-2.0/include    -I/usr/local/include  -O2 -fno-strict-aliasing -pipe  -Werror-implicit-function-declaration -MT orbit-idl-main.o -MD -MP -MF .deps/orbit-idl-main.Tpo -c -o orbit-idl-main.o orbit-idl-main.c
mv -f .deps/orbit-idl-main.Tpo .deps/orbit-idl-main.Po
/bin/sh /usr/ports/devel/ORBit2/work/gnome-libtool --tag=CC   --mode=link cc  -O2 -fno-strict-aliasing -pipe  -Werror-implicit-function-declaration  -L/usr/local/lib -o orbit-idl-2 orbit-idl-main.o orbit-idl-driver.o orbit-idl-backend.o orbit-idl-utils.o orbit-idl-c-backend.o orbit-idl-c-stubs.o orbit-idl-c-skels.o orbit-idl-c-headers.o orbit-idl-c-common.o orbit-idl-c-imodule.o orbit-idl-c-skelimpl.o orbit-idl-c-utils.o orbit-idl-c-typecode.o orbit-idl-c-deps.o -Wl,--export-dynamic -L/usr/local/lib -lIDL-2 -lgobject-2.0 -lgmodule-2.0 -lglib-2.0 -liconv   -lm 
cc -O2 -fno-strict-aliasing -pipe -Werror-implicit-function-declaration -o orbit-idl-2 orbit-idl-main.o orbit-idl-driver.o orbit-idl-backend.o orbit-idl-utils.o orbit-idl-c-backend.o orbit-idl-c-stubs.o orbit-idl-c-skels.o orbit-idl-c-headers.o orbit-idl-c-common.o orbit-idl-c-imodule.o orbit-idl-c-skelimpl.o orbit-idl-c-utils.o orbit-idl-c-typecode.o orbit-idl-c-deps.o -Wl,--export-dynamic  -L/usr/local/lib /usr/local/lib/libIDL-2.so /usr/local/lib/libgobject-2.0.so /usr/local/lib/libgmodule-2.0.so /usr/local/lib/libglib-2.0.so /usr/local/lib/libintl.so /usr/local/lib/libiconv.so -lm -Wl,--rpath -Wl,/usr/local/lib -Wl,--rpath -Wl,/usr/local/lib
gmake[3]: Entering directory `/usr/ports/devel/ORBit2/work/ORBit2-2.14.7/src/idl-compiler'
cc -DHAVE_CONFIG_H -I. -I../.. -I../.. -I../../include -I../.. -I../../include -DORBIT_BACKENDS_DIR="\"/usr/local/lib/orbit-2.0/idl-backends\"" -DVERSION=\"2.14.7\" -DORBIT2_INTERNAL_API -Wall -Wunused -Wmissing-prototypes -Wmissing-declarations -DG_DISABLE_DEPRECATED -I/usr/local/include/libIDL-2.0 -I/usr/local/include/glib-2.0 -I/usr/local/lib/glib-2.0/include    -I/usr/local/include  -O2 -fno-strict-aliasing -pipe  -Werror-implicit-function-declaration -MT orbit-idl-main.o -MD -MP -MF .deps/orbit-idl-main.Tpo -c -o orbit-idl-main.o orbit-idl-main.c
mv -f .deps/orbit-idl-main.Tpo .deps/orbit-idl-main.Po
test -z "/usr/local/bin" || ../.././install-sh -c -d "/usr/local/bin"
  /bin/sh /usr/ports/devel/ORBit2/work/gnome-libtool --mode=install install  -s -o root -g wheel -m 555 'orbit-idl-2' '/usr/local/bin/orbit-idl-2'
install -o root -g wheel -m 555 -s orbit-idl-2 /usr/local/bin/orbit-idl-2
test -z "/usr/local/include/orbit-2.0/orbit-idl" || ../.././install-sh -c -d "/usr/local/include/orbit-2.0/orbit-idl"
 install  -o root -g wheel -m 444 'orbit-idl-backend.h' '/usr/local/include/orbit-2.0/orbit-idl/orbit-idl-backend.h'
test -z "/usr/local/libdata/pkgconfig" || ../.././install-sh -c -d "/usr/local/libdata/pkgconfig"
 install  -o root -g wheel -m 444 'ORBit-idl-2.0.pc' '/usr/local/libdata/pkgconfig/ORBit-idl-2.0.pc'
gmake[3]: Leaving directory `/usr/ports/devel/ORBit2/work/ORBit2-2.14.7/src/idl-compiler'
gmake[2]: Leaving directory `/usr/ports/devel/ORBit2/work/ORBit2-2.14.7/src/idl-compiler'
Making install in idl
gmake[2]: Entering directory `/usr/ports/devel/ORBit2/work/ORBit2-2.14.7/src/idl'
Making install in CORBA
gmake[3]: Entering directory `/usr/ports/devel/ORBit2/work/ORBit2-2.14.7/src/idl/CORBA'
gmake[4]: Entering directory `/usr/ports/devel/ORBit2/work/ORBit2-2.14.7/src/idl/CORBA'
gmake[4]: Nothing to be done for `install-exec-am'.
gmake[4]: Nothing to be done for `install-data-am'.
gmake[4]: Leaving directory `/usr/ports/devel/ORBit2/work/ORBit2-2.14.7/src/idl/CORBA'
gmake[3]: Leaving directory `/usr/ports/devel/ORBit2/work/ORBit2-2.14.7/src/idl/CORBA'
Making install in CORBA_PIDL
gmake[3]: Entering directory `/usr/ports/devel/ORBit2/work/ORBit2-2.14.7/src/idl/CORBA_PIDL'
gmake[4]: Entering directory `/usr/ports/devel/ORBit2/work/ORBit2-2.14.7/src/idl/CORBA_PIDL'
gmake[4]: Nothing to be done for `install-exec-am'.
gmake[4]: Nothing to be done for `install-data-am'.
gmake[4]: Leaving directory `/usr/ports/devel/ORBit2/work/ORBit2-2.14.7/src/idl/CORBA_PIDL'
gmake[3]: Leaving directory `/usr/ports/devel/ORBit2/work/ORBit2-2.14.7/src/idl/CORBA_PIDL'
Making install in interop
gmake[3]: Entering directory `/usr/ports/devel/ORBit2/work/ORBit2-2.14.7/src/idl/interop'
gmake[4]: Entering directory `/usr/ports/devel/ORBit2/work/ORBit2-2.14.7/src/idl/interop'
gmake[4]: Nothing to be done for `install-exec-am'.
gmake[4]: Nothing to be done for `install-data-am'.
gmake[4]: Leaving directory `/usr/ports/devel/ORBit2/work/ORBit2-2.14.7/src/idl/interop'
gmake[3]: Leaving directory `/usr/ports/devel/ORBit2/work/ORBit2-2.14.7/src/idl/interop'
Making install in misc
gmake[3]: Entering directory `/usr/ports/devel/ORBit2/work/ORBit2-2.14.7/src/idl/misc'
gmake[4]: Entering directory `/usr/ports/devel/ORBit2/work/ORBit2-2.14.7/src/idl/misc'
gmake[4]: Nothing to be done for `install-exec-am'.
gmake[4]: Nothing to be done for `install-data-am'.
gmake[4]: Leaving directory `/usr/ports/devel/ORBit2/work/ORBit2-2.14.7/src/idl/misc'
gmake[3]: Leaving directory `/usr/ports/devel/ORBit2/work/ORBit2-2.14.7/src/idl/misc'
gmake[3]: Entering directory `/usr/ports/devel/ORBit2/work/ORBit2-2.14.7/src/idl'
gmake[4]: Entering directory `/usr/ports/devel/ORBit2/work/ORBit2-2.14.7/src/idl'
gmake[4]: Nothing to be done for `install-exec-am'.
gmake[4]: Nothing to be done for `install-data-am'.
gmake[4]: Leaving directory `/usr/ports/devel/ORBit2/work/ORBit2-2.14.7/src/idl'
gmake[3]: Leaving directory `/usr/ports/devel/ORBit2/work/ORBit2-2.14.7/src/idl'
gmake[2]: Leaving directory `/usr/ports/devel/ORBit2/work/ORBit2-2.14.7/src/idl'
Making install in orb
gmake[2]: Entering directory `/usr/ports/devel/ORBit2/work/ORBit2-2.14.7/src/orb'
Making install in include
gmake[3]: Entering directory `/usr/ports/devel/ORBit2/work/ORBit2-2.14.7/src/orb/include'
gmake[4]: Entering directory `/usr/ports/devel/ORBit2/work/ORBit2-2.14.7/src/orb/include'
gmake[4]: Nothing to be done for `install-exec-am'.
gmake[4]: Nothing to be done for `install-data-am'.
gmake[4]: Leaving directory `/usr/ports/devel/ORBit2/work/ORBit2-2.14.7/src/orb/include'
(cd ../../../include; gmake)
gmake[4]: Entering directory `/usr/ports/devel/ORBit2/work/ORBit2-2.14.7/include'
Making all in orbit
gmake[5]: Entering directory `/usr/ports/devel/ORBit2/work/ORBit2-2.14.7/include/orbit'
gmake  all-recursive
gmake[6]: Entering directory `/usr/ports/devel/ORBit2/work/ORBit2-2.14.7/include/orbit'
Making all in GIOP
gmake[7]: Entering directory `/usr/ports/devel/ORBit2/work/ORBit2-2.14.7/include/orbit/GIOP'
gmake[7]: Nothing to be done for `all'.
gmake[7]: Leaving directory `/usr/ports/devel/ORBit2/work/ORBit2-2.14.7/include/orbit/GIOP'
Making all in util
gmake[7]: Entering directory `/usr/ports/devel/ORBit2/work/ORBit2-2.14.7/include/orbit/util'
gmake[7]: Nothing to be done for `all'.
gmake[7]: Leaving directory `/usr/ports/devel/ORBit2/work/ORBit2-2.14.7/include/orbit/util'
Making all in orb-core
gmake[7]: Entering directory `/usr/ports/devel/ORBit2/work/ORBit2-2.14.7/include/orbit/orb-core'
(rm -f corba-defs.h corba-defs-stubs.c corba-defs-skels.c corba-defs-common.c corba-defs-imodule.c corba-defs-skelimpl.c || true) > /dev/null
../../../src/idl-compiler/orbit-idl-2 -I../../../src/idl/CORBA_PIDL -I../../../src/idl/CORBA -I../../../src/idl/interop -I../../../src/orb/orb-core --noskels --nodefskels --nostubs --noidata --nocommon --showcpperrors --define=Object=OObject --define=TypeCode=TTypeCode --deps ./.deps/corba-defs.idl.P ../../../src/orb/orb-core/corba-defs.idl
orbit-idl-2 2.14.7 compiling
  mode, show preprocessor errors, passes: headers 

Processing file ../../../src/orb/orb-core/corba-defs.idl
for I in corba-defs.h corba-defs-stubs.c corba-defs-skels.c corba-defs-common.c corba-defs-imodule.c corba-defs-skelimpl.c; do \
		if test -f $I; then \
			sed -e 's,OObject,Object,g' -e 's,TTypeCode,TypeCode,g' $I > $I.out; \
			mv $I.out $I ; \
		fi; \
	done
(rm -f iop-defs.h iop-defs-stubs.c iop-defs-skels.c iop-defs-common.c iop-defs-imodule.c iop-defs-skelimpl.c || true) > /dev/null
../../../src/idl-compiler/orbit-idl-2 -I../../../src/idl/CORBA_PIDL -I../../../src/idl/CORBA -I../../../src/idl/interop -I../../../src/orb/orb-core --noskels --nodefskels --nostubs --noidata --nocommon --showcpperrors --define=Object=OObject --define=TypeCode=TTypeCode --deps ./.deps/iop-defs.idl.P ../../../src/orb/orb-core/iop-defs.idl
orbit-idl-2 2.14.7 compiling
  mode, show preprocessor errors, passes: headers 

Processing file ../../../src/orb/orb-core/iop-defs.idl
for I in iop-defs.h iop-defs-stubs.c iop-defs-skels.c iop-defs-common.c iop-defs-imodule.c iop-defs-skelimpl.c; do \
		if test -f $I; then \
			sed -e 's,OObject,Object,g' -e 's,TTypeCode,TypeCode,g' $I > $I.out; \
			mv $I.out $I ; \
		fi; \
	done
(rm -f orbit-interface.h || true ) > /dev/null
../../../src/idl-compiler/orbit-idl-2 -I../../../src/idl/CORBA_PIDL -I../../../src/idl/CORBA -I../../../src/idl/interop -I../../../src/orb/orb-core --noskels --nodefskels --nostubs --noidata --nocommon --showcpperrors --deps .deps/orbit-interface.idl.P ../../../src/orb/orb-core/orbit-interface.idl
orbit-idl-2 2.14.7 compiling
  mode, show preprocessor errors, passes: headers 

Processing file ../../../src/orb/orb-core/orbit-interface.idl
gmake  all-am
gmake[8]: Entering directory `/usr/ports/devel/ORBit2/work/ORBit2-2.14.7/include/orbit/orb-core'
gmake[8]: Nothing to be done for `all-am'.
gmake[8]: Leaving directory `/usr/ports/devel/ORBit2/work/ORBit2-2.14.7/include/orbit/orb-core'
gmake[7]: Leaving directory `/usr/ports/devel/ORBit2/work/ORBit2-2.14.7/include/orbit/orb-core'
Making all in poa
gmake[7]: Entering directory `/usr/ports/devel/ORBit2/work/ORBit2-2.14.7/include/orbit/poa'
(rm -f poa-defs.h poa-defs-stubs.c poa-defs-skels.c poa-defs-common.c poa-defs-imodule.c poa-defs-skelimpl.c || true) > /dev/null
../../../src/idl-compiler/orbit-idl-2 -I../../../src/idl/CORBA_PIDL -I../../../src/idl/CORBA -I../../../src/orb/orb-core -I../../../src/idl/misc --define=Object=OObject --define=TypeCode=TTypeCode --noskels --nodefskels --nostubs --nocommon --noidata --showcpperrors --deps ./.deps/poa-defs.idl.P ../../../src/orb/poa/poa-defs.idl
orbit-idl-2 2.14.7 compiling
  mode, show preprocessor errors, passes: headers 

Processing file ../../../src/orb/poa/poa-defs.idl
for I in poa-defs.h poa-defs-stubs.c poa-defs-skels.c poa-defs-common.c poa-defs-imodule.c poa-defs-skelimpl.c; do \
		if test -f $I; then \
			sed -e 's,OObject,Object,g' -e 's,TTypeCode,TypeCode,g' $I > $I.out; \
			mv $I.out $I ; \
		fi; \
	done
gmake  all-am
gmake[8]: Entering directory `/usr/ports/devel/ORBit2/work/ORBit2-2.14.7/include/orbit/poa'
gmake[8]: Nothing to be done for `all-am'.
gmake[8]: Leaving directory `/usr/ports/devel/ORBit2/work/ORBit2-2.14.7/include/orbit/poa'
gmake[7]: Leaving directory `/usr/ports/devel/ORBit2/work/ORBit2-2.14.7/include/orbit/poa'
Making all in dynamic
gmake[7]: Entering directory `/usr/ports/devel/ORBit2/work/ORBit2-2.14.7/include/orbit/dynamic'
(rm -f dynamic-defs.h dynamic-defs-stubs.c dynamic-defs-skels.c dynamic-defs-common.c dynamic-defs-imodule.c dynamic-defs-skelimpl.c || true) > /dev/null
../../../src/idl-compiler/orbit-idl-2 -I../../../src/idl/CORBA_PIDL -I../../../src/idl/CORBA -I../../../src/orb/orb-core -I../../../src/idl/misc --define=Object=OObject --define=TypeCode=TTypeCode --noskels --nodefskels --nostubs --nocommon --noidata --showcpperrors  --deps ./.deps/dynamic-defs.idl.P ../../../src/orb/dynamic/dynamic-defs.idl
orbit-idl-2 2.14.7 compiling
  mode, show preprocessor errors, passes: headers 

Processing file ../../../src/orb/dynamic/dynamic-defs.idl
for I in dynamic-defs.h dynamic-defs-stubs.c dynamic-defs-skels.c dynamic-defs-common.c dynamic-defs-imodule.c dynamic-defs-skelimpl.c; do \
		if test -f $I; then \
			sed -e 's,OObject,Object,g' -e 's,TTypeCode,TypeCode,g' $I > $I.out; \
			mv $I.out $I ; \
		fi; \
	done
gmake  all-am
gmake[8]: Entering directory `/usr/ports/devel/ORBit2/work/ORBit2-2.14.7/include/orbit/dynamic'
gmake[8]: Nothing to be done for `all-am'.
gmake[8]: Leaving directory `/usr/ports/devel/ORBit2/work/ORBit2-2.14.7/include/orbit/dynamic'
gmake[7]: Leaving directory `/usr/ports/devel/ORBit2/work/ORBit2-2.14.7/include/orbit/dynamic'
gmake[7]: Entering directory `/usr/ports/devel/ORBit2/work/ORBit2-2.14.7/include/orbit'
gmake[7]: Nothing to be done for `all-am'.
gmake[7]: Leaving directory `/usr/ports/devel/ORBit2/work/ORBit2-2.14.7/include/orbit'
gmake[6]: Leaving directory `/usr/ports/devel/ORBit2/work/ORBit2-2.14.7/include/orbit'
gmake[5]: Leaving directory `/usr/ports/devel/ORBit2/work/ORBit2-2.14.7/include/orbit'
gmake[5]: Entering directory `/usr/ports/devel/ORBit2/work/ORBit2-2.14.7/include'
gmake[5]: Nothing to be done for `all-am'.
gmake[5]: Leaving directory `/usr/ports/devel/ORBit2/work/ORBit2-2.14.7/include'
gmake[4]: Leaving directory `/usr/ports/devel/ORBit2/work/ORBit2-2.14.7/include'
gmake[3]: Leaving directory `/usr/ports/devel/ORBit2/work/ORBit2-2.14.7/src/orb/include'
Making install in orb-core
gmake[3]: Entering directory `/usr/ports/devel/ORBit2/work/ORBit2-2.14.7/src/orb/orb-core'
gmake[4]: Entering directory `/usr/ports/devel/ORBit2/work/ORBit2-2.14.7/src/idl-compiler'
cc -DHAVE_CONFIG_H -I. -I../.. -I../.. -I../../include -I../.. -I../../include -DORBIT_BACKENDS_DIR="\"/usr/local/lib/orbit-2.0/idl-backends\"" -DVERSION=\"2.14.7\" -DORBIT2_INTERNAL_API -Wall -Wunused -Wmissing-prototypes -Wmissing-declarations -DG_DISABLE_DEPRECATED -I/usr/local/include/libIDL-2.0 -I/usr/local/include/glib-2.0 -I/usr/local/lib/glib-2.0/include    -I/usr/local/include  -O2 -fno-strict-aliasing -pipe  -Werror-implicit-function-declaration -MT orbit-idl-main.o -MD -MP -MF .deps/orbit-idl-main.Tpo -c -o orbit-idl-main.o orbit-idl-main.c
mv -f .deps/orbit-idl-main.Tpo .deps/orbit-idl-main.Po
/bin/sh /usr/ports/devel/ORBit2/work/gnome-libtool --tag=CC   --mode=link cc  -O2 -fno-strict-aliasing -pipe  -Werror-implicit-function-declaration  -L/usr/local/lib -o orbit-idl-2 orbit-idl-main.o orbit-idl-driver.o orbit-idl-backend.o orbit-idl-utils.o orbit-idl-c-backend.o orbit-idl-c-stubs.o orbit-idl-c-skels.o orbit-idl-c-headers.o orbit-idl-c-common.o orbit-idl-c-imodule.o orbit-idl-c-skelimpl.o orbit-idl-c-utils.o orbit-idl-c-typecode.o orbit-idl-c-deps.o -Wl,--export-dynamic -L/usr/local/lib -lIDL-2 -lgobject-2.0 -lgmodule-2.0 -lglib-2.0 -liconv   -lm 
cc -O2 -fno-strict-aliasing -pipe -Werror-implicit-function-declaration -o orbit-idl-2 orbit-idl-main.o orbit-idl-driver.o orbit-idl-backend.o orbit-idl-utils.o orbit-idl-c-backend.o orbit-idl-c-stubs.o orbit-idl-c-skels.o orbit-idl-c-headers.o orbit-idl-c-common.o orbit-idl-c-imodule.o orbit-idl-c-skelimpl.o orbit-idl-c-utils.o orbit-idl-c-typecode.o orbit-idl-c-deps.o -Wl,--export-dynamic  -L/usr/local/lib /usr/local/lib/libIDL-2.so /usr/local/lib/libgobject-2.0.so /usr/local/lib/libgmodule-2.0.so /usr/local/lib/libglib-2.0.so /usr/local/lib/libintl.so /usr/local/lib/libiconv.so -lm -Wl,--rpath -Wl,/usr/local/lib -Wl,--rpath -Wl,/usr/local/lib
gmake[4]: Leaving directory `/usr/ports/devel/ORBit2/work/ORBit2-2.14.7/src/idl-compiler'
(rm -f orbit-interface-common.c || true) > /dev/null
../../../src/idl-compiler/orbit-idl-2 --nostubs --noskels --showcpperrors --noheaders --deps .deps/orbit-interface.idl.P orbit-interface.idl
orbit-idl-2 2.14.7 compiling
  mode, show preprocessor errors, passes: common 

Processing file orbit-interface.idl
(rm -f corba-defs.h corba-defs-stubs.c corba-defs-skels.c corba-defs-common.c corba-defs-imodule.c corba-defs-skelimpl.c || true) > /dev/null
../../../src/idl-compiler/orbit-idl-2 -I../../../src/idl/CORBA_PIDL -I../../../src/idl/CORBA -I../../../src/idl/misc -I../../../src/idl/interop -I. -D_PRE_3_0_COMPILER_ --noskels --nodefskels --nostubs --noidata --noheaders --define=Object=OObject --define=TypeCode=TTypeCode --showcpperrors --deps ./.deps/corba-defs.idl.P ../../../src/orb/orb-core/corba-defs.idl
orbit-idl-2 2.14.7 compiling
  mode, show preprocessor errors, passes: common 

Processing file ../../../src/orb/orb-core/corba-defs.idl
for I in corba-defs.h corba-defs-stubs.c corba-defs-skels.c corba-defs-common.c corba-defs-imodule.c corba-defs-skelimpl.c; do \
		if test -f $I; then \
			sed -e 's,OObject,Object,g' -e 's,TTypeCode,TypeCode,g' $I > $I.out; \
			mv $I.out $I ; \
		fi; \
	done
true
(rm -f iop-defs.h iop-defs-stubs.c iop-defs-skels.c iop-defs-common.c iop-defs-imodule.c iop-defs-skelimpl.c || true) > /dev/null
../../../src/idl-compiler/orbit-idl-2 -I../../../src/idl/CORBA_PIDL -I../../../src/idl/CORBA -I../../../src/idl/misc -I../../../src/idl/interop -I. -D_PRE_3_0_COMPILER_ --noskels --nodefskels --nostubs --noidata --noheaders --define=Object=OObject --define=TypeCode=TTypeCode --showcpperrors --deps ./.deps/iop-defs.idl.P ../../../src/orb/orb-core/iop-defs.idl
orbit-idl-2 2.14.7 compiling
  mode, show preprocessor errors, passes: common 

Processing file ../../../src/orb/orb-core/iop-defs.idl
for I in iop-defs.h iop-defs-stubs.c iop-defs-skels.c iop-defs-common.c iop-defs-imodule.c iop-defs-skelimpl.c; do \
		if test -f $I; then \
			sed -e 's,OObject,Object,g' -e 's,TTypeCode,TypeCode,g' $I > $I.out; \
			mv $I.out $I ; \
		fi; \
	done
true
(rm -f corba-ops-stubs.c corba-ops-common.c corba-ops-skels.c corba-ops.h || true) > /dev/null
../../../src/idl-compiler/orbit-idl-2 --showcpperrors --deps .deps/corba-ops.idl.P corba-ops.idl
orbit-idl-2 2.14.7 compiling
  mode, show preprocessor errors, passes: stubs skels common headers 

Processing file corba-ops.idl
for I in corba-ops-stubs.c corba-ops-common.c corba-ops-skels.c corba-ops.h; do								\
		sed -e 's,ZZZis_a,_is_a,g' -e 's,ZZis_a,is_a,g' $I > $I.out; mv $I.out $I;	\
	done;											\
	sed -e "s,Z,_,g" corba-ops-skels.c > corba-ops-skels.c.out;				\
	mv corba-ops-skels.c.out corba-ops-skels.c;
true
gmake  install-am
gmake[4]: Entering directory `/usr/ports/devel/ORBit2/work/ORBit2-2.14.7/src/orb/orb-core'
gmake[5]: Entering directory `/usr/ports/devel/ORBit2/work/ORBit2-2.14.7/src/idl-compiler'
cc -DHAVE_CONFIG_H -I. -I../.. -I../.. -I../../include -I../.. -I../../include -DORBIT_BACKENDS_DIR="\"/usr/local/lib/orbit-2.0/idl-backends\"" -DVERSION=\"2.14.7\" -DORBIT2_INTERNAL_API -Wall -Wunused -Wmissing-prototypes -Wmissing-declarations -DG_DISABLE_DEPRECATED -I/usr/local/include/libIDL-2.0 -I/usr/local/include/glib-2.0 -I/usr/local/lib/glib-2.0/include    -I/usr/local/include  -O2 -fno-strict-aliasing -pipe  -Werror-implicit-function-declaration -MT orbit-idl-main.o -MD -MP -MF .deps/orbit-idl-main.Tpo -c -o orbit-idl-main.o orbit-idl-main.c
mv -f .deps/orbit-idl-main.Tpo .deps/orbit-idl-main.Po
/bin/sh /usr/ports/devel/ORBit2/work/gnome-libtool --tag=CC   --mode=link cc  -O2 -fno-strict-aliasing -pipe  -Werror-implicit-function-declaration  -L/usr/local/lib -o orbit-idl-2 orbit-idl-main.o orbit-idl-driver.o orbit-idl-backend.o orbit-idl-utils.o orbit-idl-c-backend.o orbit-idl-c-stubs.o orbit-idl-c-skels.o orbit-idl-c-headers.o orbit-idl-c-common.o orbit-idl-c-imodule.o orbit-idl-c-skelimpl.o orbit-idl-c-utils.o orbit-idl-c-typecode.o orbit-idl-c-deps.o -Wl,--export-dynamic -L/usr/local/lib -lIDL-2 -lgobject-2.0 -lgmodule-2.0 -lglib-2.0 -liconv   -lm 
cc -O2 -fno-strict-aliasing -pipe -Werror-implicit-function-declaration -o orbit-idl-2 orbit-idl-main.o orbit-idl-driver.o orbit-idl-backend.o orbit-idl-utils.o orbit-idl-c-backend.o orbit-idl-c-stubs.o orbit-idl-c-skels.o orbit-idl-c-headers.o orbit-idl-c-common.o orbit-idl-c-imodule.o orbit-idl-c-skelimpl.o orbit-idl-c-utils.o orbit-idl-c-typecode.o orbit-idl-c-deps.o -Wl,--export-dynamic  -L/usr/local/lib /usr/local/lib/libIDL-2.so /usr/local/lib/libgobject-2.0.so /usr/local/lib/libgmodule-2.0.so /usr/local/lib/libglib-2.0.so /usr/local/lib/libintl.so /usr/local/lib/libiconv.so -lm -Wl,--rpath -Wl,/usr/local/lib -Wl,--rpath -Wl,/usr/local/lib
gmake[5]: Leaving directory `/usr/ports/devel/ORBit2/work/ORBit2-2.14.7/src/idl-compiler'
(rm -f orbit-interface-common.c || true) > /dev/null
../../../src/idl-compiler/orbit-idl-2 --nostubs --noskels --showcpperrors --noheaders --deps .deps/orbit-interface.idl.P orbit-interface.idl
orbit-idl-2 2.14.7 compiling
  mode, show preprocessor errors, passes: common 

Processing file orbit-interface.idl
(rm -f ../../../include/orbit/orb-core/orbit-interface.h ../../../include/orbit/orb-core/orbit-interface-stubs.c ../../../include/orbit/orb-core/orbit-interface-skels.c ../../../include/orbit/orb-core/orbit-interface-common.c ../../../include/orbit/orb-core/orbit-interface-imodule.c ../../../include/orbit/orb-core/orbit-interface-skelimpl.c || true) > /dev/null
../../../src/idl-compiler/orbit-idl-2 -I../../../src/idl/CORBA_PIDL -I../../../src/idl/CORBA -I../../../src/idl/misc -I../../../src/idl/interop -I. -D_PRE_3_0_COMPILER_ --noskels --nodefskels --nostubs --noidata --noheaders --define=Object=OObject --define=TypeCode=TTypeCode --showcpperrors --deps ../../../include/orbit/orb-core/.deps/orbit-interface.idl.P ../../../include/orbit/orb-core/../../../src/orb/orb-core/orbit-interface.idl
orbit-idl-2 2.14.7 compiling
  mode, show preprocessor errors, passes: common 

Processing file ../../../include/orbit/orb-core/../../../src/orb/orb-core/orbit-interface.idl

** (orbit-idl-2:24290): WARNING **: ../../../include/orbit/orb-core/../../../src/orb/orb-core/orbit-interface.idl compilation failed
gmake[4]: *** [../../../include/orbit/orb-core/orbit-interface.h] Error 1
gmake[4]: Leaving directory `/usr/ports/devel/ORBit2/work/ORBit2-2.14.7/src/orb/orb-core'
gmake[3]: *** [install] Error 2
gmake[3]: Leaving directory `/usr/ports/devel/ORBit2/work/ORBit2-2.14.7/src/orb/orb-core'
gmake[2]: *** [install-recursive] Error 1
gmake[2]: Leaving directory `/usr/ports/devel/ORBit2/work/ORBit2-2.14.7/src/orb'
gmake[1]: *** [install-recursive] Error 1
gmake[1]: Leaving directory `/usr/ports/devel/ORBit2/work/ORBit2-2.14.7/src'
gmake: *** [install-recursive] Error 1
*** Error code 2

Stop in /usr/ports/devel/ORBit2.