cpan[1]> install Bundle::DBD::mysql
CPAN: Storable loaded ok
Going to read /root/.cpan/Metadata
Database was generated on Tue, 13 Mar 2007 06:09:31 GMT
DBI is up to date (1.54).
Running install for module DBD::mysql
Running make for C/CA/CAPTTOFU/DBD-mysql-4.003.tar.gz
CPAN: Digest::SHA loaded ok
CPAN: Compress::Zlib loaded ok
Checksum for /root/.cpan/sources/authors/id/C/CA/CAPTTOFU/DBD-mysql-4.003.tar.gz ok
Scanning cache /root/.cpan/build for sizes
DBD-mysql-4.003/
DBD-mysql-4.003/ChangeLog
DBD-mysql-4.003/constants.h
DBD-mysql-4.003/dbdimp.c
DBD-mysql-4.003/dbdimp.h
DBD-mysql-4.003/eg/
DBD-mysql-4.003/eg/prepare_memory_usage.pl
DBD-mysql-4.003/eg/proc_example1.pl
DBD-mysql-4.003/eg/proc_example2.pl
DBD-mysql-4.003/eg/proc_example3.pl
DBD-mysql-4.003/INSTALL.html
DBD-mysql-4.003/lib/
DBD-mysql-4.003/lib/Bundle/
DBD-mysql-4.003/lib/Bundle/DBD/
DBD-mysql-4.003/lib/Bundle/DBD/mysql.pm
DBD-mysql-4.003/lib/DBD/
DBD-mysql-4.003/lib/DBD/mysql/
DBD-mysql-4.003/lib/DBD/mysql/GetInfo.pm
DBD-mysql-4.003/lib/DBD/mysql/INSTALL.pod
DBD-mysql-4.003/lib/DBD/mysql.pm
DBD-mysql-4.003/Makefile.PL
DBD-mysql-4.003/Makefile.PL.embedded
DBD-mysql-4.003/MANIFEST
DBD-mysql-4.003/MANIFEST.SKIP
DBD-mysql-4.003/META.yml
DBD-mysql-4.003/myld
DBD-mysql-4.003/mysql.xs
DBD-mysql-4.003/README
DBD-mysql-4.003/t/
DBD-mysql-4.003/t/00base.t
DBD-mysql-4.003/t/10dsnlist.t
DBD-mysql-4.003/t/20createdrop.t
DBD-mysql-4.003/t/30insertfetch.t
DBD-mysql-4.003/t/35limit.t
DBD-mysql-4.003/t/35prepare.t
DBD-mysql-4.003/t/40bindparam.t
DBD-mysql-4.003/t/40bindparam2.t
DBD-mysql-4.003/t/40blobs.t
DBD-mysql-4.003/t/40catalog.t
DBD-mysql-4.003/t/40listfields.t
DBD-mysql-4.003/t/40nulls.t
DBD-mysql-4.003/t/40numrows.t
DBD-mysql-4.003/t/41bindparam.t
DBD-mysql-4.003/t/41blobs_prepare.t
DBD-mysql-4.003/t/42bindparam.t
DBD-mysql-4.003/t/50chopblanks.t
DBD-mysql-4.003/t/50commit.t
DBD-mysql-4.003/t/60leaks.t
DBD-mysql-4.003/t/70takeimp.t
DBD-mysql-4.003/t/75supported_sql.t
DBD-mysql-4.003/t/80procs.t
DBD-mysql-4.003/t/insertid.t
DBD-mysql-4.003/t/lib.pl
DBD-mysql-4.003/t/mysql.dbtest
DBD-mysql-4.003/t/param_values.t
DBD-mysql-4.003/t/prepare_noerror.t
DBD-mysql-4.003/t/texecute.t
DBD-mysql-4.003/t/utf8.t
DBD-mysql-4.003/TODO
Removing previously used /root/.cpan/build/DBD-mysql-4.003
CPAN.pm: Going to build C/CA/CAPTTOFU/DBD-mysql-4.003.tar.gz
I will use the following settings for compiling and testing:
cflags (mysql_config) = -I/usr/include/mysql -g -pipe -Wp,-D_FORTIFY_SOURCE=2 -fexceptions -m32 -march=i386 -mtune=pentium4 -fasynchronous-unwind-tables -D_GNU_SOURCE -D_FILE_OFFSET_BITS=64 -D_LARGEFILE_SOURCE -fno-strict-aliasing
embedded (mysql_config) =
libs (mysql_config) = -L/usr/lib/mysql -lmysqlclient -lz -lcrypt -lnsl -lm -L/usr/lib -lssl -lcrypto
mysql_config (guessed ) = mysql_config
nocatchstderr (default ) = 0
nofoundrows (default ) = 0
ssl (guessed ) = 1
testdb (default ) = test
testhost (default ) =
testpassword (default ) =
testsocket (default ) =
testuser (default ) =
To change these settings, see 'perl Makefile.PL --help' and
'perldoc INSTALL'.
Checking if your kit is complete...
Looks good
Using DBI 1.54 (for perl 5.008006 on i386-linux-thread-multi) installed in /usr/lib/perl5/site_perl/5.8.6/i386-linux-thread-multi/auto/DBI/
Writing Makefile for DBD::mysql
CPAN: YAML loaded ok
cp lib/DBD/mysql.pm blib/lib/DBD/mysql.pm
cp lib/DBD/mysql/GetInfo.pm blib/lib/DBD/mysql/GetInfo.pm
cp lib/DBD/mysql/INSTALL.pod blib/lib/DBD/mysql/INSTALL.pod
cp lib/Bundle/DBD/mysql.pm blib/lib/Bundle/DBD/mysql.pm
gcc -c -I/usr/lib/perl5/site_perl/5.8.6/i386-linux-thread-multi/auto/DBI -I/usr/include/mysql -g -pipe -Wp,-D_FORTIFY_SOURCE=2 -fexceptions -m32 -march=i386 -mtune=pentium4 -fasynchronous-unwind-tables -D_GNU_SOURCE -D_FILE_OFFSET_BITS=64 -D_LARGEFILE_SOURCE -fno-strict-aliasing -DDBD_MYSQL_WITH_SSL -DDBD_MYSQL_INSERT_ID_IS_GOOD -g -D_REENTRANT -D_GNU_SOURCE -DDEBUGGING -fno-strict-aliasing -pipe -I/usr/local/include -D_LARGEFILE_SOURCE -D_FILE_OFFSET_BITS=64 -I/usr/include/gdbm -O2 -g -pipe -Wp,-D_FORTIFY_SOURCE=2 -fexceptions -m32 -march=i386 -mtune=pentium4 -fasynchronous-unwind-tables -DVERSION=\"4.003\" -DXS_VERSION=\"4.003\" -fPIC "-I/usr/lib/perl5/5.8.6/i386-linux-thread-multi/CORE" dbdimp.c
In file included from dbdimp.c:20:
dbdimp.h:22:49: error: mysql.h: No such file or directory
dbdimp.h:23:45: error: mysqld_error.h: No such file or directory
dbdimp.h:24:49: error: errmsg.h: No such file or directory
In file included from dbdimp.c:20:
dbdimp.h:138: error: syntax error before âMYSQLâ
dbdimp.h:138: warning: no semicolon at end of struct or union
dbdimp.h:159: error: syntax error before â}â token
dbdimp.h:231: error: syntax error before âMYSQL_RESâ
dbdimp.h:231: warning: no semicolon at end of struct or union
dbdimp.h:234: error: syntax error before ârow_numâ
dbdimp.h:234: warning: data definition has no type or storage class
dbdimp.h:239: error: syntax error before âinsertidâ
dbdimp.h:239: warning: data definition has no type or storage class
dbdimp.h:245: error: syntax error before â}â token
In file included from dbdimp.c:20:
dbdimp.h:290: error: syntax error before â*â token
dbdimp.h:293: error: syntax error before âmysql_st_internal_executeâ
dbdimp.h:298: error: syntax error before âMYSQL_RESâ
dbdimp.h:300: warning: data definition has no type or storage class
dbdimp.h:325: error: syntax error before â*â token
dbdimp.h:325: error: syntax error before âMYSQLâ
dbdimp.h:326: warning: data definition has no type or storage class
dbdimp.c:433: error: syntax error before â*â token
dbdimp.c: In function âparse_paramsâ:
dbdimp.c:445: error: âslen_ptrâ undeclared (first use in this function)
dbdimp.c:445: error: (Each undeclared identifier is reported only once
dbdimp.c:445: error: for each function it appears in.)
dbdimp.c:454: error: âstatementâ undeclared (first use in this function)
dbdimp.c:454: error: ânum_paramsâ undeclared (first use in this function)
dbdimp.c:605: error: âsockâ undeclared (first use in this function)
dbdimp.c: At top level:
dbdimp.c:662: error: âFIELD_TYPE_VAR_STRINGâ undeclared here (not in a function)
dbdimp.c:672: error: âFIELD_TYPE_DECIMALâ undeclared here (not in a function)
dbdimp.c:682: error: âFIELD_TYPE_TINYâ undeclared here (not in a function)
dbdimp.c:692: error: âFIELD_TYPE_SHORTâ undeclared here (not in a function)
dbdimp.c:702: error: âFIELD_TYPE_LONGâ undeclared here (not in a function)
dbdimp.c:712: error: âFIELD_TYPE_FLOATâ undeclared here (not in a function)
dbdimp.c:722: error: âFIELD_TYPE_DOUBLEâ undeclared here (not in a function)
dbdimp.c:745: error: âFIELD_TYPE_TIMESTAMPâ undeclared here (not in a function)
dbdimp.c:755: error: âFIELD_TYPE_LONGLONGâ undeclared here (not in a function)
dbdimp.c:765: error: âFIELD_TYPE_INT24â undeclared here (not in a function)
dbdimp.c:775: error: âFIELD_TYPE_DATEâ undeclared here (not in a function)
dbdimp.c:785: error: âFIELD_TYPE_TIMEâ undeclared here (not in a function)
dbdimp.c:795: error: âFIELD_TYPE_DATETIMEâ undeclared here (not in a function)
dbdimp.c:805: error: âFIELD_TYPE_YEARâ undeclared here (not in a function)
dbdimp.c:815: error: âFIELD_TYPE_NEWDATEâ undeclared here (not in a function)
dbdimp.c:825: error: âFIELD_TYPE_ENUMâ undeclared here (not in a function)
dbdimp.c:835: error: âFIELD_TYPE_SETâ undeclared here (not in a function)
dbdimp.c:845: error: âFIELD_TYPE_BLOBâ undeclared here (not in a function)
dbdimp.c:855: error: âFIELD_TYPE_TINY_BLOBâ undeclared here (not in a function)
dbdimp.c:865: error: âFIELD_TYPE_MEDIUM_BLOBâ undeclared here (not in a function)
dbdimp.c:875: error: âFIELD_TYPE_LONG_BLOBâ undeclared here (not in a function)
dbdimp.c:885: error: âFIELD_TYPE_STRINGâ undeclared here (not in a function)
dbdimp.c: In function ânative2sqlâ:
dbdimp.c:1199: error: duplicate case value
dbdimp.c:1198: error: previously used here
dbdimp.c:1203: error: duplicate case value
dbdimp.c:1198: error: previously used here
dbdimp.c:1204: error: duplicate case value
dbdimp.c:1198: error: previously used here
dbdimp.c:1205: error: duplicate case value
dbdimp.c:1198: error: previously used here
dbdimp.c:1206: error: duplicate case value
dbdimp.c:1198: error: previously used here
dbdimp.c:1209: error: duplicate case value
dbdimp.c:1198: error: previously used here
dbdimp.c:1210: error: duplicate case value
dbdimp.c:1198: error: previously used here
dbdimp.c:1211: error: duplicate case value
dbdimp.c:1198: error: previously used here
dbdimp.c:1212: error: duplicate case value
dbdimp.c:1198: error: previously used here
dbdimp.c:1213: error: duplicate case value
dbdimp.c:1198: error: previously used here
dbdimp.c:1214: error: duplicate case value
dbdimp.c:1198: error: previously used here
dbdimp.c:1215: error: duplicate case value
dbdimp.c:1198: error: previously used here
dbdimp.c:1216: error: duplicate case value
dbdimp.c:1198: error: previously used here
dbdimp.c:1217: error: duplicate case value
dbdimp.c:1198: error: previously used here
dbdimp.c:1218: error: duplicate case value
dbdimp.c:1198: error: previously used here
dbdimp.c:1219: error: duplicate case value
dbdimp.c:1198: error: previously used here
dbdimp.c:1220: error: duplicate case value
dbdimp.c:1198: error: previously used here
dbdimp.c:1221: error: duplicate case value
dbdimp.c:1198: error: previously used here
dbdimp.c:1222: error: duplicate case value
dbdimp.c:1198: error: previously used here
dbdimp.c:1223: error: duplicate case value
dbdimp.c:1198: error: previously used here
dbdimp.c:1224: error: duplicate case value
dbdimp.c:1198: error: previously used here
dbdimp.c: At top level:
dbdimp.c:1269: error: conflicting types for âmysql_dr_errorâ
dbdimp.h:288: error: previous declaration of âmysql_dr_errorâ was here
dbdimp.c:1352: error: syntax error before â*â token
dbdimp.c:1352: error: syntax error before âMYSQLâ
dbdimp.c: In function âmysql_dr_connectâ:
dbdimp.c:1357: error: âMYSQLâ undeclared (first use in this function)
dbdimp.c:1357: error: âresultâ undeclared (first use in this function)
dbdimp.c:1357: error: invalid operands to binary *
dbdimp.c:1365: error: âportâ undeclared (first use in this function)
dbdimp.c:1365: error: invalid operands to binary &&
dbdimp.c:1365: warning: passing argument 1 of âatoiâ from incompatible pointer type
dbdimp.c:1376: error: âhostâ undeclared (first use in this function)
dbdimp.c:1376: warning: pointer type mismatch in conditional expression
dbdimp.c:1377: error: âuserâ undeclared (first use in this function)
dbdimp.c:1377: warning: pointer type mismatch in conditional expression
dbdimp.c:1378: error: âpasswordâ undeclared (first use in this function)
dbdimp.c:1378: warning: pointer type mismatch in conditional expression
dbdimp.c:1489: error: âCLIENT_FOUND_ROWSâ undeclared (first use in this function)
dbdimp.c:1491: error: âsockâ undeclared (first use in this function)
dbdimp.c:1493: error: âimp_dbhâ undeclared (first use in this function)
dbdimp.c:1495: error: âstruct sql_type_info_sâ has no member named âcomâ
dbdimp.c:1495: error: request for member âstdâ in something not a structure or union
dbdimp.c:1495: error: request for member âimp_dataâ in something not a structure or union
dbdimp.c:1497: error: âstruct sql_type_info_sâ has no member named âcomâ
dbdimp.c:1497: error: request for member âstdâ in something not a structure or union
dbdimp.c:1497: error: request for member âflagsâ in something not a structure or union
dbdimp.c:1497: error: âstruct sql_type_info_sâ has no member named âcomâ
dbdimp.c:1497: error: request for member âstdâ in something not a structure or union
dbdimp.c:1497: error: request for member âflagsâ in something not a structure or union
dbdimp.c:1511: error: âMYSQL_OPT_COMPRESSâ undeclared (first use in this function)
dbdimp.c:1521: error: âMYSQL_OPT_CONNECT_TIMEOUTâ undeclared (first use in this function)
dbdimp.c:1532: error: âMYSQL_READ_DEFAULT_FILEâ undeclared (first use in this function)
dbdimp.c:1543: error: âMYSQL_READ_DEFAULT_GROUPâ undeclared (first use in this function)
dbdimp.c:1550: error: wrong type argument to bit-complement
dbdimp.c:1554: error: âstruct sql_type_info_sâ has no member named âuse_mysql_use_resultâ
dbdimp.c:1558: error: âstruct sql_type_info_sâ has no member named âuse_mysql_use_resultâ
dbdimp.c:1673: error: âdbnameâ undeclared (first use in this function)
dbdimp.c:1674: error: âmysql_socketâ undeclared (first use in this function)
dbdimp.c:1692: error: âstruct sql_type_info_sâ has no member named âreconnectâ
dbdimp.c:1694: warning: return from incompatible pointer type
dbdimp.c: In function âmy_loginâ:
dbdimp.c:1747: error: dereferencing pointer to incomplete type
dbdimp.c:1747: error: request for member âcomâ in something not a structure or union
dbdimp.c:1747: error: request for member âstdâ in something not a structure or union
dbdimp.c:1747: error: request for member âimp_dataâ in something not a structure or union
dbdimp.c:1773: error: dereferencing pointer to incomplete type
dbdimp.c:1773: error: request for member âmysqlâ in something not a structure or union
dbdimp.c: In function âmysql_db_loginâ:
dbdimp.c:1809: error: dereferencing pointer to incomplete type
dbdimp.c:1809: error: request for member âstatsâ in something not a structure or union
dbdimp.c:1809: error: request for member âauto_reconnects_okâ in something not a structure or union
dbdimp.c:1810: error: dereferencing pointer to incomplete type
dbdimp.c:1810: error: request for member âstatsâ in something not a structure or union
dbdimp.c:1810: error: request for member âauto_reconnects_failedâ in something not a structure or union
dbdimp.c:1811: error: dereferencing pointer to incomplete type
dbdimp.c:1811: error: request for member âbind_type_guessingâ in something not a structure or union
dbdimp.c:1812: error: dereferencing pointer to incomplete type
dbdimp.c:1812: error: request for member âhas_transactionsâ in something not a structure or union
dbdimp.c:1814: error: dereferencing pointer to incomplete type
dbdimp.c:1814: error: request for member âauto_reconnectâ in something not a structure or union
dbdimp.c:1822: error: dereferencing pointer to incomplete type
dbdimp.c:1822: error: request for member âmysqlâ in something not a structure or union
dbdimp.c:1823: error: dereferencing pointer to incomplete type
dbdimp.c:1823: error: request for member âmysqlâ in something not a structure or union
dbdimp.c:1823: warning: passing argument 3 of âmysql_dr_errorâ makes pointer from integer without a cast
dbdimp.c:1830: error: dereferencing pointer to incomplete type
dbdimp.c:1830: error: request for member âcomâ in something not a structure or union
dbdimp.c:1830: error: request for member âstdâ in something not a structure or union
dbdimp.c:1830: error: request for member âparent_comâ in something not a structure or union
dbdimp.c:1830: error: dereferencing pointer to incomplete type
dbdimp.c:1830: error: request for member âcomâ in something not a structure or union
dbdimp.c:1830: error: request for member âstdâ in something not a structure or union
dbdimp.c:1830: error: request for member âflagsâ in something not a structure or union
dbdimp.c:1830: error: invalid operands to binary &
dbdimp.c:1830: error: dereferencing pointer to incomplete type
dbdimp.c:1830: error: request for member âcomâ in something not a structure or union
dbdimp.c:1830: error: request for member âstdâ in something not a structure or union
dbdimp.c:1830: error: request for member âflagsâ in something not a structure or union
dbdimp.c:1833: error: dereferencing pointer to incomplete type
dbdimp.c:1833: error: request for member âcomâ in something not a structure or union
dbdimp.c:1833: error: request for member âstdâ in something not a structure or union
dbdimp.c:1833: error: request for member âflagsâ in something not a structure or union
dbdimp.c: In function âmysql_db_commitâ:
dbdimp.c:1857: error: dereferencing pointer to incomplete type
dbdimp.c:1857: error: request for member âcomâ in something not a structure or union
dbdimp.c:1857: error: request for member âstdâ in something not a structure or union
dbdimp.c:1857: error: request for member âflagsâ in something not a structure or union
dbdimp.c:1857: error: invalid operands to binary &
dbdimp.c:1860: error: dereferencing pointer to incomplete type
dbdimp.c:1860: error: request for member âhas_transactionsâ in something not a structure or union
dbdimp.c:1863: error: dereferencing pointer to incomplete type
dbdimp.c:1863: error: request for member âmysqlâ in something not a structure or union
dbdimp.c:1868: error: dereferencing pointer to incomplete type
dbdimp.c:1868: error: request for member âmysqlâ in something not a structure or union
dbdimp.c:1868: error: dereferencing pointer to incomplete type
dbdimp.c:1868: error: request for member âmysqlâ in something not a structure or union
dbdimp.c:1869: warning: passing argument 3 of âmysql_dr_errorâ makes pointer from integer without a cast
dbdimp.c: In function âmysql_db_rollbackâ:
dbdimp.c:1885: error: dereferencing pointer to incomplete type
dbdimp.c:1885: error: request for member âcomâ in something not a structure or union
dbdimp.c:1885: error: request for member âstdâ in something not a structure or union
dbdimp.c:1885: error: request for member âflagsâ in something not a structure or union
dbdimp.c:1885: error: invalid operands to binary &
dbdimp.c:1888: error: dereferencing pointer to incomplete type
dbdimp.c:1888: error: request for member âhas_transactionsâ in something not a structure or union
dbdimp.c:1891: error: dereferencing pointer to incomplete type
dbdimp.c:1891: error: request for member âmysqlâ in something not a structure or union
dbdimp.c:1896: error: dereferencing pointer to incomplete type
dbdimp.c:1896: error: request for member âmysqlâ in something not a structure or union
dbdimp.c:1897: error: dereferencing pointer to incomplete type
dbdimp.c:1897: error: request for member âmysqlâ in something not a structure or union
dbdimp.c:1897: warning: passing argument 3 of âmysql_dr_errorâ makes pointer from integer without a cast
dbdimp.c: In function âmysql_db_disconnectâ:
dbdimp.c:1930: error: dereferencing pointer to incomplete type
dbdimp.c:1930: error: request for member âcomâ in something not a structure or union
dbdimp.c:1930: error: request for member âstdâ in something not a structure or union
dbdimp.c:1930: error: request for member âparent_comâ in something not a structure or union
dbdimp.c:1930: error: dereferencing pointer to incomplete type
dbdimp.c:1930: error: request for member âcomâ in something not a structure or union
dbdimp.c:1930: error: request for member âstdâ in something not a structure or union
dbdimp.c:1930: error: request for member âflagsâ in something not a structure or union
dbdimp.c:1930: error: invalid operands to binary &
dbdimp.c:1930: error: dereferencing pointer to incomplete type
dbdimp.c:1930: error: request for member âcomâ in something not a structure or union
dbdimp.c:1930: error: request for member âstdâ in something not a structure or union
dbdimp.c:1930: error: request for member âflagsâ in something not a structure or union
dbdimp.c:1933: error: dereferencing pointer to incomplete type
dbdimp.c:1933: error: request for member âmysqlâ in something not a structure or union
dbdimp.c:1934: error: dereferencing pointer to incomplete type
dbdimp.c:1934: error: request for member âmysqlâ in something not a structure or union
dbdimp.c: In function âmysql_db_destroyâ:
dbdimp.c:2018: error: dereferencing pointer to incomplete type
dbdimp.c:2018: error: request for member âcomâ in something not a structure or union
dbdimp.c:2018: error: request for member âstdâ in something not a structure or union
dbdimp.c:2018: error: request for member âflagsâ in something not a structure or union
dbdimp.c:2018: error: invalid operands to binary &
dbdimp.c:2020: error: dereferencing pointer to incomplete type
dbdimp.c:2020: error: request for member âhas_transactionsâ in something not a structure or union
dbdimp.c:2022: error: dereferencing pointer to incomplete type
dbdimp.c:2022: error: request for member âcomâ in something not a structure or union
dbdimp.c:2022: error: request for member âstdâ in something not a structure or union
dbdimp.c:2022: error: request for member âflagsâ in something not a structure or union
dbdimp.c:2022: error: invalid operands to binary &
dbdimp.c:2024: error: dereferencing pointer to incomplete type
dbdimp.c:2024: error: request for member âmysqlâ in something not a structure or union
dbdimp.c:2034: error: dereferencing pointer to incomplete type
dbdimp.c:2034: error: request for member âcomâ in something not a structure or union
dbdimp.c:2034: error: request for member âstdâ in something not a structure or union
dbdimp.c:2034: error: request for member âflagsâ in something not a structure or union
dbdimp.c: In function âmysql_db_STORE_attribâ:
dbdimp.c:2069: error: dereferencing pointer to incomplete type
dbdimp.c:2069: error: request for member âhas_transactionsâ in something not a structure or union
dbdimp.c:2071: error: dereferencing pointer to incomplete type
dbdimp.c:2071: error: request for member âcomâ in something not a structure or union
dbdimp.c:2071: error: request for member âstdâ in something not a structure or union
dbdimp.c:2071: error: request for member âflagsâ in something not a structure or union
dbdimp.c:2071: error: invalid operands to binary &
dbdimp.c:2091: error: dereferencing pointer to incomplete type
dbdimp.c:2091: error: request for member âmysqlâ in something not a structure or union
dbdimp.c:2099: error: dereferencing pointer to incomplete type
dbdimp.c:2099: error: request for member âmysqlâ in something not a structure or union
dbdimp.c:2106: error: dereferencing pointer to incomplete type
dbdimp.c:2106: error: request for member âcomâ in something not a structure or union
dbdimp.c:2106: error: request for member âstdâ in something not a structure or union
dbdimp.c:2106: error: request for member âflagsâ in something not a structure or union
dbdimp.c:2106: error: dereferencing pointer to incomplete type
dbdimp.c:2106: error: request for member âcomâ in something not a structure or union
dbdimp.c:2106: error: request for member âstdâ in something not a structure or union
dbdimp.c:2106: error: request for member âflagsâ in something not a structure or union
dbdimp.c:2123: error: dereferencing pointer to incomplete type
dbdimp.c:2123: error: request for member âuse_mysql_use_resultâ in something not a structure or union
dbdimp.c:2125: error: dereferencing pointer to incomplete type
dbdimp.c:2125: error: request for member âauto_reconnectâ in something not a structure or union
dbdimp.c:2127: error: dereferencing pointer to incomplete type
dbdimp.c:2127: error: request for member âuse_server_side_prepareâ in something not a structure or union
dbdimp.c:2130: error: dereferencing pointer to incomplete type
dbdimp.c:2130: error: request for member âbind_type_guessingâ in something not a structure or union
dbdimp.c: At top level:
dbdimp.c:2159: error: syntax error before âvalâ
dbdimp.c: In function âmy_ulonglong2strâ:
dbdimp.c:2164: error: âvalâ undeclared (first use in this function)
dbdimp.c:2170: error: invalid operands to binary %
dbdimp.c:2170: warning: assignment makes integer from pointer without a cast
dbdimp.c:2171: error: invalid operands to binary /
dbdimp.c: In function âmysql_db_FETCH_attribâ:
dbdimp.c:2192: error: dereferencing pointer to incomplete type
dbdimp.c:2192: error: request for member âhas_transactionsâ in something not a structure or union
dbdimp.c:2193: error: dereferencing pointer to incomplete type
dbdimp.c:2193: error: request for member âcomâ in something not a structure or union
dbdimp.c:2193: error: request for member âstdâ in something not a structure or union
dbdimp.c:2193: error: request for member âflagsâ in something not a structure or union
dbdimp.c:2193: error: invalid operands to binary &
dbdimp.c:2209: error: dereferencing pointer to incomplete type
dbdimp.c:2209: error: request for member âauto_reconnectâ in something not a structure or union
dbdimp.c:2209: warning: passing argument 2 of âPerl_newSVivâ makes integer from pointer without a cast
dbdimp.c:2214: error: dereferencing pointer to incomplete type
dbdimp.c:2214: error: request for member âbind_type_guessingâ in something not a structure or union
dbdimp.c:2214: warning: passing argument 2 of âPerl_newSVivâ makes integer from pointer without a cast
dbdimp.c:2218: error: dereferencing pointer to incomplete type
dbdimp.c:2218: error: request for member âmysqlâ in something not a structure or union
dbdimp.c:2222: error: dereferencing pointer to incomplete type
dbdimp.c:2222: error: request for member âmysqlâ in something not a structure or union
dbdimp.c:2222: warning: initialization makes pointer from integer without a cast
dbdimp.c:2235: error: dereferencing pointer to incomplete type
dbdimp.c:2235: error: request for member âstatsâ in something not a structure or union
dbdimp.c:2235: error: request for member âauto_reconnects_okâ in something not a structure or union
dbdimp.c:2235: warning: passing argument 2 of âPerl_newSVivâ makes integer from pointer without a cast
dbdimp.c:2242: error: dereferencing pointer to incomplete type
dbdimp.c:2242: error: request for member âstatsâ in something not a structure or union
dbdimp.c:2242: error: request for member âauto_reconnects_failedâ in something not a structure or union
dbdimp.c:2242: warning: passing argument 2 of âPerl_newSVivâ makes integer from pointer without a cast
dbdimp.c:2256: error: dereferencing pointer to incomplete type
dbdimp.c:2256: error: request for member âmysqlâ in something not a structure or union
dbdimp.c:2256: warning: initialization makes pointer from integer without a cast
dbdimp.c:2265: error: dereferencing pointer to incomplete type
dbdimp.c:2265: error: request for member âmysqlâ in something not a structure or union
dbdimp.c:2265: warning: initialization makes pointer from integer without a cast
dbdimp.c:2270: error: dereferencing pointer to incomplete type
dbdimp.c:2270: error: request for member âmysqlâ in something not a structure or union
dbdimp.c:2275: error: dereferencing pointer to incomplete type
dbdimp.c:2275: error: request for member âmysqlâ in something not a structure or union
dbdimp.c:2281: error: dereferencing pointer to incomplete type
dbdimp.c:2281: error: request for member âmysqlâ in something not a structure or union
dbdimp.c:2281: warning: initialization makes pointer from integer without a cast
dbdimp.c:2286: error: dereferencing pointer to incomplete type
dbdimp.c:2286: error: request for member âmysqlâ in something not a structure or union
dbdimp.c:2288: error: dereferencing pointer to incomplete type
dbdimp.c:2288: error: request for member âmysqlâ in something not a structure or union
dbdimp.c:2288: error: request for member ânetâ in something not a structure or union
dbdimp.c:2288: error: request for member âfdâ in something not a structure or union
dbdimp.c:2288: warning: passing argument 2 of âPerl_newSVivâ makes integer from pointer without a cast
dbdimp.c:2291: error: dereferencing pointer to incomplete type
dbdimp.c:2291: error: request for member âmysqlâ in something not a structure or union
dbdimp.c:2291: warning: initialization makes pointer from integer without a cast
dbdimp.c:2298: error: dereferencing pointer to incomplete type
dbdimp.c:2298: error: request for member âmysqlâ in something not a structure or union
dbdimp.c:2298: warning: initialization makes pointer from integer without a cast
dbdimp.c:2303: error: dereferencing pointer to incomplete type
dbdimp.c:2303: error: request for member âuse_server_side_prepareâ in something not a structure or union
dbdimp.c:2303: warning: passing argument 2 of âPerl_newSVivâ makes integer from pointer without a cast
dbdimp.c:2308: error: dereferencing pointer to incomplete type
dbdimp.c:2308: error: request for member âmysqlâ in something not a structure or union
dbdimp.c: In function âmysql_st_prepareâ:
dbdimp.c:2352: error: dereferencing pointer to incomplete type
dbdimp.c:2352: error: request for member âcomâ in something not a structure or union
dbdimp.c:2352: error: request for member âstdâ in something not a structure or union
dbdimp.c:2352: error: request for member âparent_comâ in something not a structure or union
dbdimp.c:2356: error: âMYSQL_VERSION_IDâ undeclared (first use in this function)
dbdimp.c:2371: error: dereferencing pointer to incomplete type
dbdimp.c:2371: error: request for member âdone_descâ in something not a structure or union
dbdimp.c:2372: error: dereferencing pointer to incomplete type
dbdimp.c:2372: error: request for member âresultâ in something not a structure or union
dbdimp.c:2373: error: dereferencing pointer to incomplete type
dbdimp.c:2373: error: request for member âcurrowâ in something not a structure or union
dbdimp.c:2377: error: dereferencing pointer to incomplete type
dbdimp.c:2377: error: request for member âuse_mysql_use_resultâ in something not a structure or union
dbdimp.c:2378: error: dereferencing pointer to incomplete type
dbdimp.c:2378: error: request for member âuse_mysql_use_resultâ in something not a structure or union
dbdimp.c:2378: warning: pointer/integer type mismatch in conditional expression
dbdimp.c:2381: error: dereferencing pointer to incomplete type
dbdimp.c:2381: error: request for member âav_attrâ in something not a structure or union
dbdimp.c:2381: error: assignment of read-only location
dbdimp.c:2381: error: incompatible types in assignment
dbdimp.c:2567: error: dereferencing pointer to incomplete type
dbdimp.c:2567: error: request for member âcomâ in something not a structure or union
dbdimp.c:2567: error: request for member ânum_paramsâ in something not a structure or union
dbdimp.c:2571: error: dereferencing pointer to incomplete type
dbdimp.c:2571: error: request for member âparamsâ in something not a structure or union
dbdimp.c:2571: error: dereferencing pointer to incomplete type
dbdimp.c:2571: error: request for member âcomâ in something not a structure or union
dbdimp.c:2571: error: request for member ânum_paramsâ in something not a structure or union
dbdimp.c:2571: warning: passing argument 1 of âalloc_paramâ makes integer from pointer without a cast
dbdimp.c:2572: error: dereferencing pointer to incomplete type
dbdimp.c:2572: error: request for member âcomâ in something not a structure or union
dbdimp.c:2572: error: request for member âstdâ in something not a structure or union
dbdimp.c:2572: error: request for member âflagsâ in something not a structure or union
dbdimp.c: In function âmysql_st_free_result_setsâ:
dbdimp.c:2592: error: dereferencing pointer to incomplete type
dbdimp.c:2592: error: request for member âcomâ in something not a structure or union
dbdimp.c:2592: error: request for member âstdâ in something not a structure or union
dbdimp.c:2592: error: request for member âparent_comâ in something not a structure or union
dbdimp.c:2639: error: dereferencing pointer to incomplete type
dbdimp.c:2639: error: request for member âresultâ in something not a structure or union
dbdimp.c:2641: error: dereferencing pointer to incomplete type
dbdimp.c:2641: error: request for member âresultâ in something not a structure or union
dbdimp.c:2642: error: dereferencing pointer to incomplete type
dbdimp.c:2642: error: request for member âresultâ in something not a structure or union
dbdimp.c: At top level:
dbdimp.c:2834: error: syntax error before âmysql_st_internal_executeâ
dbdimp.c:2840: error: syntax error before âMYSQL_RESâ
dbdimp.c: In function âmysql_st_internal_executeâ:
dbdimp.c:2847: error: âstatementâ undeclared (first use in this function)
dbdimp.c:2847: error: âstruct sql_type_info_sâ has no member named âsv_flagsâ
dbdimp.c:2847: error: invalid operands to binary &
dbdimp.c:2847: warning: comparison between pointer and integer
dbdimp.c:2847: error: âstruct sql_type_info_sâ has no member named âsv_anyâ
dbdimp.c:2847: error: âstruct sql_type_info_sâ has no member named âxpv_curâ
dbdimp.c:2847: error: âstruct sql_type_info_sâ has no member named âsv_anyâ
dbdimp.c:2847: error: âstruct sql_type_info_sâ has no member named âxpv_pvâ
dbdimp.c:2847: warning: passing argument 2 of âPerl_sv_2pv_flagsâ from incompatible pointer type
dbdimp.c:2847: warning: pointer type mismatch in conditional expression
dbdimp.c:2852: error: âmy_ulonglongâ undeclared (first use in this function)
dbdimp.c:2852: error: syntax error before ârowsâ
dbdimp.c:2855: error: âhâ undeclared (first use in this function)
dbdimp.c:2855: warning: passing argument 1 of â(*(&(Perl_get_sv(pthread_getspecific(*Perl_Gthr_key_ptr(0u)), "DBI::_dbistate", 5)->sv_any)->xiv_iv))->getcomâ from incompatible pointer type
dbdimp.c:2867: warning: passing argument 1 of â(*(&(Perl_get_sv(pthread_getspecific(*Perl_Gthr_key_ptr(0u)), "DBI::_dbistate", 5)->sv_any)->xiv_iv))->getcomâ from incompatible pointer type
dbdimp.c:2870: error: dereferencing pointer to incomplete type
dbdimp.c:2870: error: request for member âbind_type_guessingâ in something not a structure or union
dbdimp.c:2877: warning: passing argument 1 of â(*(&(Perl_get_sv(pthread_getspecific(*Perl_Gthr_key_ptr(0u)), "DBI::_dbistate", 5)->sv_any)->xiv_iv))->getcomâ from incompatible pointer type
dbdimp.c:2878: error: dereferencing pointer to incomplete type
dbdimp.c:2878: error: request for member âcomâ in something not a structure or union
dbdimp.c:2878: error: request for member âstdâ in something not a structure or union
dbdimp.c:2878: error: request for member âparent_comâ in something not a structure or union
dbdimp.c:2881: error: dereferencing pointer to incomplete type
dbdimp.c:2881: error: request for member âbind_type_guessingâ in something not a structure or union
dbdimp.c:2886: error: âsvsockâ undeclared (first use in this function)
dbdimp.c:2890: error: ânum_paramsâ undeclared (first use in this function)
dbdimp.c:2898: error: âMYSQL_VERSION_IDâ undeclared (first use in this function)
dbdimp.c:2917: warning: passing argument 1 of âmysql_dr_errorâ from incompatible pointer type
dbdimp.c:2922: warning: passing argument 1 of âmysql_dr_errorâ from incompatible pointer type
dbdimp.c:2936: error: âresultâ undeclared (first use in this function)
dbdimp.c:2936: error: assignment of read-only location
dbdimp.c:2936: error: incompatible types in assignment
dbdimp.c:2940: error: wrong type argument to unary exclamation mark
dbdimp.c:2943: warning: passing argument 1 of âmysql_dr_errorâ from incompatible pointer type
dbdimp.c:2943: warning: passing argument 3 of âmysql_dr_errorâ makes pointer from integer without a cast
dbdimp.c:2951: warning: passing argument 1 of âmysql_db_reconnectâ from incompatible pointer type
dbdimp.c:2956: warning: passing argument 1 of âmysql_dr_errorâ from incompatible pointer type
dbdimp.c:2956: warning: passing argument 3 of âmysql_dr_errorâ makes pointer from integer without a cast
dbdimp.c:2965: error: assignment of read-only location
dbdimp.c:2965: error: incompatible types in assignment
dbdimp.c:2969: warning: passing argument 1 of âmysql_dr_errorâ from incompatible pointer type
dbdimp.c:2969: warning: passing argument 3 of âmysql_dr_errorâ makes pointer from integer without a cast
dbdimp.c:2971: error: wrong type argument to unary exclamation mark
dbdimp.c:2972: error: ârowsâ undeclared (first use in this function)
dbdimp.c:2976: warning: return makes integer from pointer without a cast
dbdimp.c: In function âmysql_st_executeâ:
dbdimp.c:3120: error: dereferencing pointer to incomplete type
dbdimp.c:3120: error: request for member âcomâ in something not a structure or union
dbdimp.c:3120: error: request for member âstdâ in something not a structure or union
dbdimp.c:3120: error: request for member âparent_comâ in something not a structure or union
dbdimp.c:3135: error: dereferencing pointer to incomplete type
dbdimp.c:3135: error: request for member âav_attrâ in something not a structure or union
dbdimp.c:3135: error: used struct type value where scalar is required
dbdimp.c:3136: error: dereferencing pointer to incomplete type
dbdimp.c:3136: error: request for member âav_attrâ in something not a structure or union
dbdimp.c:3136: error: cannot convert to a pointer type
dbdimp.c:3138: error: dereferencing pointer to incomplete type
dbdimp.c:3138: error: request for member âav_attrâ in something not a structure or union
dbdimp.c:3138: error: assignment of read-only location
dbdimp.c:3138: error: incompatible types in assignment
dbdimp.c:3152: error: âMYSQL_VERSION_IDâ undeclared (first use in this function)
dbdimp.c:3182: error: dereferencing pointer to incomplete type
dbdimp.c:3182: error: request for member ârow_numâ in something not a structure or union
dbdimp.c:3186: error: dereferencing pointer to incomplete type
dbdimp.c:3186: error: request for member âcomâ in something not a structure or union
dbdimp.c:3186: error: request for member ânum_paramsâ in something not a structure or union
dbdimp.c:3187: error: dereferencing pointer to incomplete type
dbdimp.c:3187: error: request for member âparamsâ in something not a structure or union
dbdimp.c:3188: error: dereferencing pointer to incomplete type
dbdimp.c:3188: error: request for member âresultâ in something not a structure or union
dbdimp.c:3189: error: dereferencing pointer to incomplete type
dbdimp.c:3189: error: request for member âmysqlâ in something not a structure or union
dbdimp.c:3190: error: dereferencing pointer to incomplete type
dbdimp.c:3190: error: request for member âuse_mysql_use_resultâ in something not a structure or union
dbdimp.c:3193: error: dereferencing pointer to incomplete type
dbdimp.c:3193: error: request for member ârow_numâ in something not a structure or union
dbdimp.c:3193: error: âmy_ulonglongâ undeclared (first use in this function)
dbdimp.c:3195: error: dereferencing pointer to incomplete type
dbdimp.c:3195: error: request for member âresultâ in something not a structure or union
dbdimp.c:3196: error: dereferencing pointer to incomplete type
dbdimp.c:3196: error: request for member âinsertidâ in something not a structure or union
dbdimp.c:3196: error: dereferencing pointer to incomplete type
dbdimp.c:3196: error: request for member âmysqlâ in something not a structure or union
dbdimp.c:3200: error: dereferencing pointer to incomplete type
dbdimp.c:3200: error: request for member âcomâ in something not a structure or union
dbdimp.c:3200: error: request for member ânum_fieldsâ in something not a structure or union
dbdimp.c:3200: error: dereferencing pointer to incomplete type
dbdimp.c:3200: error: request for member âresultâ in something not a structure or union
dbdimp.c:3201: error: dereferencing pointer to incomplete type
dbdimp.c:3201: error: request for member âcomâ in something not a structure or union
dbdimp.c:3201: error: request for member âstdâ in something not a structure or union
dbdimp.c:3201: error: request for member âparent_comâ in something not a structure or union
dbdimp.c:3201: error: dereferencing pointer to incomplete type
dbdimp.c:3201: error: request for member âcomâ in something not a structure or union
dbdimp.c:3201: error: request for member âstdâ in something not a structure or union
dbdimp.c:3201: error: request for member âflagsâ in something not a structure or union
dbdimp.c:3201: error: invalid operands to binary &
dbdimp.c:3201: error: dereferencing pointer to incomplete type
dbdimp.c:3201: error: request for member âcomâ in something not a structure or union
dbdimp.c:3201: error: request for member âstdâ in something not a structure or union
dbdimp.c:3201: error: request for member âflagsâ in something not a structure or union
dbdimp.c:3202: error: dereferencing pointer to incomplete type
dbdimp.c:3202: error: request for member âdone_descâ in something not a structure or union
dbdimp.c:3203: error: dereferencing pointer to incomplete type
dbdimp.c:3203: error: request for member âfetch_doneâ in something not a structure or union
dbdimp.c:3213: error: dereferencing pointer to incomplete type
dbdimp.c:3213: error: request for member ârow_numâ in something not a structure or union
dbdimp.c:3219: error: dereferencing pointer to incomplete type
dbdimp.c:3219: error: request for member ârow_numâ in something not a structure or union
dbdimp.c:3219: warning: return makes integer from pointer without a cast
dbdimp.c: In function âmysql_describeâ:
dbdimp.c:3340: error: dereferencing pointer to incomplete type
dbdimp.c:3340: error: request for member âdone_descâ in something not a structure or union
dbdimp.c: In function âmysql_st_fetchâ:
dbdimp.c:3368: error: âMYSQL_ROWâ undeclared (first use in this function)
dbdimp.c:3368: error: syntax error before âcolsâ
dbdimp.c:3369: error: dereferencing pointer to incomplete type
dbdimp.c:3369: error: request for member âcomâ in something not a structure or union
dbdimp.c:3369: error: request for member âstdâ in something not a structure or union
dbdimp.c:3369: error: request for member âparent_comâ in something not a structure or union
dbdimp.c:3370: error: âMYSQLâ undeclared (first use in this function)
dbdimp.c:3370: error: âsvsockâ undeclared (first use in this function)
dbdimp.c:3370: error: invalid operands to binary *
dbdimp.c:3370: error: dereferencing pointer to incomplete type
dbdimp.c:3370: error: request for member âmysqlâ in something not a structure or union
dbdimp.c:3375: error: âMYSQL_FIELDâ undeclared (first use in this function)
dbdimp.c:3375: error: âfieldsâ undeclared (first use in this function)
dbdimp.c:3375: error: invalid operands to binary *
dbdimp.c:3406: error: dereferencing pointer to incomplete type
dbdimp.c:3406: error: request for member âcomâ in something not a structure or union
dbdimp.c:3406: error: request for member âstdâ in something not a structure or union
dbdimp.c:3406: error: request for member âflagsâ in something not a structure or union
dbdimp.c:3406: error: invalid operands to binary &
dbdimp.c:3413: error: dereferencing pointer to incomplete type
dbdimp.c:3413: error: request for member âresultâ in something not a structure or union
dbdimp.c:3419: error: too few arguments to function âmysql_dr_errorâ
dbdimp.c:3425: error: dereferencing pointer to incomplete type
dbdimp.c:3425: error: request for member âmysqlâ in something not a structure or union
dbdimp.c:3425: error: request for member ânetâ in something not a structure or union
dbdimp.c:3425: error: request for member âlast_errnoâ in something not a structure or union
dbdimp.c:3555: error: dereferencing pointer to incomplete type
dbdimp.c:3555: error: request for member âcurrowâ in something not a structure or union
dbdimp.c:3555: error: wrong type argument to increment
dbdimp.c:3560: error: dereferencing pointer to incomplete type
dbdimp.c:3560: error: request for member âresultâ in something not a structure or union
dbdimp.c:3562: error: dereferencing pointer to incomplete type
dbdimp.c:3562: error: request for member âresultâ in something not a structure or union
dbdimp.c:3564: error: dereferencing pointer to incomplete type
dbdimp.c:3564: error: request for member âresultâ in something not a structure or union
dbdimp.c:3566: error: dereferencing pointer to incomplete type
dbdimp.c:3566: error: request for member âmysqlâ in something not a structure or union
dbdimp.c:3568: error: dereferencing pointer to incomplete type
dbdimp.c:3568: error: request for member âcurrowâ in something not a structure or union
dbdimp.c:3571: error: âcolsâ undeclared (first use in this function)
dbdimp.c:3571: error: dereferencing pointer to incomplete type
dbdimp.c:3571: error: request for member âresultâ in something not a structure or union
dbdimp.c:3577: error: dereferencing pointer to incomplete type
dbdimp.c:3577: error: request for member âmysqlâ in something not a structure or union
dbdimp.c:3578: error: dereferencing pointer to incomplete type
dbdimp.c:3578: error: request for member âmysqlâ in something not a structure or union
dbdimp.c:3579: error: dereferencing pointer to incomplete type
dbdimp.c:3579: error: request for member âmysqlâ in something not a structure or union
dbdimp.c:3583: warning: passing argument 3 of âmysql_dr_errorâ makes pointer from integer without a cast
dbdimp.c:3583: error: too few arguments to function âmysql_dr_errorâ
dbdimp.c:3594: error: dereferencing pointer to incomplete type
dbdimp.c:3594: error: request for member âresultâ in something not a structure or union
dbdimp.c:3595: error: dereferencing pointer to incomplete type
dbdimp.c:3595: error: request for member âresultâ in something not a structure or union
dbdimp.c:3596: error: dereferencing pointer to incomplete type
dbdimp.c:3596: error: request for member âresultâ in something not a structure or union
dbdimp.c:3596: warning: assignment makes pointer from integer without a cast
dbdimp.c:3598: error: dereferencing pointer to incomplete type
dbdimp.c:3598: error: request for member âcomâ in something not a structure or union
dbdimp.c:3598: error: request for member âfields_svavâ in something not a structure or union
dbdimp.c:3598: warning: comparison of distinct pointer types lacks a cast
dbdimp.c:3610: error: dereferencing pointer to incomplete type
dbdimp.c:3610: error: request for member âcomâ in something not a structure or union
dbdimp.c:3610: error: request for member ânum_fieldsâ in something not a structure or union
dbdimp.c:3636: error: incompatible types in initialization
dbdimp.c: In function âmysql_st_finishâ:
dbdimp.c:3761: error: dereferencing pointer to incomplete type
dbdimp.c:3761: error: request for member âresultâ in something not a structure or union
dbdimp.c:3769: error: dereferencing pointer to incomplete type
dbdimp.c:3769: error: request for member âcomâ in something not a structure or union
dbdimp.c:3769: error: request for member âstdâ in something not a structure or union
dbdimp.c:3769: error: request for member âparent_comâ in something not a structure or union
dbdimp.c:3769: error: dereferencing pointer to incomplete type
dbdimp.c:3769: error: request for member âcomâ in something not a structure or union
dbdimp.c:3769: error: request for member âstdâ in something not a structure or union
dbdimp.c:3769: error: request for member âflagsâ in something not a structure or union
dbdimp.c:3769: error: invalid operands to binary &
dbdimp.c:3769: error: dereferencing pointer to incomplete type
dbdimp.c:3769: error: request for member âcomâ in something not a structure or union
dbdimp.c:3769: error: request for member âstdâ in something not a structure or union
dbdimp.c:3769: error: request for member âflagsâ in something not a structure or union
dbdimp.c: In function âmysql_st_destroyâ:
dbdimp.c:3802: error: dereferencing pointer to incomplete type
dbdimp.c:3802: error: request for member âparamsâ in something not a structure or union
dbdimp.c:3802: error: dereferencing pointer to incomplete type
dbdimp.c:3802: error: request for member âcomâ in something not a structure or union
dbdimp.c:3802: error: request for member ânum_paramsâ in something not a structure or union
dbdimp.c:3802: warning: passing argument 1 of âfree_paramâ from incompatible pointer type
dbdimp.c:3802: warning: passing argument 2 of âfree_paramâ makes integer from pointer without a cast
dbdimp.c:3803: error: dereferencing pointer to incomplete type
dbdimp.c:3803: error: request for member âparamsâ in something not a structure or union
dbdimp.c:3808: error: dereferencing pointer to incomplete type
dbdimp.c:3808: error: request for member âav_attrâ in something not a structure or union
dbdimp.c:3808: error: used struct type value where scalar is required
dbdimp.c:3809: error: dereferencing pointer to incomplete type
dbdimp.c:3809: error: request for member âav_attrâ in something not a structure or union
dbdimp.c:3809: error: cannot convert to a pointer type
dbdimp.c:3810: error: dereferencing pointer to incomplete type
dbdimp.c:3810: error: request for member âav_attrâ in something not a structure or union
dbdimp.c:3810: error: assignment of read-only location
dbdimp.c:3810: error: incompatible types in assignment
dbdimp.c:3813: error: dereferencing pointer to incomplete type
dbdimp.c:3813: error: request for member âcomâ in something not a structure or union
dbdimp.c:3813: error: request for member âstdâ in something not a structure or union
dbdimp.c:3813: error: request for member âflagsâ in something not a structure or union
dbdimp.c: In function âmysql_st_STORE_attribâ:
dbdimp.c:3853: error: dereferencing pointer to incomplete type
dbdimp.c:3853: error: request for member âuse_mysql_use_resultâ in something not a structure or union
dbdimp.c: At top level:
dbdimp.c:3901: error: syntax error before âMYSQL_RESâ
dbdimp.c: In function âmysql_st_FETCH_internalâ:
dbdimp.c:3905: error: âsthâ undeclared (first use in this function)
dbdimp.c:3905: warning: passing argument 1 of â(*(&(Perl_get_sv(pthread_getspecific(*Perl_Gthr_key_ptr(0u)), "DBI::_dbistate", 5)->sv_any)->xiv_iv))->getcomâ from incompatible pointer type
dbdimp.c:3907: error: âMYSQL_FIELDâ undeclared (first use in this function)
dbdimp.c:3907: error: âcurFieldâ undeclared (first use in this function)
dbdimp.c:3907: error: invalid operands to binary *
dbdimp.c:3910: error: âwhatâ undeclared (first use in this function)
dbdimp.c:3910: warning: comparison between pointer and integer
dbdimp.c:3915: warning: passing argument 1 of âmysql_dr_errorâ from incompatible pointer type
dbdimp.c:3915: error: too few arguments to function âmysql_dr_errorâ
dbdimp.c:3919: error: âcacheitâ undeclared (first use in this function)
dbdimp.c:3919: error: dereferencing pointer to incomplete type
dbdimp.c:3919: error: request for member âav_attrâ in something not a structure or union
dbdimp.c:3919: error: array subscript is not an integer
dbdimp.c:3920: error: dereferencing pointer to incomplete type
dbdimp.c:3920: error: request for member âav_attrâ in something not a structure or union
dbdimp.c:3920: error: array subscript is not an integer
dbdimp.c:3923: error: âresâ undeclared (first use in this function)
dbdimp.c:3929: warning: passing argument 1 of âmysql_dr_errorâ from incompatible pointer type
dbdimp.c:3929: error: too few arguments to function âmysql_dr_errorâ
dbdimp.c:3942: error: âstruct sql_type_info_sâ has no member named ânameâ
dbdimp.c:3942: error: âstruct sql_type_info_sâ has no member named ânameâ
dbdimp.c:3942: warning: passing argument 1 of âstrlenâ from incompatible pointer type
dbdimp.c:3942: warning: passing argument 2 of âPerl_newSVpvâ from incompatible pointer type
dbdimp.c:3946: error: âstruct sql_type_info_sâ has no member named âtableâ
dbdimp.c:3946: error: âstruct sql_type_info_sâ has no member named âtableâ
dbdimp.c:3946: warning: passing argument 1 of âstrlenâ from incompatible pointer type
dbdimp.c:3946: warning: passing argument 2 of âPerl_newSVpvâ from incompatible pointer type
dbdimp.c:3950: error: âstruct sql_type_info_sâ has no member named âtypeâ
dbdimp.c:3950: warning: passing argument 2 of âPerl_newSVivâ makes integer from pointer without a cast
dbdimp.c:3954: error: âstruct sql_type_info_sâ has no member named âtypeâ
dbdimp.c:3954: warning: passing argument 1 of ânative2sqlâ makes integer from pointer without a cast
dbdimp.c:3957: error: âstruct sql_type_info_sâ has no member named âflagsâ
dbdimp.c:3961: error: âstruct sql_type_info_sâ has no member named âflagsâ
dbdimp.c:3965: error: âstruct sql_type_info_sâ has no member named âflagsâ
dbdimp.c:3969: error: âstruct sql_type_info_sâ has no member named âlengthâ
dbdimp.c:3969: warning: passing argument 2 of âPerl_newSVivâ makes integer from pointer without a cast
dbdimp.c:3973: error: âstruct sql_type_info_sâ has no member named âtypeâ
dbdimp.c:3973: warning: passing argument 1 of ânative2sqlâ makes integer from pointer without a cast
dbdimp.c:3977: error: âstruct sql_type_info_sâ has no member named âtypeâ
dbdimp.c:3977: warning: passing argument 1 of ânative2sqlâ makes integer from pointer without a cast
dbdimp.c:3981: error: âstruct sql_type_info_sâ has no member named âmax_lengthâ
dbdimp.c:3981: warning: passing argument 2 of âPerl_newSVivâ makes integer from pointer without a cast
dbdimp.c:3993: error: âstruct sql_type_info_sâ has no member named âflagsâ
dbdimp.c:3993: error: âPRI_KEY_FLAGâ undeclared (first use in this function)
dbdimp.c:3993: error: âUNIQUE_KEY_FLAGâ undeclared (first use in this function)
dbdimp.c:3993: error: invalid operands to binary |
dbdimp.c:3993: error: âMULTIPLE_KEY_FLAGâ undeclared (first use in this function)
dbdimp.c:3993: error: invalid operands to binary |
dbdimp.c:3993: error: invalid operands to binary &
dbdimp.c:3997: error: âstruct sql_type_info_sâ has no member named âflagsâ
dbdimp.c:4001: error: âstruct sql_type_info_sâ has no member named âdecimalsâ
dbdimp.c:4001: warning: passing argument 2 of âPerl_newSVivâ makes integer from pointer without a cast
dbdimp.c:4005: error: âstruct sql_type_info_sâ has no member named âlengthâ
dbdimp.c:4005: error: âstruct sql_type_info_sâ has no member named âmax_lengthâ
dbdimp.c:4005: error: âstruct sql_type_info_sâ has no member named âlengthâ
dbdimp.c:4005: error: âstruct sql_type_info_sâ has no member named âmax_lengthâ
dbdimp.c:4005: warning: passing argument 2 of âPerl_newSVivâ makes integer from pointer without a cast
dbdimp.c:4020: error: dereferencing pointer to incomplete type
dbdimp.c:4020: error: request for member âav_attrâ in something not a structure or union
dbdimp.c:4020: error: array subscript is not an integer
dbdimp.c: In function âmysql_st_FETCH_attribâ:
dbdimp.c:4069: error: dereferencing pointer to incomplete type
dbdimp.c:4069: error: request for member âresultâ in something not a structure or union
dbdimp.c:4071: error: dereferencing pointer to incomplete type
dbdimp.c:4071: error: request for member âresultâ in something not a structure or union
dbdimp.c:4075: error: dereferencing pointer to incomplete type
dbdimp.c:4075: error: request for member âresultâ in something not a structure or union
dbdimp.c:4079: error: dereferencing pointer to incomplete type
dbdimp.c:4079: error: request for member âcomâ in something not a structure or union
dbdimp.c:4079: error: request for member ânum_paramsâ in something not a structure or union
dbdimp.c:4084: error: dereferencing pointer to incomplete type
dbdimp.c:4084: error: request for member âcomâ in something not a structure or union
dbdimp.c:4084: error: request for member ânum_paramsâ in something not a structure or union
dbdimp.c:4084: warning: comparison between pointer and integer
dbdimp.c:4087: error: dereferencing pointer to incomplete type
dbdimp.c:4087: error: request for member âparamsâ in something not a structure or union
dbdimp.c:4087: error: âstruct sql_type_info_sâ has no member named âvalueâ
dbdimp.c:4087: warning: passing argument 2 of âPerl_newSVsvâ from incompatible pointer type
dbdimp.c:4096: error: dereferencing pointer to incomplete type
dbdimp.c:4096: error: request for member âresultâ in something not a structure or union
dbdimp.c:4100: error: dereferencing pointer to incomplete type
dbdimp.c:4100: error: request for member âresultâ in something not a structure or union
dbdimp.c:4106: error: dereferencing pointer to incomplete type
dbdimp.c:4106: error: request for member âresultâ in something not a structure or union
dbdimp.c:4110: error: dereferencing pointer to incomplete type
dbdimp.c:4110: error: request for member âresultâ in something not a structure or union
dbdimp.c:4114: error: dereferencing pointer to incomplete type
dbdimp.c:4114: error: request for member âresultâ in something not a structure or union
dbdimp.c:4116: error: dereferencing pointer to incomplete type
dbdimp.c:4116: error: request for member âresultâ in something not a structure or union
dbdimp.c:4118: error: dereferencing pointer to incomplete type
dbdimp.c:4118: error: request for member âresultâ in something not a structure or union
dbdimp.c:4120: error: dereferencing pointer to incomplete type
dbdimp.c:4120: error: request for member âresultâ in something not a structure or union
dbdimp.c:4120: warning: passing argument 2 of âPerl_newSVivâ makes integer from pointer without a cast
dbdimp.c:4124: error: dereferencing pointer to incomplete type
dbdimp.c:4124: error: request for member âresultâ in something not a structure or union
dbdimp.c:4131: error: dereferencing pointer to incomplete type
dbdimp.c:4131: error: request for member âinsertidâ in something not a structure or union
dbdimp.c:4133: error: dereferencing pointer to incomplete type
dbdimp.c:4133: error: request for member âinsertidâ in something not a structure or union
dbdimp.c:4138: error: dereferencing pointer to incomplete type
dbdimp.c:4138: error: request for member âresultâ in something not a structure or union
dbdimp.c:4142: error: dereferencing pointer to incomplete type
dbdimp.c:4142: error: request for member âresultâ in something not a structure or union
dbdimp.c:4144: error: dereferencing pointer to incomplete type
dbdimp.c:4144: error: request for member âresultâ in something not a structure or union
dbdimp.c:4146: error: dereferencing pointer to incomplete type
dbdimp.c:4146: error: request for member âuse_mysql_use_resultâ in something not a structure or union
dbdimp.c:4158: error: dereferencing pointer to incomplete type
dbdimp.c:4158: error: request for member âresultâ in something not a structure or union
dbdimp.c: In function âmysql_bind_phâ:
dbdimp.c:4237: error: dereferencing pointer to incomplete type
dbdimp.c:4237: error: request for member âcomâ in something not a structure or union
dbdimp.c:4237: error: request for member ânum_paramsâ in something not a structure or union
dbdimp.c:4237: warning: comparison between pointer and integer
dbdimp.c:4244: error: too few arguments to function âmysql_dr_errorâ
dbdimp.c:4271: error: too few arguments to function âmysql_dr_errorâ
dbdimp.c:4283: error: too few arguments to function âmysql_dr_errorâ
dbdimp.c:4288: error: dereferencing pointer to incomplete type
dbdimp.c:4288: error: request for member âparamsâ in something not a structure or union
dbdimp.c:4288: warning: passing argument 1 of âbind_paramâ from incompatible pointer type
dbdimp.c: In function âmysql_db_reconnectâ:
dbdimp.c:4407: error: âMYSQLâ undeclared (first use in this function)
dbdimp.c:4407: error: syntax error before âsave_socketâ
dbdimp.c:4417: error: dereferencing pointer to incomplete type
dbdimp.c:4417: error: request for member âmysqlâ in something not a structure or union
dbdimp.c:4417: error: âCR_SERVER_GONE_ERRORâ undeclared (first use in this function)
dbdimp.c:4417: warning: comparison between pointer and integer
dbdimp.c:4421: error: dereferencing pointer to incomplete type
dbdimp.c:4421: error: request for member âcomâ in something not a structure or union
dbdimp.c:4421: error: request for member âstdâ in something not a structure or union
dbdimp.c:4421: error: request for member âflagsâ in something not a structure or union
dbdimp.c:4421: error: invalid operands to binary &
dbdimp.c:4421: error: dereferencing pointer to incomplete type
dbdimp.c:4421: error: request for member âauto_reconnectâ in something not a structure or union
dbdimp.c:4435: error: âsave_socketâ undeclared (first use in this function)
dbdimp.c:4435: error: dereferencing pointer to incomplete type
dbdimp.c:4435: error: request for member âmysqlâ in something not a structure or union
dbdimp.c:4436: error: dereferencing pointer to incomplete type
dbdimp.c:4436: error: request for member âmysqlâ in something not a structure or union
dbdimp.c:4436: warning: passing argument 3 of â__builtin___memcpy_chkâ makes integer from pointer without a cast
dbdimp.c:4436: error: dereferencing pointer to incomplete type
dbdimp.c:4436: error: request for member âmysqlâ in something not a structure or union
dbdimp.c:4436: warning: passing argument 3 of â__memcpy_ichkâ makes integer from pointer without a cast
dbdimp.c:4437: error: dereferencing pointer to incomplete type
dbdimp.c:4437: error: request for member âmysqlâ in something not a structure or union
dbdimp.c:4437: error: dereferencing pointer to incomplete type
dbdimp.c:4437: error: request for member âmysqlâ in something not a structure or union
dbdimp.c:4437: error: dereferencing pointer to incomplete type
dbdimp.c:4437: error: request for member âmysqlâ in something not a structure or union
dbdimp.c:4437: error: dereferencing pointer to incomplete type
dbdimp.c:4437: error: request for member âmysqlâ in something not a structure or union
dbdimp.c:4437: error: dereferencing pointer to incomplete type
dbdimp.c:4437: error: request for member âmysqlâ in something not a structure or union
dbdimp.c:4437: error: dereferencing pointer to incomplete type
dbdimp.c:4437: error: request for member âmysqlâ in something not a structure or union
dbdimp.c:4437: error: dereferencing pointer to incomplete type
dbdimp.c:4437: error: request for member âmysqlâ in something not a structure or union
dbdimp.c:4437: error: dereferencing pointer to incomplete type
dbdimp.c:4437: error: request for member âmysqlâ in something not a structure or union
dbdimp.c:4437: warning: passing argument 3 of â__builtin___memset_chkâ makes integer from pointer without a cast
dbdimp.c:4437: error: dereferencing pointer to incomplete type
dbdimp.c:4437: error: request for member âmysqlâ in something not a structure or union
dbdimp.c:4437: error: dereferencing pointer to incomplete type
dbdimp.c:4437: error: request for member âmysqlâ in something not a structure or union
dbdimp.c:4437: warning: passing argument 3 of â__memset_ichkâ makes integer from pointer without a cast
dbdimp.c:4441: error: dereferencing pointer to incomplete type
dbdimp.c:4441: error: request for member âmysqlâ in something not a structure or union
dbdimp.c:4441: error: dereferencing pointer to incomplete type
dbdimp.c:4441: error: request for member âmysqlâ in something not a structure or union
dbdimp.c:4445: warning: passing argument 3 of âmysql_dr_errorâ makes pointer from integer without a cast
dbdimp.c:4445: error: too few arguments to function âmysql_dr_errorâ
dbdimp.c:4447: error: dereferencing pointer to incomplete type
dbdimp.c:4447: error: request for member âmysqlâ in something not a structure or union
dbdimp.c:4447: error: dereferencing pointer to incomplete type
dbdimp.c:4447: error: request for member âmysqlâ in something not a structure or union
dbdimp.c:4447: error: dereferencing pointer to incomplete type
dbdimp.c:4447: error: request for member âmysqlâ in something not a structure or union
dbdimp.c:4447: warning: passing argument 3 of â__builtin___memcpy_chkâ makes integer from pointer without a cast
dbdimp.c:4447: error: dereferencing pointer to incomplete type
dbdimp.c:4447: error: request for member âmysqlâ in something not a structure or union
dbdimp.c:4447: warning: passing argument 3 of â__memcpy_ichkâ makes integer from pointer without a cast
dbdimp.c:4448: error: dereferencing pointer to incomplete type
dbdimp.c:4448: error: request for member âstatsâ in something not a structure or union
dbdimp.c:4448: error: request for member âauto_reconnects_failedâ in something not a structure or union
dbdimp.c:4448: error: wrong type argument to increment
dbdimp.c:4451: error: dereferencing pointer to incomplete type
dbdimp.c:4451: error: request for member âstatsâ in something not a structure or union
dbdimp.c:4451: error: request for member âauto_reconnects_okâ in something not a structure or union
dbdimp.c:4451: error: wrong type argument to increment
dbdimp.c: In function âmysql_db_quoteâ:
dbdimp.c:4608: error: dereferencing pointer to incomplete type
dbdimp.c:4608: error: request for member âmysqlâ in something not a structure or union
dbdimp.c: In function âmysql_db_last_insert_idâ:
dbdimp.c:4623: error: dereferencing pointer to incomplete type
dbdimp.c:4623: error: request for member âmysqlâ in something not a structure or union
make: *** [dbdimp.o] Error 1
/usr/bin/make -- NOT OK
Running make test
Can't test without successful make
Running make install
make had returned bad status, install seems impossible
Bundle summary: The following items in bundle Bundle::DBD::mysql had
installation problems:
DBD::mysql
Failed during this command:
CAPTTOFU/DBD-mysql-4.003.tar.gz : make NO
cpan[2]>