All pastes #394030 Raw Edit

missing features.h f

public text v1 · immutable
·published 2007-03-14 00:23 UTC
rendered paste body
( cd build ; . ../setup-env ; \
  bitbake openmoko-devel-image )
NOTE: Psyco JIT Compiler (http://psyco.sf.net) not available. Install it to increase performance.
NOTE: Using cache in '/home/moko/build/tmp/cache/fic-gta01'
NOTE: Handling BitBake files: \ (3510/4321) [81 %]ERROR: Fetch failed: Git: export PATH=/home/moko/build/tmp/staging/powerpc-darwin/bin/arm-linux:/home/moko/build/tmp/staging/powerpc-darwin/bin:/home/moko/build/tmp/cross/bin:/home/moko/bitbake/bin:/Library/Frameworks/Python.framework/Versions/Current/bin:/sw/bin:/sw/sbin:/stuff/bitbake/bin:/bin:/sbin:/usr/bin:/usr/sbin:.:/usr/local/bin:/usr/local/mysql/bin:/System/Library/Frameworks/JavaVM.framework/Versions/1.5.0/Home/Commands:/Users/lavar/ccl:/usr/X11R6/bin; git ls-remote git://www.denx.de/git/u-boot.git/ master failed while parsing /home/moko/openembedded/packages/uboot/uboot-gta01_svn.bb
NOTE: Handling BitBake files: - (4317/4321) [99 %]ERROR: Fetch failed: Git: export PATH=/home/moko/build/tmp/staging/powerpc-darwin/bin/arm-linux:/home/moko/build/tmp/staging/powerpc-darwin/bin:/home/moko/build/tmp/cross/bin:/home/moko/bitbake/bin:/Library/Frameworks/Python.framework/Versions/Current/bin:/sw/bin:/sw/sbin:/stuff/bitbake/bin:/bin:/sbin:/usr/bin:/usr/sbin:.:/usr/local/bin:/usr/local/mysql/bin:/System/Library/Frameworks/JavaVM.framework/Versions/1.5.0/Home/Commands:/Users/lavar/ccl:/usr/X11R6/bin; git ls-remote git://www.denx.de/git/u-boot.git/ master failed while parsing /home/moko/oe/packages/uboot/uboot-gta01_svn.bb
NOTE: Handling BitBake files: | (4321/4321) [100 %]
NOTE: Parsing finished. 4131 cached, 0 parsed, 188 skipped, 0 masked.

NOTE: build 200703132014: started

OE Build Configuration:
BB_VERSION     = "1.6.7"
OE_REVISION    = "<unknown>"
TARGET_ARCH    = "arm"
TARGET_OS      = "linux"
MACHINE        = "fic-gta01"
DISTRO         = "openmoko"
DISTRO_VERSION = ".dev-snapshot-20070314"
TARGET_FPU     = "soft"

NOTE: package ipkg-native-0.99.163: started
NOTE: package ipkg-native-0.99.163-r1: task do_compile: started
ERROR: function do_compile failed
ERROR: log data follows (/home/moko/build/tmp/work/powerpc-darwin/ipkg-native-0.99.163-r1/temp/log.do_compile.28112)
| NOTE: make
| make  all-recursive
| Making all in etc
| make[3]: Nothing to be done for `all'.
| Making all in familiar
| make[3]: Nothing to be done for `all'.
| Making all in libbb
| if /bin/sh ../powerpc-darwin-libtool --tag=CC --mode=compile ccache gcc -DHAVE_CONFIG_H -I. -I/home/moko/build/tmp/work/powerpc-darwin/ipkg-native-0.99.163-r1/ipkg-0.99.163/libbb -I..   -isystem/home/moko/build/tmp/staging/powerpc-darwin/include -g -O -Wall -DHOST_CPU_STR=\"powerpc\" -DBUILD_CPU=powerpc -isystem/home/moko/build/tmp/staging/powerpc-darwin/include -O2 -MT libbb_la-gz_open.lo -MD -MP -MF ".deps/libbb_la-gz_open.Tpo" -c -o libbb_la-gz_open.lo `test -f 'gz_open.c' || echo '/home/moko/build/tmp/work/powerpc-darwin/ipkg-native-0.99.163-r1/ipkg-0.99.163/libbb/'`gz_open.c; \
| then mv -f ".deps/libbb_la-gz_open.Tpo" ".deps/libbb_la-gz_open.Plo"; else rm -f ".deps/libbb_la-gz_open.Tpo"; exit 1; fi
|  ccache gcc -DHAVE_CONFIG_H -I. -I/home/moko/build/tmp/work/powerpc-darwin/ipkg-native-0.99.163-r1/ipkg-0.99.163/libbb -I.. -isystem/home/moko/build/tmp/staging/powerpc-darwin/include -g -O -Wall -DHOST_CPU_STR=\"powerpc\" -DBUILD_CPU=powerpc -isystem/home/moko/build/tmp/staging/powerpc-darwin/include -O2 -MT libbb_la-gz_open.lo -MD -MP -MF .deps/libbb_la-gz_open.Tpo -c gz_open.c  -fno-common -DPIC -o .libs/libbb_la-gz_open.o
| In file included from gz_open.c:30:
| libbb.h:53:22: error: features.h: No such file or directory
| make[3]: *** [libbb_la-gz_open.lo] Error 1
| make[2]: *** [all-recursive] Error 1
| make[1]: *** [all] Error 2
| FATAL: oe_runmake failed
NOTE: Task failed: /home/moko/build/tmp/work/powerpc-darwin/ipkg-native-0.99.163-r1/temp/log.do_compile.28112
NOTE: package ipkg-native-0.99.163-r1: task do_compile: failed
ERROR: TaskFailed event exception, aborting
NOTE: package ipkg-native-0.99.163: failed
ERROR: Build of openmoko-devel-image failed
make: *** [openmoko-devel-image] Error 1