rendered paste bodyThis file contains any messages produced by compilers while
running configure, to aid debugging if configure makes a mistake.
It was created by configure, which was
generated by GNU Autoconf 2.59. Invocation command line was
$ ./configure
## --------- ##
## Platform. ##
## --------- ##
hostname = debian-br-cdd
uname -m = i686
uname -r = 2.6.8-2-386
uname -s = Linux
uname -v = #1 Tue Aug 16 12:46:35 UTC 2005
/usr/bin/uname -p = unknown
/bin/uname -X = unknown
/bin/arch = i686
/usr/bin/arch -k = unknown
/usr/convex/getsysinfo = unknown
hostinfo = unknown
/bin/machine = unknown
/usr/bin/oslevel = unknown
/bin/universe = unknown
PATH: /usr/local/bin
PATH: /usr/bin
PATH: /bin
PATH: /usr/bin/X11
PATH: /usr/games
## ----------- ##
## Core tests. ##
## ----------- ##
configure:1543: checking build system type
configure:1561: result: i686-pc-linux-gnu
configure:1569: checking host system type
configure:1583: result: i686-pc-linux-gnu
configure:1591: checking target system type
configure:1605: result: i686-pc-linux-gnu
configure:1652: checking for a BSD-compatible install
configure:1707: result: /usr/bin/install -c
configure:1722: checking for -p flag to install
configure:1735: result: yes
configure:1746: checking whether build environment is sane
configure:1789: result: yes
configure:1809: checking for gawk
configure:1838: result: no
configure:1809: checking for mawk
configure:1825: found /usr/bin/mawk
configure:1835: result: mawk
configure:1845: checking whether make sets $(MAKE)
configure:1865: result: yes
configure:2078: checking for style of include used by make
configure:2106: result: GNU
configure:2253: checking for gcc
configure:2269: found /usr/bin/gcc
configure:2279: result: gcc
configure:2523: checking for C compiler version
configure:2526: gcc --version </dev/null >&5
gcc (GCC) 4.1.2 20061115 (prerelease) (Debian 4.1.1-21)
Copyright (C) 2006 Free Software Foundation, Inc.
This is free software; see the source for copying conditions. There is NO
warranty; not even for MERCHANTABILITY or FITNESS FOR A PARTICULAR PURPOSE.
configure:2529: $? = 0
configure:2531: gcc -v </dev/null >&5
Using built-in specs.
Target: i486-linux-gnu
Configured with: ../src/configure -v --enable-languages=c,c++,fortran,objc,obj-c++,treelang --prefix=/usr --enable-shared --with-system-zlib --libexecdir=/usr/lib --without-included-gettext --enable-threads=posix --enable-nls --program-suffix=-4.1 --enable-__cxa_atexit --enable-clocale=gnu --enable-libstdcxx-debug --enable-mpfr --with-tune=i686 --enable-checking=release i486-linux-gnu
Thread model: posix
gcc version 4.1.2 20061115 (prerelease) (Debian 4.1.1-21)
configure:2534: $? = 0
configure:2536: gcc -V </dev/null >&5
gcc: '-V' option must have argument
configure:2539: $? = 1
configure:2562: checking for C compiler default output file name
configure:2565: gcc conftest.c >&5
configure:2568: $? = 0
configure:2614: result: a.out
configure:2619: checking whether the C compiler works
configure:2625: ./a.out
configure:2628: $? = 0
configure:2645: result: yes
configure:2652: checking whether we are cross compiling
configure:2654: result: no
configure:2657: checking for suffix of executables
configure:2659: gcc -o conftest conftest.c >&5
configure:2662: $? = 0
configure:2687: result:
configure:2693: checking for suffix of object files
configure:2714: gcc -c conftest.c >&5
configure:2717: $? = 0
configure:2739: result: o
configure:2743: checking whether we are using the GNU C compiler
configure:2767: gcc -c conftest.c >&5
configure:2773: $? = 0
configure:2777: test -z
|| test ! -s conftest.err
configure:2780: $? = 0
configure:2783: test -s conftest.o
configure:2786: $? = 0
configure:2799: result: yes
configure:2805: checking whether gcc accepts -g
configure:2826: gcc -c -g conftest.c >&5
configure:2832: $? = 0
configure:2836: test -z
|| test ! -s conftest.err
configure:2839: $? = 0
configure:2842: test -s conftest.o
configure:2845: $? = 0
configure:2856: result: yes
configure:2873: checking for gcc option to accept ANSI C
configure:2943: gcc -c conftest.c >&5
configure:2949: $? = 0
configure:2953: test -z
|| test ! -s conftest.err
configure:2956: $? = 0
configure:2959: test -s conftest.o
configure:2962: $? = 0
configure:2980: result: none needed
configure:2998: gcc -c conftest.c >&5
conftest.c:2: error: expected '=', ',', ';', 'asm' or '__attribute__' before 'me'
configure:3004: $? = 1
configure: failed program was:
| #ifndef __cplusplus
| choke me
| #endif
configure:3139: checking dependency style of gcc
configure:3222: result: gcc3
configure:3245: checking how to run the C preprocessor
configure:3280: gcc -E conftest.c
configure:3286: $? = 0
configure:3318: gcc -E conftest.c
conftest.c:11:28: error: ac_nonexistent.h: No such file or directory
configure:3324: $? = 1
configure: failed program was:
| /* confdefs.h. */
|
| #define PACKAGE_NAME ""
| #define PACKAGE_TARNAME ""
| #define PACKAGE_VERSION ""
| #define PACKAGE_STRING ""
| #define PACKAGE_BUGREPORT ""
| #define PACKAGE "karamba"
| #define VERSION "0.17"
| /* end confdefs.h. */
| #include <ac_nonexistent.h>
configure:3363: result: gcc -E
configure:3387: gcc -E conftest.c
configure:3393: $? = 0
configure:3425: gcc -E conftest.c
conftest.c:11:28: error: ac_nonexistent.h: No such file or directory
configure:3431: $? = 1
configure: failed program was:
| /* confdefs.h. */
|
| #define PACKAGE_NAME ""
| #define PACKAGE_TARNAME ""
| #define PACKAGE_VERSION ""
| #define PACKAGE_STRING ""
| #define PACKAGE_BUGREPORT ""
| #define PACKAGE "karamba"
| #define VERSION "0.17"
| /* end confdefs.h. */
| #include <ac_nonexistent.h>
configure:3555: checking for g++
configure:3571: found /usr/bin/g++
configure:3581: result: g++
configure:3597: checking for C++ compiler version
configure:3600: g++ --version </dev/null >&5
g++ (GCC) 4.1.2 20061115 (prerelease) (Debian 4.1.1-21)
Copyright (C) 2006 Free Software Foundation, Inc.
This is free software; see the source for copying conditions. There is NO
warranty; not even for MERCHANTABILITY or FITNESS FOR A PARTICULAR PURPOSE.
configure:3603: $? = 0
configure:3605: g++ -v </dev/null >&5
Using built-in specs.
Target: i486-linux-gnu
Configured with: ../src/configure -v --enable-languages=c,c++,fortran,objc,obj-c++,treelang --prefix=/usr --enable-shared --with-system-zlib --libexecdir=/usr/lib --without-included-gettext --enable-threads=posix --enable-nls --program-suffix=-4.1 --enable-__cxa_atexit --enable-clocale=gnu --enable-libstdcxx-debug --enable-mpfr --with-tune=i686 --enable-checking=release i486-linux-gnu
Thread model: posix
gcc version 4.1.2 20061115 (prerelease) (Debian 4.1.1-21)
configure:3608: $? = 0
configure:3610: g++ -V </dev/null >&5
g++: '-V' option must have argument
configure:3613: $? = 1
configure:3616: checking whether we are using the GNU C++ compiler
configure:3640: g++ -c conftest.cc >&5
configure:3646: $? = 0
configure:3650: test -z
|| test ! -s conftest.err
configure:3653: $? = 0
configure:3656: test -s conftest.o
configure:3659: $? = 0
configure:3672: result: yes
configure:3678: checking whether g++ accepts -g
configure:3699: g++ -c -g conftest.cc >&5
configure:3705: $? = 0
configure:3709: test -z
|| test ! -s conftest.err
configure:3712: $? = 0
configure:3715: test -s conftest.o
configure:3718: $? = 0
configure:3729: result: yes
configure:3771: g++ -c conftest.cc >&5
configure:3777: $? = 0
configure:3781: test -z
|| test ! -s conftest.err
configure:3784: $? = 0
configure:3787: test -s conftest.o
configure:3790: $? = 0
configure:3816: g++ -c conftest.cc >&5
conftest.cc: In function 'int main()':
conftest.cc:15: error: 'exit' was not declared in this scope
configure:3822: $? = 1
configure: failed program was:
| /* confdefs.h. */
|
| #define PACKAGE_NAME ""
| #define PACKAGE_TARNAME ""
| #define PACKAGE_VERSION ""
| #define PACKAGE_STRING ""
| #define PACKAGE_BUGREPORT ""
| #define PACKAGE "karamba"
| #define VERSION "0.17"
| /* end confdefs.h. */
|
| int
| main ()
| {
| exit (42);
| ;
| return 0;
| }
configure:3771: g++ -c conftest.cc >&5
configure:3777: $? = 0
configure:3781: test -z
|| test ! -s conftest.err
configure:3784: $? = 0
configure:3787: test -s conftest.o
configure:3790: $? = 0
configure:3816: g++ -c conftest.cc >&5
configure:3822: $? = 0
configure:3826: test -z
|| test ! -s conftest.err
configure:3829: $? = 0
configure:3832: test -s conftest.o
configure:3835: $? = 0
configure:3860: checking dependency style of g++
configure:3943: result: gcc3
configure:4269: checking whether g++ supports -Wundef
configure:4305: rm -rf SunWS_cache; g++ -o conftest -pedantic -W -Wpointer-arith -Wmissing-prototypes -ansi -D_XOPEN_SOURCE=500 -D_BSD_SOURCE -Wcast-align -Wconversion -O2 -Wundef conftest.cc 1>&5
cc1plus: warning: command line option "-Wmissing-prototypes" is valid for Ada/C/ObjC but not for C++
configure:4311: $? = 0
configure:4315: test -z
|| test ! -s conftest.err
configure:4318: $? = 0
configure:4321: test -s conftest
configure:4324: $? = 0
configure:4345: result: yes
configure:4357: checking whether g++ supports -Wno-long-long
configure:4393: rm -rf SunWS_cache; g++ -o conftest -Wundef -pedantic -W -Wpointer-arith -Wmissing-prototypes -ansi -D_XOPEN_SOURCE=500 -D_BSD_SOURCE -Wcast-align -Wconversion -O2 -Wno-long-long conftest.cc 1>&5
cc1plus: warning: command line option "-Wmissing-prototypes" is valid for Ada/C/ObjC but not for C++
configure:4399: $? = 0
configure:4403: test -z
|| test ! -s conftest.err
configure:4406: $? = 0
configure:4409: test -s conftest
configure:4412: $? = 0
configure:4433: result: yes
configure:4445: checking whether g++ supports -Wnon-virtual-dtor
configure:4481: rm -rf SunWS_cache; g++ -o conftest -Wno-long-long -Wundef -pedantic -W -Wpointer-arith -Wmissing-prototypes -ansi -D_XOPEN_SOURCE=500 -D_BSD_SOURCE -Wcast-align -Wconversion -O2 -Wnon-virtual-dtor conftest.cc 1>&5
cc1plus: warning: command line option "-Wmissing-prototypes" is valid for Ada/C/ObjC but not for C++
configure:4487: $? = 0
configure:4491: test -z
|| test ! -s conftest.err
configure:4494: $? = 0
configure:4497: test -s conftest
configure:4500: $? = 0
configure:4521: result: yes
configure:4541: checking whether g++ supports -fno-exceptions
configure:4577: rm -rf SunWS_cache; g++ -o conftest -Wnon-virtual-dtor -Wno-long-long -Wundef -pedantic -W -Wpointer-arith -Wmissing-prototypes -ansi -D_XOPEN_SOURCE=500 -D_BSD_SOURCE -Wcast-align -Wconversion -O2 -fno-exceptions conftest.cc 1>&5
cc1plus: warning: command line option "-Wmissing-prototypes" is valid for Ada/C/ObjC but not for C++
configure:4583: $? = 0
configure:4587: test -z
|| test ! -s conftest.err
configure:4590: $? = 0
configure:4593: test -s conftest
configure:4596: $? = 0
configure:4617: result: yes
configure:4629: checking whether g++ supports -fno-check-new
configure:4665: rm -rf SunWS_cache; g++ -o conftest -Wnon-virtual-dtor -Wno-long-long -Wundef -pedantic -W -Wpointer-arith -Wmissing-prototypes -ansi -D_XOPEN_SOURCE=500 -D_BSD_SOURCE -Wcast-align -Wconversion -O2 -fno-exceptions -fno-check-new conftest.cc 1>&5
cc1plus: warning: command line option "-Wmissing-prototypes" is valid for Ada/C/ObjC but not for C++
configure:4671: $? = 0
configure:4675: test -z
|| test ! -s conftest.err
configure:4678: $? = 0
configure:4681: test -s conftest
configure:4684: $? = 0
configure:4705: result: yes
configure:4717: checking whether g++ supports -fexceptions
configure:4753: rm -rf SunWS_cache; g++ -o conftest -Wnon-virtual-dtor -Wno-long-long -Wundef -pedantic -W -Wpointer-arith -Wmissing-prototypes -ansi -D_XOPEN_SOURCE=500 -D_BSD_SOURCE -Wcast-align -Wconversion -O2 -fno-exceptions -fno-check-new -fexceptions conftest.cc 1>&5
cc1plus: warning: command line option "-Wmissing-prototypes" is valid for Ada/C/ObjC but not for C++
configure:4759: $? = 0
configure:4763: test -z
|| test ! -s conftest.err
configure:4766: $? = 0
configure:4769: test -s conftest
configure:4772: $? = 0
configure:4793: result: yes
configure:5454: checking how to run the C++ preprocessor
configure:5485: g++ -E conftest.cc
configure:5491: $? = 0
configure:5523: g++ -E conftest.cc
conftest.cc:14:28: error: ac_nonexistent.h: No such file or directory
configure:5529: $? = 1
configure: failed program was:
| /* confdefs.h. */
|
| #define PACKAGE_NAME ""
| #define PACKAGE_TARNAME ""
| #define PACKAGE_VERSION ""
| #define PACKAGE_STRING ""
| #define PACKAGE_BUGREPORT ""
| #define PACKAGE "karamba"
| #define VERSION "0.17"
| #ifdef __cplusplus
| extern "C" void std::exit (int) throw (); using std::exit;
| #endif
| /* end confdefs.h. */
| #include <ac_nonexistent.h>
configure:5568: result: g++ -E
configure:5592: g++ -E conftest.cc
configure:5598: $? = 0
configure:5630: g++ -E conftest.cc
conftest.cc:14:28: error: ac_nonexistent.h: No such file or directory
configure:5636: $? = 1
configure: failed program was:
| /* confdefs.h. */
|
| #define PACKAGE_NAME ""
| #define PACKAGE_TARNAME ""
| #define PACKAGE_VERSION ""
| #define PACKAGE_STRING ""
| #define PACKAGE_BUGREPORT ""
| #define PACKAGE "karamba"
| #define VERSION "0.17"
| #ifdef __cplusplus
| extern "C" void std::exit (int) throw (); using std::exit;
| #endif
| /* end confdefs.h. */
| #include <ac_nonexistent.h>
configure:5702: checking whether g++ supports -frepo
configure:5738: rm -rf SunWS_cache; g++ -o conftest -Wnon-virtual-dtor -Wno-long-long -Wundef -pedantic -W -Wpointer-arith -Wmissing-prototypes -ansi -D_XOPEN_SOURCE=500 -D_BSD_SOURCE -Wcast-align -Wconversion -O2 -fno-exceptions -fno-check-new -frepo conftest.cc 1>&5
cc1plus: warning: command line option "-Wmissing-prototypes" is valid for Ada/C/ObjC but not for C++
In file included from <built-in>:0:
<built-in>:0: warning: -frepo must be used with -c
configure:5744: $? = 0
configure:5748: test -z
|| test ! -s conftest.err
configure:5751: $? = 0
configure:5754: test -s conftest
configure:5757: $? = 0
configure:5778: result: yes
configure:5996: result: not using lib directory suffix
configure:6052: checking for ld used by GCC
configure:6116: result: /usr/bin/ld
configure:6125: checking if the linker (/usr/bin/ld) is GNU ld
GNU ld version 2.17 Debian GNU/Linux
configure:6137: result: yes
configure:6142: checking for /usr/bin/ld option to reload object files
configure:6149: result: -r
configure:6158: checking for BSD-compatible nm
configure:6193: result: /usr/bin/nm -B
configure:6197: checking for a sed that does not truncate output
configure:6273: result:
configure:6276: checking whether ln -s works
configure:6280: result: yes
configure:6287: checking how to recognise dependant libraries
configure:6474: result: pass_all
configure:6544: gcc -c -ansi -W -pedantic -Wshadow -Wpointer-arith -Wmissing-prototypes -D_XOPEN_SOURCE=500 -D_BSD_SOURCE -O2 conftest.c >&5
configure:6547: $? = 0
configure:6643: checking for egrep
configure:6653: result: grep -E
configure:6658: checking for ANSI C header files
configure:6683: gcc -c -ansi -W -pedantic -Wshadow -Wpointer-arith -Wmissing-prototypes -D_XOPEN_SOURCE=500 -D_BSD_SOURCE -O2 conftest.c >&5
configure:6689: $? = 0
configure:6693: test -z
|| test ! -s conftest.err
configure:6696: $? = 0
configure:6699: test -s conftest.o
configure:6702: $? = 0
configure:6788: gcc -o conftest -ansi -W -pedantic -Wshadow -Wpointer-arith -Wmissing-prototypes -D_XOPEN_SOURCE=500 -D_BSD_SOURCE -O2 conftest.c >&5
conftest.c: In function 'main':
conftest.c:33: warning: incompatible implicit declaration of built-in function 'exit'
configure:6791: $? = 0
configure:6793: ./conftest
configure:6796: $? = 0
configure:6811: result: yes
configure:6835: checking for sys/types.h
configure:6851: gcc -c -ansi -W -pedantic -Wshadow -Wpointer-arith -Wmissing-prototypes -D_XOPEN_SOURCE=500 -D_BSD_SOURCE -O2 conftest.c >&5
configure:6857: $? = 0
configure:6861: test -z
|| test ! -s conftest.err
configure:6864: $? = 0
configure:6867: test -s conftest.o
configure:6870: $? = 0
configure:6881: result: yes
configure:6835: checking for sys/stat.h
configure:6851: gcc -c -ansi -W -pedantic -Wshadow -Wpointer-arith -Wmissing-prototypes -D_XOPEN_SOURCE=500 -D_BSD_SOURCE -O2 conftest.c >&5
configure:6857: $? = 0
configure:6861: test -z
|| test ! -s conftest.err
configure:6864: $? = 0
configure:6867: test -s conftest.o
configure:6870: $? = 0
configure:6881: result: yes
configure:6835: checking for stdlib.h
configure:6851: gcc -c -ansi -W -pedantic -Wshadow -Wpointer-arith -Wmissing-prototypes -D_XOPEN_SOURCE=500 -D_BSD_SOURCE -O2 conftest.c >&5
configure:6857: $? = 0
configure:6861: test -z
|| test ! -s conftest.err
configure:6864: $? = 0
configure:6867: test -s conftest.o
configure:6870: $? = 0
configure:6881: result: yes
configure:6835: checking for string.h
configure:6851: gcc -c -ansi -W -pedantic -Wshadow -Wpointer-arith -Wmissing-prototypes -D_XOPEN_SOURCE=500 -D_BSD_SOURCE -O2 conftest.c >&5
configure:6857: $? = 0
configure:6861: test -z
|| test ! -s conftest.err
configure:6864: $? = 0
configure:6867: test -s conftest.o
configure:6870: $? = 0
configure:6881: result: yes
configure:6835: checking for memory.h
configure:6851: gcc -c -ansi -W -pedantic -Wshadow -Wpointer-arith -Wmissing-prototypes -D_XOPEN_SOURCE=500 -D_BSD_SOURCE -O2 conftest.c >&5
configure:6857: $? = 0
configure:6861: test -z
|| test ! -s conftest.err
configure:6864: $? = 0
configure:6867: test -s conftest.o
configure:6870: $? = 0
configure:6881: result: yes
configure:6835: checking for strings.h
configure:6851: gcc -c -ansi -W -pedantic -Wshadow -Wpointer-arith -Wmissing-prototypes -D_XOPEN_SOURCE=500 -D_BSD_SOURCE -O2 conftest.c >&5
configure:6857: $? = 0
configure:6861: test -z
|| test ! -s conftest.err
configure:6864: $? = 0
configure:6867: test -s conftest.o
configure:6870: $? = 0
configure:6881: result: yes
configure:6835: checking for inttypes.h
configure:6851: gcc -c -ansi -W -pedantic -Wshadow -Wpointer-arith -Wmissing-prototypes -D_XOPEN_SOURCE=500 -D_BSD_SOURCE -O2 conftest.c >&5
configure:6857: $? = 0
configure:6861: test -z
|| test ! -s conftest.err
configure:6864: $? = 0
configure:6867: test -s conftest.o
configure:6870: $? = 0
configure:6881: result: yes
configure:6835: checking for stdint.h
configure:6851: gcc -c -ansi -W -pedantic -Wshadow -Wpointer-arith -Wmissing-prototypes -D_XOPEN_SOURCE=500 -D_BSD_SOURCE -O2 conftest.c >&5
configure:6857: $? = 0
configure:6861: test -z
|| test ! -s conftest.err
configure:6864: $? = 0
configure:6867: test -s conftest.o
configure:6870: $? = 0
configure:6881: result: yes
configure:6835: checking for unistd.h
configure:6851: gcc -c -ansi -W -pedantic -Wshadow -Wpointer-arith -Wmissing-prototypes -D_XOPEN_SOURCE=500 -D_BSD_SOURCE -O2 conftest.c >&5
configure:6857: $? = 0
configure:6861: test -z
|| test ! -s conftest.err
configure:6864: $? = 0
configure:6867: test -s conftest.o
configure:6870: $? = 0
configure:6881: result: yes
configure:6907: checking dlfcn.h usability
configure:6919: gcc -c -ansi -W -pedantic -Wshadow -Wpointer-arith -Wmissing-prototypes -D_XOPEN_SOURCE=500 -D_BSD_SOURCE -O2 conftest.c >&5
configure:6925: $? = 0
configure:6929: test -z
|| test ! -s conftest.err
configure:6932: $? = 0
configure:6935: test -s conftest.o
configure:6938: $? = 0
configure:6948: result: yes
configure:6952: checking dlfcn.h presence
configure:6962: gcc -E conftest.c
configure:6968: $? = 0
configure:6988: result: yes
configure:7023: checking for dlfcn.h
configure:7030: result: yes
configure:7047: checking the maximum length of command line arguments
configure:7095: result: 32768
configure:7106: checking command to parse /usr/bin/nm -B output from gcc object
configure:7191: gcc -c -ansi -W -pedantic -Wshadow -Wpointer-arith -Wmissing-prototypes -D_XOPEN_SOURCE=500 -D_BSD_SOURCE -O2 conftest.c >&5
conftest.c:5: warning: no previous prototype for 'nm_test_func'
configure:7194: $? = 0
configure:7198: /usr/bin/nm -B conftest.o \| sed -n -e 's/^.*[ ]\([ABCDGISTW][ABCDGISTW]*\)[ ][ ]*\(\)\([_A-Za-z][_A-Za-z0-9]*\)$/\1 \2\3 \3/p' \> conftest.nm
configure:7201: $? = 0
configure:7253: gcc -o conftest -ansi -W -pedantic -Wshadow -Wpointer-arith -Wmissing-prototypes -D_XOPEN_SOURCE=500 -D_BSD_SOURCE -O2 conftest.c conftstm.o >&5
configure:7256: $? = 0
configure:7294: result: ok
configure:7298: checking for objdir
configure:7313: result: .libs
configure:7403: checking for ranlib
configure:7419: found /usr/bin/ranlib
configure:7430: result: ranlib
configure:7483: checking for strip
configure:7499: found /usr/bin/strip
configure:7510: result: strip
configure:7773: checking if gcc static flag works
configure:7796: result: yes
configure:7813: checking if gcc supports -fno-rtti -fno-exceptions
cc1: warning: command line option "-fno-rtti" is valid for C++/ObjC++ but not for C
cc1: warning: command line option "-fno-rtti" is valid for C++/ObjC++ but not for C
configure:7837: result: no
configure:7852: checking for gcc option to produce PIC
configure:8005: result: -fPIC
configure:8012: checking if gcc PIC flag -fPIC works
configure:8036: result: yes
configure:8060: checking if gcc supports -c -o file.o
configure:8101: result: yes
configure:8127: checking whether the gcc linker (/usr/bin/ld) supports shared libraries
configure:8930: result: yes
configure:8952: checking whether -lc should be explicitly linked in
configure:8957: gcc -c -ansi -W -pedantic -Wshadow -Wpointer-arith -Wmissing-prototypes -D_XOPEN_SOURCE=500 -D_BSD_SOURCE -O2 conftest.c >&5
configure:8960: $? = 0
configure:8974: gcc -shared conftest.o -v -Wl,-soname -Wl,conftest -o conftest 2\>\&1 \| grep -lc \>/dev/null 2\>\&1
configure:8977: $? = 0
configure:8989: result: no
configure:8995: checking how to hardcode library paths into programs
configure:9019: result: immediate
configure:9033: checking whether stripping libraries is possible
configure:9038: result: yes
configure:9045: checking dynamic linker characteristics
configure:9496: result: GNU/Linux ld.so
configure:10225: checking if libtool supports shared libraries
configure:10227: result: yes
configure:10230: checking whether to build shared libraries
configure:10251: result: yes
configure:10254: checking whether to build static libraries
configure:10258: result: no
configure:10337: creating libtool
configure:11062: checking whether the g++ linker (/usr/bin/ld) supports shared libraries
configure:11737: result: yes
configure:11754: g++ -c -Wnon-virtual-dtor -Wno-long-long -Wundef -pedantic -W -Wpointer-arith -Wmissing-prototypes -ansi -D_XOPEN_SOURCE=500 -D_BSD_SOURCE -Wcast-align -Wconversion -O2 -fno-exceptions -fno-check-new conftest.cc >&5
cc1plus: warning: command line option "-Wmissing-prototypes" is valid for Ada/C/ObjC but not for C++
configure:11757: $? = 0
configure:11857: checking for g++ option to produce PIC
configure:12093: result: -fPIC
configure:12100: checking if g++ PIC flag -fPIC works
cc1plus: warning: command line option "-Wmissing-prototypes" is valid for Ada/C/ObjC but not for C++
configure:12124: result: no
configure:12148: checking if g++ supports -c -o file.o
cc1plus: warning: command line option "-Wmissing-prototypes" is valid for Ada/C/ObjC but not for C++
configure:12189: result: no
configure:12215: checking whether the g++ linker (/usr/bin/ld) supports shared libraries
configure:12237: result: yes
configure:12259: checking whether -lc should be explicitly linked in
configure:12264: g++ -c -Wnon-virtual-dtor -Wno-long-long -Wundef -pedantic -W -Wpointer-arith -Wmissing-prototypes -ansi -D_XOPEN_SOURCE=500 -D_BSD_SOURCE -Wcast-align -Wconversion -O2 -fno-exceptions -fno-check-new conftest.cc >&5
cc1plus: warning: command line option "-Wmissing-prototypes" is valid for Ada/C/ObjC but not for C++
configure:12267: $? = 0
configure:12281: g++ -shared -nostdlib conftest.o -v -Wl,-soname -Wl,conftest -o conftest 2\>\&1 \| grep -lc \>/dev/null 2\>\&1
configure:12284: $? = 1
configure:12296: result: yes
configure:12302: checking how to hardcode library paths into programs
configure:12326: result: immediate
configure:12340: checking whether stripping libraries is possible
configure:12345: result: yes
configure:12352: checking dynamic linker characteristics
configure:12803: result: GNU/Linux ld.so
configure:13948: checking if gcj supports -fno-rtti -fno-exceptions
configure:13972: result: no
configure:13987: checking for gcj option to produce PIC
configure:14140: result: -fPIC
configure:14147: checking if gcj PIC flag -fPIC works
configure:14171: result: no
configure:14195: checking if gcj supports -c -o file.o
configure:14236: result: no
configure:14262: checking whether the gcj linker (/usr/bin/ld) supports shared libraries
configure:15065: result: yes
configure:15087: checking whether -lc should be explicitly linked in
configure:15092: gcj -c -ansi -W -pedantic -Wshadow -Wpointer-arith -Wmissing-prototypes -D_XOPEN_SOURCE=500 -D_BSD_SOURCE -O2 conftest.java >&5
./configure: line 1: gcj: command not found
configure:15095: $? = 127
configure:15124: result: yes
configure:15130: checking how to hardcode library paths into programs
configure:15154: result: immediate
configure:15168: checking whether stripping libraries is possible
configure:15173: result: yes
configure:15180: checking dynamic linker characteristics
configure:15631: result: GNU/Linux ld.so
configure:17252: checking for msgfmt
configure:17279: result: /usr/bin/msgfmt
configure:17288: checking for gmsgfmt
configure:17319: result: /usr/bin/msgfmt
configure:17338: checking for xgettext
configure:17365: result: /usr/bin/xgettext
configure:17393: checking for main in -lutil
configure:17417: gcc -o conftest -ansi -W -pedantic -Wshadow -Wpointer-arith -Wmissing-prototypes -D_XOPEN_SOURCE=500 -D_BSD_SOURCE -O2 conftest.c -lutil >&5
configure:17423: $? = 0
configure:17427: test -z
|| test ! -s conftest.err
configure:17430: $? = 0
configure:17433: test -s conftest
configure:17436: $? = 0
configure:17449: result: yes
configure:17455: checking for main in -lcompat
configure:17479: gcc -o conftest -ansi -W -pedantic -Wshadow -Wpointer-arith -Wmissing-prototypes -D_XOPEN_SOURCE=500 -D_BSD_SOURCE -O2 conftest.c -lcompat >&5
/usr/bin/ld: cannot find -lcompat
collect2: ld returned 1 exit status
configure:17485: $? = 1
configure: failed program was:
| /* confdefs.h. */
|
| #define PACKAGE_NAME ""
| #define PACKAGE_TARNAME ""
| #define PACKAGE_VERSION ""
| #define PACKAGE_STRING ""
| #define PACKAGE_BUGREPORT ""
| #define PACKAGE "karamba"
| #define VERSION "0.17"
| #ifdef __cplusplus
| extern "C" void std::exit (int) throw (); using std::exit;
| #endif
| #define HAVE_TEMPLATE_REPOSITORY 1
| #define KDELIBSUFF ""
| #define STDC_HEADERS 1
| #define HAVE_SYS_TYPES_H 1
| #define HAVE_SYS_STAT_H 1
| #define HAVE_STDLIB_H 1
| #define HAVE_STRING_H 1
| #define HAVE_MEMORY_H 1
| #define HAVE_STRINGS_H 1
| #define HAVE_INTTYPES_H 1
| #define HAVE_STDINT_H 1
| #define HAVE_UNISTD_H 1
| #define HAVE_DLFCN_H 1
| /* end confdefs.h. */
|
|
| int
| main ()
| {
| main ();
| ;
| return 0;
| }
configure:17511: result: no
configure:17518: checking for crypt in -lcrypt
configure:17548: gcc -o conftest -ansi -W -pedantic -Wshadow -Wpointer-arith -Wmissing-prototypes -D_XOPEN_SOURCE=500 -D_BSD_SOURCE -O2 conftest.c -lcrypt >&5
configure:17554: $? = 0
configure:17558: test -z
|| test ! -s conftest.err
configure:17561: $? = 0
configure:17564: test -s conftest
configure:17567: $? = 0
configure:17580: result: yes
configure:17674: checking for socklen_t
configure:17713: g++ -c -Wnon-virtual-dtor -Wno-long-long -Wundef -pedantic -W -Wpointer-arith -Wmissing-prototypes -ansi -D_XOPEN_SOURCE=500 -D_BSD_SOURCE -Wcast-align -Wconversion -O2 -fno-exceptions -fno-check-new conftest.cc >&5
cc1plus: warning: command line option "-Wmissing-prototypes" is valid for Ada/C/ObjC but not for C++
configure:17719: $? = 0
configure:17723: test -z
|| test ! -s conftest.err
configure:17726: $? = 0
configure:17729: test -s conftest.o
configure:17732: $? = 0
configure:17804: result: socklen_t
configure:17826: checking for dnet_ntoa in -ldnet
configure:17856: gcc -o conftest -ansi -W -pedantic -Wshadow -Wpointer-arith -Wmissing-prototypes -D_XOPEN_SOURCE=500 -D_BSD_SOURCE -O2 conftest.c -ldnet >&5
/usr/bin/ld: cannot find -ldnet
collect2: ld returned 1 exit status
configure:17862: $? = 1
configure: failed program was:
| /* confdefs.h. */
|
| #define PACKAGE_NAME ""
| #define PACKAGE_TARNAME ""
| #define PACKAGE_VERSION ""
| #define PACKAGE_STRING ""
| #define PACKAGE_BUGREPORT ""
| #define PACKAGE "karamba"
| #define VERSION "0.17"
| #ifdef __cplusplus
| extern "C" void std::exit (int) throw (); using std::exit;
| #endif
| #define HAVE_TEMPLATE_REPOSITORY 1
| #define KDELIBSUFF ""
| #define STDC_HEADERS 1
| #define HAVE_SYS_TYPES_H 1
| #define HAVE_SYS_STAT_H 1
| #define HAVE_STDLIB_H 1
| #define HAVE_STRING_H 1
| #define HAVE_MEMORY_H 1
| #define HAVE_STRINGS_H 1
| #define HAVE_INTTYPES_H 1
| #define HAVE_STDINT_H 1
| #define HAVE_UNISTD_H 1
| #define HAVE_DLFCN_H 1
| #define HAVE_CRYPT 1
| #define ksize_t socklen_t
| /* end confdefs.h. */
|
| /* Override any gcc2 internal prototype to avoid an error. */
| #ifdef __cplusplus
| extern "C"
| #endif
| /* We use char because int might match the return type of a gcc2
| builtin and then its argument prototype would still apply. */
| char dnet_ntoa ();
| int
| main ()
| {
| dnet_ntoa ();
| ;
| return 0;
| }
configure:17888: result: no
configure:17895: checking for dnet_ntoa in -ldnet_stub
configure:17925: gcc -o conftest -ansi -W -pedantic -Wshadow -Wpointer-arith -Wmissing-prototypes -D_XOPEN_SOURCE=500 -D_BSD_SOURCE -O2 conftest.c -ldnet_stub >&5
/usr/bin/ld: cannot find -ldnet_stub
collect2: ld returned 1 exit status
configure:17931: $? = 1
configure: failed program was:
| /* confdefs.h. */
|
| #define PACKAGE_NAME ""
| #define PACKAGE_TARNAME ""
| #define PACKAGE_VERSION ""
| #define PACKAGE_STRING ""
| #define PACKAGE_BUGREPORT ""
| #define PACKAGE "karamba"
| #define VERSION "0.17"
| #ifdef __cplusplus
| extern "C" void std::exit (int) throw (); using std::exit;
| #endif
| #define HAVE_TEMPLATE_REPOSITORY 1
| #define KDELIBSUFF ""
| #define STDC_HEADERS 1
| #define HAVE_SYS_TYPES_H 1
| #define HAVE_SYS_STAT_H 1
| #define HAVE_STDLIB_H 1
| #define HAVE_STRING_H 1
| #define HAVE_MEMORY_H 1
| #define HAVE_STRINGS_H 1
| #define HAVE_INTTYPES_H 1
| #define HAVE_STDINT_H 1
| #define HAVE_UNISTD_H 1
| #define HAVE_DLFCN_H 1
| #define HAVE_CRYPT 1
| #define ksize_t socklen_t
| /* end confdefs.h. */
|
| /* Override any gcc2 internal prototype to avoid an error. */
| #ifdef __cplusplus
| extern "C"
| #endif
| /* We use char because int might match the return type of a gcc2
| builtin and then its argument prototype would still apply. */
| char dnet_ntoa ();
| int
| main ()
| {
| dnet_ntoa ();
| ;
| return 0;
| }
configure:17957: result: no
configure:17964: checking for inet_ntoa
configure:18021: gcc -o conftest -ansi -W -pedantic -Wshadow -Wpointer-arith -Wmissing-prototypes -D_XOPEN_SOURCE=500 -D_BSD_SOURCE -O2 conftest.c >&5
configure:18027: $? = 0
configure:18031: test -z
|| test ! -s conftest.err
configure:18034: $? = 0
configure:18037: test -s conftest
configure:18040: $? = 0
configure:18052: result: yes
configure:18125: checking for connect
configure:18182: gcc -o conftest -ansi -W -pedantic -Wshadow -Wpointer-arith -Wmissing-prototypes -D_XOPEN_SOURCE=500 -D_BSD_SOURCE -O2 conftest.c >&5
configure:18188: $? = 0
configure:18192: test -z
|| test ! -s conftest.err
configure:18195: $? = 0
configure:18198: test -s conftest
configure:18201: $? = 0
configure:18213: result: yes
configure:18287: checking for remove
configure:18344: gcc -o conftest -ansi -W -pedantic -Wshadow -Wpointer-arith -Wmissing-prototypes -D_XOPEN_SOURCE=500 -D_BSD_SOURCE -O2 conftest.c >&5
configure:18350: $? = 0
configure:18354: test -z
|| test ! -s conftest.err
configure:18357: $? = 0
configure:18360: test -s conftest
configure:18363: $? = 0
configure:18375: result: yes
configure:18450: checking for shmat
configure:18507: gcc -o conftest -ansi -W -pedantic -Wshadow -Wpointer-arith -Wmissing-prototypes -D_XOPEN_SOURCE=500 -D_BSD_SOURCE -O2 conftest.c >&5
configure:18513: $? = 0
configure:18517: test -z
|| test ! -s conftest.err
configure:18520: $? = 0
configure:18523: test -s conftest
configure:18526: $? = 0
configure:18538: result: yes
configure:18629: checking crt_externs.h usability
configure:18641: gcc -c -ansi -W -pedantic -Wshadow -Wpointer-arith -Wmissing-prototypes -D_XOPEN_SOURCE=500 -D_BSD_SOURCE -O2 conftest.c >&5
conftest.c:63:25: error: crt_externs.h: No such file or directory
configure:18647: $? = 1
configure: failed program was:
| /* confdefs.h. */
|
| #define PACKAGE_NAME ""
| #define PACKAGE_TARNAME ""
| #define PACKAGE_VERSION ""
| #define PACKAGE_STRING ""
| #define PACKAGE_BUGREPORT ""
| #define PACKAGE "karamba"
| #define VERSION "0.17"
| #ifdef __cplusplus
| extern "C" void std::exit (int) throw (); using std::exit;
| #endif
| #define HAVE_TEMPLATE_REPOSITORY 1
| #define KDELIBSUFF ""
| #define STDC_HEADERS 1
| #define HAVE_SYS_TYPES_H 1
| #define HAVE_SYS_STAT_H 1
| #define HAVE_STDLIB_H 1
| #define HAVE_STRING_H 1
| #define HAVE_MEMORY_H 1
| #define HAVE_STRINGS_H 1
| #define HAVE_INTTYPES_H 1
| #define HAVE_STDINT_H 1
| #define HAVE_UNISTD_H 1
| #define HAVE_DLFCN_H 1
| #define HAVE_CRYPT 1
| #define ksize_t socklen_t
| /* end confdefs.h. */
| #include <stdio.h>
| #if HAVE_SYS_TYPES_H
| # include <sys/types.h>
| #endif
| #if HAVE_SYS_STAT_H
| # include <sys/stat.h>
| #endif
| #if STDC_HEADERS
| # include <stdlib.h>
| # include <stddef.h>
| #else
| # if HAVE_STDLIB_H
| # include <stdlib.h>
| # endif
| #endif
| #if HAVE_STRING_H
| # if !STDC_HEADERS && HAVE_MEMORY_H
| # include <memory.h>
| # endif
| # include <string.h>
| #endif
| #if HAVE_STRINGS_H
| # include <strings.h>
| #endif
| #if HAVE_INTTYPES_H
| # include <inttypes.h>
| #else
| # if HAVE_STDINT_H
| # include <stdint.h>
| # endif
| #endif
| #if HAVE_UNISTD_H
| # include <unistd.h>
| #endif
| #include <crt_externs.h>
configure:18670: result: no
configure:18674: checking crt_externs.h presence
configure:18684: gcc -E conftest.c
conftest.c:29:25: error: crt_externs.h: No such file or directory
configure:18690: $? = 1
configure: failed program was:
| /* confdefs.h. */
|
| #define PACKAGE_NAME ""
| #define PACKAGE_TARNAME ""
| #define PACKAGE_VERSION ""
| #define PACKAGE_STRING ""
| #define PACKAGE_BUGREPORT ""
| #define PACKAGE "karamba"
| #define VERSION "0.17"
| #ifdef __cplusplus
| extern "C" void std::exit (int) throw (); using std::exit;
| #endif
| #define HAVE_TEMPLATE_REPOSITORY 1
| #define KDELIBSUFF ""
| #define STDC_HEADERS 1
| #define HAVE_SYS_TYPES_H 1
| #define HAVE_SYS_STAT_H 1
| #define HAVE_STDLIB_H 1
| #define HAVE_STRING_H 1
| #define HAVE_MEMORY_H 1
| #define HAVE_STRINGS_H 1
| #define HAVE_INTTYPES_H 1
| #define HAVE_STDINT_H 1
| #define HAVE_UNISTD_H 1
| #define HAVE_DLFCN_H 1
| #define HAVE_CRYPT 1
| #define ksize_t socklen_t
| /* end confdefs.h. */
| #include <crt_externs.h>
configure:18710: result: no
configure:18745: checking for crt_externs.h
configure:18752: result: no
configure:18765: checking for _NSGetEnviron
configure:18822: gcc -o conftest -ansi -W -pedantic -Wshadow -Wpointer-arith -Wmissing-prototypes -D_XOPEN_SOURCE=500 -D_BSD_SOURCE -O2 conftest.c >&5
/tmp/ccYKaiZn.o: In function `main':
conftest.c:(.text+0x17): undefined reference to `_NSGetEnviron'
/tmp/ccYKaiZn.o:(.data+0x0): undefined reference to `_NSGetEnviron'
collect2: ld returned 1 exit status
configure:18828: $? = 1
configure: failed program was:
| /* confdefs.h. */
|
| #define PACKAGE_NAME ""
| #define PACKAGE_TARNAME ""
| #define PACKAGE_VERSION ""
| #define PACKAGE_STRING ""
| #define PACKAGE_BUGREPORT ""
| #define PACKAGE "karamba"
| #define VERSION "0.17"
| #ifdef __cplusplus
| extern "C" void std::exit (int) throw (); using std::exit;
| #endif
| #define HAVE_TEMPLATE_REPOSITORY 1
| #define KDELIBSUFF ""
| #define STDC_HEADERS 1
| #define HAVE_SYS_TYPES_H 1
| #define HAVE_SYS_STAT_H 1
| #define HAVE_STDLIB_H 1
| #define HAVE_STRING_H 1
| #define HAVE_MEMORY_H 1
| #define HAVE_STRINGS_H 1
| #define HAVE_INTTYPES_H 1
| #define HAVE_STDINT_H 1
| #define HAVE_UNISTD_H 1
| #define HAVE_DLFCN_H 1
| #define HAVE_CRYPT 1
| #define ksize_t socklen_t
| /* end confdefs.h. */
| /* Define _NSGetEnviron to an innocuous variant, in case <limits.h> declares _NSGetEnviron.
| For example, HP-UX 11i <limits.h> declares gettimeofday. */
| #define _NSGetEnviron innocuous__NSGetEnviron
|
| /* System header to define __stub macros and hopefully few prototypes,
| which can conflict with char _NSGetEnviron (); below.
| Prefer <limits.h> to <assert.h> if __STDC__ is defined, since
| <limits.h> exists even on freestanding compilers. */
|
| #ifdef __STDC__
| # include <limits.h>
| #else
| # include <assert.h>
| #endif
|
| #undef _NSGetEnviron
|
| /* Override any gcc2 internal prototype to avoid an error. */
| #ifdef __cplusplus
| extern "C"
| {
| #endif
| /* We use char because int might match the return type of a gcc2
| builtin and then its argument prototype would still apply. */
| char _NSGetEnviron ();
| /* The GNU C library defines this for functions which it implements
| to always fail with ENOSYS. Some functions are actually named
| something starting with __ and the normal name is an alias. */
| #if defined (__stub__NSGetEnviron) || defined (__stub____NSGetEnviron)
| choke me
| #else
| char (*f) () = _NSGetEnviron;
| #endif
| #ifdef __cplusplus
| }
| #endif
|
| int
| main ()
| {
| return f != _NSGetEnviron;
| ;
| return 0;
| }
configure:18853: result: no
configure:18871: checking for sys/types.h
configure:18876: result: yes
configure:18871: checking for stdint.h
configure:18876: result: yes
configure:19018: checking for poll in -lpoll
configure:19048: gcc -o conftest -ansi -W -pedantic -Wshadow -Wpointer-arith -Wmissing-prototypes -D_XOPEN_SOURCE=500 -D_BSD_SOURCE -O2 conftest.c -lpoll >&5
/usr/bin/ld: cannot find -lpoll
collect2: ld returned 1 exit status
configure:19054: $? = 1
configure: failed program was:
| /* confdefs.h. */
|
| #define PACKAGE_NAME ""
| #define PACKAGE_TARNAME ""
| #define PACKAGE_VERSION ""
| #define PACKAGE_STRING ""
| #define PACKAGE_BUGREPORT ""
| #define PACKAGE "karamba"
| #define VERSION "0.17"
| #ifdef __cplusplus
| extern "C" void std::exit (int) throw (); using std::exit;
| #endif
| #define HAVE_TEMPLATE_REPOSITORY 1
| #define KDELIBSUFF ""
| #define STDC_HEADERS 1
| #define HAVE_SYS_TYPES_H 1
| #define HAVE_SYS_STAT_H 1
| #define HAVE_STDLIB_H 1
| #define HAVE_STRING_H 1
| #define HAVE_MEMORY_H 1
| #define HAVE_STRINGS_H 1
| #define HAVE_INTTYPES_H 1
| #define HAVE_STDINT_H 1
| #define HAVE_UNISTD_H 1
| #define HAVE_DLFCN_H 1
| #define HAVE_CRYPT 1
| #define ksize_t socklen_t
| #define HAVE_SYS_TYPES_H 1
| #define HAVE_STDINT_H 1
| /* end confdefs.h. */
|
| /* Override any gcc2 internal prototype to avoid an error. */
| #ifdef __cplusplus
| extern "C"
| #endif
| /* We use char because int might match the return type of a gcc2
| builtin and then its argument prototype would still apply. */
| char poll ();
| int
| main ()
| {
| poll ();
| ;
| return 0;
| }
configure:19080: result: no
configure:19098: checking CoreAudio/CoreAudio.h usability
configure:19110: gcc -c -ansi -W -pedantic -Wshadow -Wpointer-arith -Wmissing-prototypes -D_XOPEN_SOURCE=500 -D_BSD_SOURCE -O2 conftest.c >&5
conftest.c:65:33: error: CoreAudio/CoreAudio.h: No such file or directory
configure:19116: $? = 1
configure: failed program was:
| /* confdefs.h. */
|
| #define PACKAGE_NAME ""
| #define PACKAGE_TARNAME ""
| #define PACKAGE_VERSION ""
| #define PACKAGE_STRING ""
| #define PACKAGE_BUGREPORT ""
| #define PACKAGE "karamba"
| #define VERSION "0.17"
| #ifdef __cplusplus
| extern "C" void std::exit (int) throw (); using std::exit;
| #endif
| #define HAVE_TEMPLATE_REPOSITORY 1
| #define KDELIBSUFF ""
| #define STDC_HEADERS 1
| #define HAVE_SYS_TYPES_H 1
| #define HAVE_SYS_STAT_H 1
| #define HAVE_STDLIB_H 1
| #define HAVE_STRING_H 1
| #define HAVE_MEMORY_H 1
| #define HAVE_STRINGS_H 1
| #define HAVE_INTTYPES_H 1
| #define HAVE_STDINT_H 1
| #define HAVE_UNISTD_H 1
| #define HAVE_DLFCN_H 1
| #define HAVE_CRYPT 1
| #define ksize_t socklen_t
| #define HAVE_SYS_TYPES_H 1
| #define HAVE_STDINT_H 1
| /* end confdefs.h. */
| #include <stdio.h>
| #if HAVE_SYS_TYPES_H
| # include <sys/types.h>
| #endif
| #if HAVE_SYS_STAT_H
| # include <sys/stat.h>
| #endif
| #if STDC_HEADERS
| # include <stdlib.h>
| # include <stddef.h>
| #else
| # if HAVE_STDLIB_H
| # include <stdlib.h>
| # endif
| #endif
| #if HAVE_STRING_H
| # if !STDC_HEADERS && HAVE_MEMORY_H
| # include <memory.h>
| # endif
| # include <string.h>
| #endif
| #if HAVE_STRINGS_H
| # include <strings.h>
| #endif
| #if HAVE_INTTYPES_H
| # include <inttypes.h>
| #else
| # if HAVE_STDINT_H
| # include <stdint.h>
| # endif
| #endif
| #if HAVE_UNISTD_H
| # include <unistd.h>
| #endif
| #include <CoreAudio/CoreAudio.h>
configure:19139: result: no
configure:19143: checking CoreAudio/CoreAudio.h presence
configure:19153: gcc -E conftest.c
conftest.c:31:33: error: CoreAudio/CoreAudio.h: No such file or directory
configure:19159: $? = 1
configure: failed program was:
| /* confdefs.h. */
|
| #define PACKAGE_NAME ""
| #define PACKAGE_TARNAME ""
| #define PACKAGE_VERSION ""
| #define PACKAGE_STRING ""
| #define PACKAGE_BUGREPORT ""
| #define PACKAGE "karamba"
| #define VERSION "0.17"
| #ifdef __cplusplus
| extern "C" void std::exit (int) throw (); using std::exit;
| #endif
| #define HAVE_TEMPLATE_REPOSITORY 1
| #define KDELIBSUFF ""
| #define STDC_HEADERS 1
| #define HAVE_SYS_TYPES_H 1
| #define HAVE_SYS_STAT_H 1
| #define HAVE_STDLIB_H 1
| #define HAVE_STRING_H 1
| #define HAVE_MEMORY_H 1
| #define HAVE_STRINGS_H 1
| #define HAVE_INTTYPES_H 1
| #define HAVE_STDINT_H 1
| #define HAVE_UNISTD_H 1
| #define HAVE_DLFCN_H 1
| #define HAVE_CRYPT 1
| #define ksize_t socklen_t
| #define HAVE_SYS_TYPES_H 1
| #define HAVE_STDINT_H 1
| /* end confdefs.h. */
| #include <CoreAudio/CoreAudio.h>
configure:19179: result: no
configure:19214: checking for CoreAudio/CoreAudio.h
configure:19221: result: no
configure:19240: checking for res_init
configure:19287: g++ -c -Wnon-virtual-dtor -Wno-long-long -Wundef -pedantic -W -Wpointer-arith -Wmissing-prototypes -ansi -D_XOPEN_SOURCE=500 -D_BSD_SOURCE -Wcast-align -Wconversion -O2 -fno-exceptions -fno-check-new -pedantic-errors conftest.cc >&5
cc1plus: warning: command line option "-Wmissing-prototypes" is valid for Ada/C/ObjC but not for C++
configure:19293: $? = 0
configure:19297: test -z
|| test ! -s conftest.err
configure:19300: $? = 0
configure:19303: test -s conftest.o
configure:19306: $? = 0
configure:19328: result: yes
configure:19331: checking if res_init needs custom prototype
configure:19434: result: no
configure:19463: checking for killpg in -lucb
configure:19493: gcc -o conftest -ansi -W -pedantic -Wshadow -Wpointer-arith -Wmissing-prototypes -D_XOPEN_SOURCE=500 -D_BSD_SOURCE -O2 conftest.c -lucb >&5
/usr/bin/ld: cannot find -lucb
collect2: ld returned 1 exit status
configure:19499: $? = 1
configure: failed program was:
| /* confdefs.h. */
|
| #define PACKAGE_NAME ""
| #define PACKAGE_TARNAME ""
| #define PACKAGE_VERSION ""
| #define PACKAGE_STRING ""
| #define PACKAGE_BUGREPORT ""
| #define PACKAGE "karamba"
| #define VERSION "0.17"
| #ifdef __cplusplus
| extern "C" void std::exit (int) throw (); using std::exit;
| #endif
| #define HAVE_TEMPLATE_REPOSITORY 1
| #define KDELIBSUFF ""
| #define STDC_HEADERS 1
| #define HAVE_SYS_TYPES_H 1
| #define HAVE_SYS_STAT_H 1
| #define HAVE_STDLIB_H 1
| #define HAVE_STRING_H 1
| #define HAVE_MEMORY_H 1
| #define HAVE_STRINGS_H 1
| #define HAVE_INTTYPES_H 1
| #define HAVE_STDINT_H 1
| #define HAVE_UNISTD_H 1
| #define HAVE_DLFCN_H 1
| #define HAVE_CRYPT 1
| #define ksize_t socklen_t
| #define HAVE_SYS_TYPES_H 1
| #define HAVE_STDINT_H 1
| #define HAVE_RES_INIT 1
| #define HAVE_RES_INIT_PROTO 1
| /* end confdefs.h. */
|
| /* Override any gcc2 internal prototype to avoid an error. */
| #ifdef __cplusplus
| extern "C"
| #endif
| /* We use char because int might match the return type of a gcc2
| builtin and then its argument prototype would still apply. */
| char killpg ();
| int
| main ()
| {
| killpg ();
| ;
| return 0;
| }
configure:19525: result: no
configure:19608: checking for int
configure:19632: gcc -c -ansi -W -pedantic -Wshadow -Wpointer-arith -Wmissing-prototypes -D_XOPEN_SOURCE=500 -D_BSD_SOURCE -O2 conftest.c >&5
configure:19638: $? = 0
configure:19642: test -z
|| test ! -s conftest.err
configure:19645: $? = 0
configure:19648: test -s conftest.o
configure:19651: $? = 0
configure:19662: result: yes
configure:19665: checking size of int
configure:19984: gcc -o conftest -ansi -W -pedantic -Wshadow -Wpointer-arith -Wmissing-prototypes -D_XOPEN_SOURCE=500 -D_BSD_SOURCE -O2 conftest.c >&5
conftest.c:67: warning: no previous prototype for 'longval'
conftest.c:68: warning: no previous prototype for 'ulongval'
configure:19987: $? = 0
configure:19989: ./conftest
configure:19992: $? = 0
configure:20015: result: 4
configure:20021: checking for long
configure:20045: gcc -c -ansi -W -pedantic -Wshadow -Wpointer-arith -Wmissing-prototypes -D_XOPEN_SOURCE=500 -D_BSD_SOURCE -O2 conftest.c >&5
configure:20051: $? = 0
configure:20055: test -z
|| test ! -s conftest.err
configure:20058: $? = 0
configure:20061: test -s conftest.o
configure:20064: $? = 0
configure:20075: result: yes
configure:20078: checking size of long
configure:20397: gcc -o conftest -ansi -W -pedantic -Wshadow -Wpointer-arith -Wmissing-prototypes -D_XOPEN_SOURCE=500 -D_BSD_SOURCE -O2 conftest.c >&5
conftest.c:68: warning: no previous prototype for 'longval'
conftest.c:69: warning: no previous prototype for 'ulongval'
configure:20400: $? = 0
configure:20402: ./conftest
configure:20405: $? = 0
configure:20428: result: 4
configure:20434: checking for char *
configure:20458: gcc -c -ansi -W -pedantic -Wshadow -Wpointer-arith -Wmissing-prototypes -D_XOPEN_SOURCE=500 -D_BSD_SOURCE -O2 conftest.c >&5
configure:20464: $? = 0
configure:20468: test -z
|| test ! -s conftest.err
configure:20471: $? = 0
configure:20474: test -s conftest.o
configure:20477: $? = 0
configure:20488: result: yes
configure:20491: checking size of char *
configure:20810: gcc -o conftest -ansi -W -pedantic -Wshadow -Wpointer-arith -Wmissing-prototypes -D_XOPEN_SOURCE=500 -D_BSD_SOURCE -O2 conftest.c >&5
conftest.c:69: warning: no previous prototype for 'longval'
conftest.c:70: warning: no previous prototype for 'ulongval'
configure:20813: $? = 0
configure:20815: ./conftest
configure:20818: $? = 0
configure:20841: result: 4
configure:20847: checking for char
configure:20871: gcc -c -ansi -W -pedantic -Wshadow -Wpointer-arith -Wmissing-prototypes -D_XOPEN_SOURCE=500 -D_BSD_SOURCE -O2 conftest.c >&5
configure:20877: $? = 0
configure:20881: test -z
|| test ! -s conftest.err
configure:20884: $? = 0
configure:20887: test -s conftest.o
configure:20890: $? = 0
configure:20901: result: yes
configure:20904: checking size of char
configure:21223: gcc -o conftest -ansi -W -pedantic -Wshadow -Wpointer-arith -Wmissing-prototypes -D_XOPEN_SOURCE=500 -D_BSD_SOURCE -O2 conftest.c >&5
conftest.c:70: warning: no previous prototype for 'longval'
conftest.c:71: warning: no previous prototype for 'ulongval'
configure:21226: $? = 0
configure:21228: ./conftest
configure:21231: $? = 0
configure:21254: result: 1
configure:21262: checking for dlopen in -ldl
configure:21292: gcc -o conftest -ansi -W -pedantic -Wshadow -Wpointer-arith -Wmissing-prototypes -D_XOPEN_SOURCE=500 -D_BSD_SOURCE -O2 conftest.c -ldl >&5
configure:21298: $? = 0
configure:21302: test -z
|| test ! -s conftest.err
configure:21305: $? = 0
configure:21308: test -s conftest
configure:21311: $? = 0
configure:21324: result: yes
configure:21334: checking for shl_unload in -ldld
configure:21364: gcc -o conftest -ansi -W -pedantic -Wshadow -Wpointer-arith -Wmissing-prototypes -D_XOPEN_SOURCE=500 -D_BSD_SOURCE -O2 conftest.c -ldld >&5
/usr/bin/ld: cannot find -ldld
collect2: ld returned 1 exit status
configure:21370: $? = 1
configure: failed program was:
| /* confdefs.h. */
|
| #define PACKAGE_NAME ""
| #define PACKAGE_TARNAME ""
| #define PACKAGE_VERSION ""
| #define PACKAGE_STRING ""
| #define PACKAGE_BUGREPORT ""
| #define PACKAGE "karamba"
| #define VERSION "0.17"
| #ifdef __cplusplus
| extern "C" void std::exit (int) throw (); using std::exit;
| #endif
| #define HAVE_TEMPLATE_REPOSITORY 1
| #define KDELIBSUFF ""
| #define STDC_HEADERS 1
| #define HAVE_SYS_TYPES_H 1
| #define HAVE_SYS_STAT_H 1
| #define HAVE_STDLIB_H 1
| #define HAVE_STRING_H 1
| #define HAVE_MEMORY_H 1
| #define HAVE_STRINGS_H 1
| #define HAVE_INTTYPES_H 1
| #define HAVE_STDINT_H 1
| #define HAVE_UNISTD_H 1
| #define HAVE_DLFCN_H 1
| #define HAVE_CRYPT 1
| #define ksize_t socklen_t
| #define HAVE_SYS_TYPES_H 1
| #define HAVE_STDINT_H 1
| #define HAVE_RES_INIT 1
| #define HAVE_RES_INIT_PROTO 1
| #define SIZEOF_INT 4
| #define SIZEOF_LONG 4
| #define SIZEOF_CHAR_P 4
| #define SIZEOF_CHAR 1
| /* end confdefs.h. */
|
| /* Override any gcc2 internal prototype to avoid an error. */
| #ifdef __cplusplus
| extern "C"
| #endif
| /* We use char because int might match the return type of a gcc2
| builtin and then its argument prototype would still apply. */
| char shl_unload ();
| int
| main ()
| {
| shl_unload ();
| ;
| return 0;
| }
configure:21396: result: no
configure:21417: checking for vsnprintf
configure:21474: gcc -o conftest -ansi -W -pedantic -Wshadow -Wpointer-arith -Wmissing-prototypes -D_XOPEN_SOURCE=500 -D_BSD_SOURCE -O2 conftest.c >&5
configure:21480: $? = 0
configure:21484: test -z
|| test ! -s conftest.err
configure:21487: $? = 0
configure:21490: test -s conftest
configure:21493: $? = 0
configure:21505: result: yes
configure:21417: checking for snprintf
configure:21474: gcc -o conftest -ansi -W -pedantic -Wshadow -Wpointer-arith -Wmissing-prototypes -D_XOPEN_SOURCE=500 -D_BSD_SOURCE -O2 conftest.c >&5
configure:21480: $? = 0
configure:21484: test -z
|| test ! -s conftest.err
configure:21487: $? = 0
configure:21490: test -s conftest
configure:21493: $? = 0
configure:21505: result: yes
configure:21543: checking for X
configure:21588: gcc -E conftest.c
conftest.c:39:27: error: X11/Intrinsic.h: No such file or directory
configure:21594: $? = 1
configure: failed program was:
| /* confdefs.h. */
|
| #define PACKAGE_NAME ""
| #define PACKAGE_TARNAME ""
| #define PACKAGE_VERSION ""
| #define PACKAGE_STRING ""
| #define PACKAGE_BUGREPORT ""
| #define PACKAGE "karamba"
| #define VERSION "0.17"
| #ifdef __cplusplus
| extern "C" void std::exit (int) throw (); using std::exit;
| #endif
| #define HAVE_TEMPLATE_REPOSITORY 1
| #define KDELIBSUFF ""
| #define STDC_HEADERS 1
| #define HAVE_SYS_TYPES_H 1
| #define HAVE_SYS_STAT_H 1
| #define HAVE_STDLIB_H 1
| #define HAVE_STRING_H 1
| #define HAVE_MEMORY_H 1
| #define HAVE_STRINGS_H 1
| #define HAVE_INTTYPES_H 1
| #define HAVE_STDINT_H 1
| #define HAVE_UNISTD_H 1
| #define HAVE_DLFCN_H 1
| #define HAVE_CRYPT 1
| #define ksize_t socklen_t
| #define HAVE_SYS_TYPES_H 1
| #define HAVE_STDINT_H 1
| #define HAVE_RES_INIT 1
| #define HAVE_RES_INIT_PROTO 1
| #define SIZEOF_INT 4
| #define SIZEOF_LONG 4
| #define SIZEOF_CHAR_P 4
| #define SIZEOF_CHAR 1
| #define HAVE_VSNPRINTF 1
| #define HAVE_SNPRINTF 1
| /* end confdefs.h. */
| #include <X11/Intrinsic.h>
configure:21685: gcc -o conftest -ansi -W -pedantic -Wshadow -Wpointer-arith -Wmissing-prototypes -D_XOPEN_SOURCE=500 -D_BSD_SOURCE -O2 conftest.c -lXt >&5
/usr/bin/ld: cannot find -lXt
collect2: ld returned 1 exit status
configure:21691: $? = 1
configure: failed program was:
| /* confdefs.h. */
|
| #define PACKAGE_NAME ""
| #define PACKAGE_TARNAME ""
| #define PACKAGE_VERSION ""
| #define PACKAGE_STRING ""
| #define PACKAGE_BUGREPORT ""
| #define PACKAGE "karamba"
| #define VERSION "0.17"
| #ifdef __cplusplus
| extern "C" void std::exit (int) throw (); using std::exit;
| #endif
| #define HAVE_TEMPLATE_REPOSITORY 1
| #define KDELIBSUFF ""
| #define STDC_HEADERS 1
| #define HAVE_SYS_TYPES_H 1
| #define HAVE_SYS_STAT_H 1
| #define HAVE_STDLIB_H 1
| #define HAVE_STRING_H 1
| #define HAVE_MEMORY_H 1
| #define HAVE_STRINGS_H 1
| #define HAVE_INTTYPES_H 1
| #define HAVE_STDINT_H 1
| #define HAVE_UNISTD_H 1
| #define HAVE_DLFCN_H 1
| #define HAVE_CRYPT 1
| #define ksize_t socklen_t
| #define HAVE_SYS_TYPES_H 1
| #define HAVE_STDINT_H 1
| #define HAVE_RES_INIT 1
| #define HAVE_RES_INIT_PROTO 1
| #define SIZEOF_INT 4
| #define SIZEOF_LONG 4
| #define SIZEOF_CHAR_P 4
| #define SIZEOF_CHAR 1
| #define HAVE_VSNPRINTF 1
| #define HAVE_SNPRINTF 1
| /* end confdefs.h. */
|
| int
| main ()
| {
| XtMalloc()
| ;
| return 0;
| }
configure:21826: error: Can't find X includes. Please check your installation and add the correct paths!
## ---------------- ##
## Cache variables. ##
## ---------------- ##
ac_cv_build=i686-pc-linux-gnu
ac_cv_build_alias=i686-pc-linux-gnu
ac_cv_c_compiler_gnu=yes
ac_cv_cxx_compiler_gnu=yes
ac_cv_env_CC_set=
ac_cv_env_CC_value=
ac_cv_env_CFLAGS_set=
ac_cv_env_CFLAGS_value=
ac_cv_env_CPPFLAGS_set=
ac_cv_env_CPPFLAGS_value=
ac_cv_env_CPP_set=
ac_cv_env_CPP_value=
ac_cv_env_CXXCPP_set=
ac_cv_env_CXXCPP_value=
ac_cv_env_CXXFLAGS_set=
ac_cv_env_CXXFLAGS_value=
ac_cv_env_CXX_set=
ac_cv_env_CXX_value=
ac_cv_env_LDFLAGS_set=
ac_cv_env_LDFLAGS_value=
ac_cv_env_build_alias_set=
ac_cv_env_build_alias_value=
ac_cv_env_host_alias_set=
ac_cv_env_host_alias_value=
ac_cv_env_target_alias_set=
ac_cv_env_target_alias_value=
ac_cv_exeext=
ac_cv_func__NSGetEnviron=no
ac_cv_func_connect=yes
ac_cv_func_inet_ntoa=yes
ac_cv_func_remove=yes
ac_cv_func_shmat=yes
ac_cv_func_snprintf=yes
ac_cv_func_vsnprintf=yes
ac_cv_have_dlfcn=yes
ac_cv_header_CoreAudio_CoreAudio_h=no
ac_cv_header_crt_externs_h=no
ac_cv_header_dlfcn_h=yes
ac_cv_header_inttypes_h=yes
ac_cv_header_memory_h=yes
ac_cv_header_stdc=yes
ac_cv_header_stdint_h=yes
ac_cv_header_stdlib_h=yes
ac_cv_header_string_h=yes
ac_cv_header_strings_h=yes
ac_cv_header_sys_stat_h=yes
ac_cv_header_sys_types_h=yes
ac_cv_header_unistd_h=yes
ac_cv_host=i686-pc-linux-gnu
ac_cv_host_alias=i686-pc-linux-gnu
ac_cv_lib_compat_main=no
ac_cv_lib_crypt_crypt=yes
ac_cv_lib_dl_dlopen=yes
ac_cv_lib_dld_shl_unload=no
ac_cv_lib_dnet_dnet_ntoa=no
ac_cv_lib_dnet_stub_dnet_ntoa=no
ac_cv_lib_poll_poll=no
ac_cv_lib_ucb_killpg=no
ac_cv_lib_util_main=yes
ac_cv_objext=o
ac_cv_path_GMSGFMT=/usr/bin/msgfmt
ac_cv_path_MSGFMT=/usr/bin/msgfmt
ac_cv_path_XGETTEXT=/usr/bin/xgettext
ac_cv_path_install='/usr/bin/install -c'
ac_cv_prog_AWK=mawk
ac_cv_prog_CPP='gcc -E'
ac_cv_prog_CXXCPP='g++ -E'
ac_cv_prog_ac_ct_CC=gcc
ac_cv_prog_ac_ct_CXX=g++
ac_cv_prog_ac_ct_RANLIB=ranlib
ac_cv_prog_ac_ct_STRIP=strip
ac_cv_prog_cc_g=yes
ac_cv_prog_cc_stdc=
ac_cv_prog_cxx_g=yes
ac_cv_prog_egrep='grep -E'
ac_cv_prog_make_make_set=yes
ac_cv_sizeof_char=1
ac_cv_sizeof_char_p=4
ac_cv_sizeof_int=4
ac_cv_sizeof_long=4
ac_cv_socklen_t=socklen_t
ac_cv_target=i686-pc-linux-gnu
ac_cv_target_alias=i686-pc-linux-gnu
ac_cv_type_char=yes
ac_cv_type_char_p=yes
ac_cv_type_int=yes
ac_cv_type_long=yes
am_cv_CC_dependencies_compiler_type=gcc3
am_cv_CXX_dependencies_compiler_type=gcc3
kde_cv_func_res_init=yes
kde_cv_prog_cxx_Wno_long_long=yes
kde_cv_prog_cxx_Wnon_virtual_dtor=yes
kde_cv_prog_cxx_Wundef=yes
kde_cv_prog_cxx_fexceptions=yes
kde_cv_prog_cxx_fno_check_new=yes
kde_cv_prog_cxx_fno_exceptions=yes
kde_cv_prog_cxx_frepo=yes
kde_cv_proto_res_init=no
lt_cv_deplibs_check_method=pass_all
lt_cv_file_magic_cmd='$MAGIC_CMD'
lt_cv_file_magic_test_file='/lib/libc.so.6 /lib/libc-2.3.6.so'
lt_cv_ld_reload_flag=-r
lt_cv_objdir=.libs
lt_cv_path_LD=/usr/bin/ld
lt_cv_path_NM='/usr/bin/nm -B'
lt_cv_path_SED=/bin/sed
lt_cv_prog_compiler_c_o=yes
lt_cv_prog_compiler_c_o_CXX=no
lt_cv_prog_compiler_c_o_GCJ=no
lt_cv_prog_compiler_rtti_exceptions=no
lt_cv_prog_gnu_ld=yes
lt_cv_sys_global_symbol_pipe='sed -n -e '\''s/^.*[ ]\([ABCDGISTW][ABCDGISTW]*\)[ ][ ]*\(\)\([_A-Za-z][_A-Za-z0-9]*\)$/\1 \2\3 \3/p'\'''
lt_cv_sys_global_symbol_to_c_name_address='sed -n -e '\''s/^: \([^ ]*\) $/ {\"\1\", (lt_ptr) 0},/p'\'' -e '\''s/^[BCDEGRST] \([^ ]*\) \([^ ]*\)$/ {"\2", (lt_ptr) \&\2},/p'\'''
lt_cv_sys_global_symbol_to_cdecl='sed -n -e '\''s/^. .* \(.*\)$/extern int \1;/p'\'''
lt_cv_sys_max_cmd_len=32768
lt_lt_cv_prog_compiler_c_o='"yes"'
lt_lt_cv_prog_compiler_c_o_CXX='"no"'
lt_lt_cv_prog_compiler_c_o_GCJ='"no"'
lt_lt_cv_sys_global_symbol_pipe='"sed -n -e '\''s/^.*[ ]\\([ABCDGISTW][ABCDGISTW]*\\)[ ][ ]*\\(\\)\\([_A-Za-z][_A-Za-z0-9]*\\)\$/\\1 \\2\\3 \\3/p'\''"'
lt_lt_cv_sys_global_symbol_to_c_name_address='"sed -n -e '\''s/^: \\([^ ]*\\) \$/ {\\\"\\1\\\", (lt_ptr) 0},/p'\'' -e '\''s/^[BCDEGRST] \\([^ ]*\\) \\([^ ]*\\)\$/ {\"\\2\", (lt_ptr) \\&\\2},/p'\''"'
lt_lt_cv_sys_global_symbol_to_cdecl='"sed -n -e '\''s/^. .* \\(.*\\)\$/extern int \\1;/p'\''"'
## ----------------- ##
## Output variables. ##
## ----------------- ##
ACLOCAL='${SHELL} /home/fernando/superkaramba-0.35/admin/missing --run aclocal-1.7'
AMDEPBACKSLASH='\'
AMDEP_FALSE='#'
AMDEP_TRUE=''
AMTAR='${SHELL} /home/fernando/superkaramba-0.35/admin/missing --run tar'
ARTSCCONFIG=''
AUTOCONF='${SHELL} /home/fernando/superkaramba-0.35/admin/missing --run autoconf'
AUTODIRS=''
AUTOHEADER='${SHELL} /home/fernando/superkaramba-0.35/admin/missing --run autoheader'
AUTOMAKE='${SHELL} /home/fernando/superkaramba-0.35/admin/missing --run automake-1.7'
AWK='mawk'
CC='gcc'
CCDEPMODE='depmode=gcc3'
CFLAGS='-ansi -W -pedantic -Wshadow -Wpointer-arith -Wmissing-prototypes -D_XOPEN_SOURCE=500 -D_BSD_SOURCE -O2 '
CONF_FILES=' $(top_srcdir)/./admin/configure.in.min $(top_srcdir)/configure.in.in'
CPP='gcc -E'
CPPFLAGS=''
CXX='g++'
CXXCPP='g++ -E'
CXXDEPMODE='depmode=gcc3'
CXXFLAGS='-Wnon-virtual-dtor -Wno-long-long -Wundef -pedantic -W -Wpointer-arith -Wmissing-prototypes -ansi -D_XOPEN_SOURCE=500 -D_BSD_SOURCE -Wcast-align -Wconversion -O2 -fno-exceptions -fno-check-new'
CYGPATH_W='echo'
DCOPIDL2CPP=''
DCOPIDL=''
DCOP_DEPENDENCIES=''
DEFS=''
DEPDIR='.deps'
ECHO='echo'
ECHO_C=''
ECHO_N='-n'
ECHO_T=''
EGREP='grep -E'
EXEEXT=''
FRAMEWORK_COREAUDIO=''
GMSGFMT='/usr/bin/msgfmt'
INSTALL_DATA='${INSTALL} -m 644'
INSTALL_PROGRAM='${INSTALL} $(INSTALL_STRIP_FLAG)'
INSTALL_SCRIPT='${INSTALL}'
INSTALL_STRIP_PROGRAM='${SHELL} $(install_sh) -c -s'
KDECONFIG=''
KDE_EXTRA_RPATH=''
KDE_INCLUDES=''
KDE_LDFLAGS=''
KDE_MT_LDFLAGS=''
KDE_MT_LIBS=''
KDE_PLUGIN='-avoid-version -module -no-undefined $(KDE_RPATH) $(KDE_MT_LDFLAGS)'
KDE_RPATH=''
KDE_USE_CLOSURE_FALSE='#'
KDE_USE_CLOSURE_TRUE=''
KDE_USE_FINAL_FALSE=''
KDE_USE_FINAL_TRUE='#'
KDE_XSL_STYLESHEET=''
LDFLAGS=''
LIBCOMPAT=''
LIBCRYPT='-lcrypt'
LIBDL='-ldl'
LIBJPEG=''
LIBOBJS=''
LIBPNG=''
LIBPTHREAD=''
LIBPYTHON=''
LIBRESOLV=''
LIBS=''
LIBSM=''
LIBSOCKET=''
LIBTOOL='$(SHELL) $(top_builddir)/libtool --silent'
LIBUCB=''
LIBUTIL='-lutil'
LIBXINERAMA=''
LIBZ=''
LIB_KAB=''
LIB_KDECORE=''
LIB_KDEPRINT=''
LIB_KDEUI=''
LIB_KFILE=''
LIB_KFM=''
LIB_KHTML=''
LIB_KIO=''
LIB_KPARTS=''
LIB_KSPELL=''
LIB_KSYCOCA=''
LIB_POLL=''
LIB_QPE=''
LIB_QT=''
LIB_SMB=''
LIB_X11=''
LIB_XEXT=''
LN_S='ln -s'
LTLIBOBJS=''
MAKEINFO='${SHELL} /home/fernando/superkaramba-0.35/admin/missing --run makeinfo'
MCOPIDL=''
MEINPROC=''
MOC=''
MSGFMT='/usr/bin/msgfmt'
NOOPT_CFLAGS='-O0'
NOOPT_CXXFLAGS='-O0'
NOREPO='-fno-repo'
OBJEXT='o'
PACKAGE='karamba'
PACKAGE_BUGREPORT=''
PACKAGE_NAME=''
PACKAGE_STRING=''
PACKAGE_TARNAME=''
PACKAGE_VERSION=''
PATH_SEPARATOR=':'
PYTHONINC=''
PYTHONLIB=''
PYTHONMODDIR=''
QTE_NORTTI=''
QT_INCLUDES=''
QT_LDFLAGS=''
RANLIB='ranlib'
REPO='-frepo'
SET_MAKE=''
SHELL='/bin/sh'
STRIP='strip'
TOPSUBDIRS=''
UIC=''
UIC_TR=''
USER_INCLUDES=''
USER_LDFLAGS=''
USE_EXCEPTIONS='-fexceptions'
USE_RTTI=''
USE_THREADS=''
VERSION='0.17'
WOVERLOADED_VIRTUAL=''
XGETTEXT='/usr/bin/xgettext'
XMMS_INCLUDES=''
XMMS_LIBS=''
X_EXTRA_LIBS=''
X_INCLUDES=''
X_LDFLAGS=''
X_PRE_LIBS=''
ac_ct_CC='gcc'
ac_ct_CXX='g++'
ac_ct_RANLIB='ranlib'
ac_ct_STRIP='strip'
all_includes=''
all_libraries=''
am__fastdepCC_FALSE='#'
am__fastdepCC_TRUE=''
am__fastdepCXX_FALSE='#'
am__fastdepCXX_TRUE=''
am__include='include'
am__leading_dot='.'
am__quote=''
bindir='${exec_prefix}/bin'
build='i686-pc-linux-gnu'
build_alias=''
build_cpu='i686'
build_os='linux-gnu'
build_vendor='pc'
datadir='${prefix}/share'
exec_prefix='NONE'
host='i686-pc-linux-gnu'
host_alias=''
host_cpu='i686'
host_os='linux-gnu'
host_vendor='pc'
includedir='${prefix}/include'
infodir='${prefix}/info'
install_sh='/home/fernando/superkaramba-0.35/admin/install-sh'
kde_appsdir=''
kde_bindir=''
kde_confdir=''
kde_datadir=''
kde_htmldir=''
kde_icondir=''
kde_includes=''
kde_libraries=''
kde_libs_htmldir=''
kde_libs_prefix=''
kde_locale=''
kde_mimedir=''
kde_moduledir=''
kde_qtver=''
kde_servicesdir=''
kde_servicetypesdir=''
kde_sounddir=''
kde_styledir=''
kde_templatesdir=''
kde_wallpaperdir=''
kde_widgetdir=''
libdir='${exec_prefix}/lib'
libexecdir='${exec_prefix}/libexec'
localstatedir='${prefix}/var'
mandir='${prefix}/man'
oldincludedir='/usr/include'
prefix='/usr/local/kde'
program_transform_name='s,x,x,'
qt_includes=''
qt_libraries=''
sbindir='${exec_prefix}/sbin'
sharedstatedir='${prefix}/com'
sysconfdir='${prefix}/etc'
target='i686-pc-linux-gnu'
target_alias=''
target_cpu='i686'
target_os='linux-gnu'
target_vendor='pc'
x_includes='NONE'
x_libraries='NONE'
## ----------- ##
## confdefs.h. ##
## ----------- ##
#define HAVE_CRYPT 1
#define HAVE_DLFCN_H 1
#define HAVE_INTTYPES_H 1
#define HAVE_MEMORY_H 1
#define HAVE_RES_INIT 1
#define HAVE_RES_INIT_PROTO 1
#define HAVE_SNPRINTF 1
#define HAVE_STDINT_H 1
#define HAVE_STDINT_H 1
#define HAVE_STDLIB_H 1
#define HAVE_STRINGS_H 1
#define HAVE_STRING_H 1
#define HAVE_SYS_STAT_H 1
#define HAVE_SYS_TYPES_H 1
#define HAVE_SYS_TYPES_H 1
#define HAVE_TEMPLATE_REPOSITORY 1
#define HAVE_UNISTD_H 1
#define HAVE_VSNPRINTF 1
#define KDELIBSUFF ""
#define PACKAGE "karamba"
#define PACKAGE_BUGREPORT ""
#define PACKAGE_NAME ""
#define PACKAGE_STRING ""
#define PACKAGE_TARNAME ""
#define PACKAGE_VERSION ""
#define SIZEOF_CHAR 1
#define SIZEOF_CHAR_P 4
#define SIZEOF_INT 4
#define SIZEOF_LONG 4
#define STDC_HEADERS 1
#define VERSION "0.17"
#define ksize_t socklen_t
#endif
#ifdef __cplusplus
extern "C" void std::exit (int) throw (); using std::exit;
configure: exit 1