All pastes #392812 Raw Edit

Something

public text v1 · immutable
·published 2007-03-13 02:42 UTC
rendered paste body
#include <iostream>
#include <fstream>
#include <cmath>
using namespace std;

get Example4(void);

int main(void)
{
    Example4();
    return 0;
}
void Example4(void)
{
    ofstream fout("sine.txt");
    for(int i = 0, int iteratons = (int) Iterations; i < iterations; i++);
{
    double x = (0.01 * i);
      fout << setprecision(2) << x << "  ->   " << sin(x) << endl;
}
    fout.close();
}

//code
*/
errors
Deleting intermediate and output files for project '4', configuration 'Debug|Win32'
Compiling...
4.cpp
d:\homework-\current\cmpsc.101.progmn\programs\hw3.12.07\3.12.07.4\4\4\4.cpp(6) : error C2146: syntax error : missing ';' before identifier 'Example4'
d:\homework-\current\cmpsc.101.progmn\programs\hw3.12.07\3.12.07.4\4\4\4.cpp(6) : error C4430: missing type specifier - int assumed. Note: C++ does not support default-int
d:\homework-\current\cmpsc.101.progmn\programs\hw3.12.07\3.12.07.4\4\4\4.cpp(6) : error C4430: missing type specifier - int assumed. Note: C++ does not support default-int
d:\homework-\current\cmpsc.101.progmn\programs\hw3.12.07\3.12.07.4\4\4\4.cpp(14) : error C2556: 'void Example4(void)' : overloaded function differs only by return type from 'int Example4(void)'
        d:\homework-\current\cmpsc.101.progmn\programs\hw3.12.07\3.12.07.4\4\4\4.cpp(6) : see declaration of 'Example4'
d:\homework-\current\cmpsc.101.progmn\programs\hw3.12.07\3.12.07.4\4\4\4.cpp(14) : error C2371: 'Example4' : redefinition; different basic types
        d:\homework-\current\cmpsc.101.progmn\programs\hw3.12.07\3.12.07.4\4\4\4.cpp(6) : see declaration of 'Example4'
d:\homework-\current\cmpsc.101.progmn\programs\hw3.12.07\3.12.07.4\4\4\4.cpp(16) : error C2062: type 'int' unexpected
d:\homework-\current\cmpsc.101.progmn\programs\hw3.12.07\3.12.07.4\4\4\4.cpp(16) : error C2065: 'iterations' : undeclared identifier
d:\homework-\current\cmpsc.101.progmn\programs\hw3.12.07\3.12.07.4\4\4\4.cpp(16) : error C2143: syntax error : missing ';' before ')'
d:\homework-\current\cmpsc.101.progmn\programs\hw3.12.07\3.12.07.4\4\4\4.cpp(16) : error C2143: syntax error : missing ';' before ')'
d:\homework-\current\cmpsc.101.progmn\programs\hw3.12.07\3.12.07.4\4\4\4.cpp(19) : error C3861: 'setprecision': identifier not found
Build log was saved at "file://d:\HOMEWORK-\current\cmpsc.101.progmn\programs\hw3.12.07\3.12.07.4\4\4\Debug\BuildLog.htm"
4 - 10 error(s), 0 warning(s)
========== Rebuild All: 0 succeeded, 1 failed, 0 skipped ==========
/*