rendered paste body------ Build started: Project: 2.test, Configuration: Debug Win32 ------
Compiling...
2.test.cpp
d:\homework-\current\cmpsc.101.progmn\programs\hw3.12.07\3.12.07.test\2.test\2.test\2.test.cpp(10) : error C3872: '0xa0': this character is not allowed in an identifier
d:\homework-\current\cmpsc.101.progmn\programs\hw3.12.07\3.12.07.test\2.test\2.test\2.test.cpp(10) : error C3872: '0xa0': this character is not allowed in an identifier
d:\homework-\current\cmpsc.101.progmn\programs\hw3.12.07\3.12.07.test\2.test\2.test\2.test.cpp(11) : error C2065: ' ' : undeclared identifier
d:\homework-\current\cmpsc.101.progmn\programs\hw3.12.07\3.12.07.test\2.test\2.test\2.test.cpp(11) : error C2146: syntax error : missing ';' before identifier ' '
d:\homework-\current\cmpsc.101.progmn\programs\hw3.12.07\3.12.07.test\2.test\2.test\2.test.cpp(11) : error C2146: syntax error : missing ';' before identifier 'Problem2'
Build log was saved at "file://d:\HOMEWORK-\current\cmpsc.101.progmn\programs\hw3.12.07\3.12.07.test\2.test\2.test\Debug\BuildLog.htm"
2.test - 5 error(s), 0 warning(s)
========== Build: 0 succeeded, 1 failed, 0 up-to-date, 0 skipped ==========