All pastes #38952 Raw Edit

Stuff

public text v1 · immutable
#38952 ·published 2006-01-28 23:10 UTC
rendered paste body
Calculating dependencies ...done!
>>> emerge (1 of 3) sys-apps/hwsetup-1.1 to /
>>> checksums files   ;-) hwsetup-1.0-r3.ebuild
>>> checksums files   ;-) hwsetup-1.1.ebuild
>>> checksums files   ;-) files/hwsetup-1.0-dyn_blacklist.patch
>>> checksums files   ;-) files/hwsetup-1.0-fastprobe.patch
>>> checksums files   ;-) files/hwsetup-1.0-gentoo.patch
>>> checksums files   ;-) files/digest-hwsetup-1.1
>>> checksums files   ;-) files/hwsetup-1.1-dyn_blacklist.patch
>>> checksums files   ;-) files/hwsetup-1.1-fastprobe.patch
>>> checksums files   ;-) files/digest-hwsetup-1.0-r3
>>> checksums files   ;-) files/hwsetup-1.1-gentoo.patch
>>> checksums files   ;-) files/hwsetup-1.0-alsa.patch
>>> checksums src_uri ;-) hwsetup_1.1-1.tar.gz
>>> Unpacking source...
>>> Unpacking hwsetup_1.1-1.tar.gz to /var/tmp/portage/hwsetup-1.1/work
 * Applying hwsetup-1.1-dyn_blacklist.patch ...                           [ ok ] * Applying hwsetup-1.1-fastprobe.patch ...                               [ ok ] * Applying hwsetup-1.1-gentoo.patch ...                                  [ ok ]>>> Source unpacked.
>>> Compiling source in /var/tmp/portage/hwsetup-1.1/work/hwsetup-1.1 ...
gcc -I/usr/include/kudzu -DBLACKLIST -Wall -fPIC -O2 -s -o hwsetup hwsetup.c -lkudzu -lpci
hwsetup.c:20:19: error: kudzu.h: No such file or directory
hwsetup.c:196: warning: 'struct device' declared inside parameter list
hwsetup.c:196: warning: its scope is only this definition or declaration, which is probably not what you want
hwsetup.c: In function 'getxinfo':
hwsetup.c:203: error: dereferencing pointer to incomplete type
hwsetup.c:203: error: dereferencing pointer to incomplete type
hwsetup.c:204: error: dereferencing pointer to incomplete type
hwsetup.c:212: error: dereferencing pointer to incomplete type
hwsetup.c:223: error: dereferencing pointer to incomplete type
hwsetup.c:294: error: dereferencing pointer to incomplete type
hwsetup.c:297: error: dereferencing pointer to incomplete type
hwsetup.c:328: error: dereferencing pointer to incomplete type
hwsetup.c:330: error: dereferencing pointer to incomplete type
hwsetup.c:332: error: dereferencing pointer to incomplete type
hwsetup.c:332: error: dereferencing pointer to incomplete type
hwsetup.c:333: error: dereferencing pointer to incomplete type
hwsetup.c:333: error: dereferencing pointer to incomplete type
hwsetup.c:340: error: dereferencing pointer to incomplete type
hwsetup.c: At top level:
hwsetup.c:354: warning: 'struct device' declared inside parameter list
hwsetup.c: In function 'hw_info':
hwsetup.c:356: error: variable 'class' has initializer but incomplete type
hwsetup.c:356: error: dereferencing pointer to incomplete type
hwsetup.c:356: error: storage size of 'class' isn't known
hwsetup.c:357: error: variable 'bus' has initializer but incomplete type
hwsetup.c:357: error: dereferencing pointer to incomplete type
hwsetup.c:357: error: storage size of 'bus' isn't known
hwsetup.c:360: error: 'CLASS_UNSPEC' undeclared (first use in this function)
hwsetup.c:360: error: (Each undeclared identifier is reported only once
hwsetup.c:360: error: for each function it appears in.)
hwsetup.c:360: error: 'CLASS_OTHER' undeclared (first use in this function)
hwsetup.c:361: error: 'CLASS_NETWORK' undeclared (first use in this function)
hwsetup.c:361: error: 'CLASS_SCSI' undeclared (first use in this function)
hwsetup.c:362: error: 'CLASS_VIDEO' undeclared (first use in this function)
hwsetup.c:362: error: 'CLASS_AUDIO' undeclared (first use in this function)
hwsetup.c:363: error: 'CLASS_MOUSE' undeclared (first use in this function)
hwsetup.c:363: error: 'CLASS_MODEM' undeclared (first use in this function)
hwsetup.c:364: error: 'CLASS_CDROM' undeclared (first use in this function)
hwsetup.c:364: error: 'CLASS_TAPE' undeclared (first use in this function)
hwsetup.c:365: error: 'CLASS_FLOPPY' undeclared (first use in this function)
hwsetup.c:365: error: 'CLASS_SCANNER' undeclared (first use in this function)
hwsetup.c:366: error: 'CLASS_HD' undeclared (first use in this function)
hwsetup.c:366: error: 'CLASS_RAID' undeclared (first use in this function)
hwsetup.c:367: error: 'CLASS_PRINTER' undeclared (first use in this function)
hwsetup.c:367: error: 'CLASS_CAPTURE' undeclared (first use in this function)
hwsetup.c:368: error: 'CLASS_USB' undeclared (first use in this function)
hwsetup.c:368: error: 'CLASS_MONITOR' undeclared (first use in this function)
hwsetup.c:369: error: 'CLASS_KEYBOARD' undeclared (first use in this function)
hwsetup.c:370: error: 'BUS_OTHER' undeclared (first use in this function)
hwsetup.c:370: error: 'BUS_PCI' undeclared (first use in this function)
hwsetup.c:371: error: 'BUS_SBUS' undeclared (first use in this function)
hwsetup.c:371: error: 'BUS_PSAUX' undeclared (first use in this function)
hwsetup.c:372: error: 'BUS_SERIAL' undeclared (first use in this function)
hwsetup.c:372: error: 'BUS_PARALLEL' undeclared (first use in this function)
hwsetup.c:373: error: 'BUS_SCSI' undeclared (first use in this function)
hwsetup.c:373: error: 'BUS_IDE' undeclared (first use in this function)
hwsetup.c:374: error: 'BUS_DDC' undeclared (first use in this function)
hwsetup.c:374: error: 'BUS_USB' undeclared (first use in this function)
hwsetup.c:375: error: 'BUS_KEYBOARD' undeclared (first use in this function)
hwsetup.c:386: error: dereferencing pointer to incomplete type
hwsetup.c:386: error: dereferencing pointer to incomplete type
hwsetup.c:386: error: dereferencing pointer to incomplete type
hwsetup.c:387: error: dereferencing pointer to incomplete type
hwsetup.c:387: error: dereferencing pointer to incomplete type
hwsetup.c:357: warning: unused variable 'bus'
hwsetup.c:356: warning: unused variable 'class'
hwsetup.c: At top level:
hwsetup.c:404: warning: 'struct device' declared inside parameter list
hwsetup.c: In function 'link_dev':
hwsetup.c:407: error: dereferencing pointer to incomplete type
hwsetup.c:410: error: dereferencing pointer to incomplete type
hwsetup.c: At top level:
hwsetup.c:519: warning: 'struct device' declared inside parameter list
hwsetup.c: In function 'writeconfig':
hwsetup.c:535: error: dereferencing pointer to incomplete type
hwsetup.c:537: error: 'CLASS_AUDIO' undeclared (first use in this function)
hwsetup.c:539: error: dereferencing pointer to incomplete type
hwsetup.c:539: error: dereferencing pointer to incomplete type
hwsetup.c:540: error: dereferencing pointer to incomplete type
hwsetup.c:541: error: dereferencing pointer to incomplete type
hwsetup.c:541: error: dereferencing pointer to incomplete type
hwsetup.c:542: error: dereferencing pointer to incomplete type
hwsetup.c:544: error: 'CLASS_MOUSE' undeclared (first use in this function)
hwsetup.c:547: error: dereferencing pointer to incomplete type
hwsetup.c:547: error: 'BUS_PSAUX' undeclared (first use in this function)
hwsetup.c:548: error: dereferencing pointer to incomplete type
hwsetup.c:548: error: 'BUS_USB' undeclared (first use in this function)
hwsetup.c:551: error: dereferencing pointer to incomplete type
hwsetup.c:551: error: dereferencing pointer to incomplete type
hwsetup.c:552: error: dereferencing pointer to incomplete type
hwsetup.c:553: error: dereferencing pointer to incomplete type
hwsetup.c:553: error: dereferencing pointer to incomplete type
hwsetup.c:554: error: dereferencing pointer to incomplete type
hwsetup.c:556: error: 'CLASS_NETWORK' undeclared (first use in this function)
hwsetup.c:558: error: dereferencing pointer to incomplete type
hwsetup.c:558: error: dereferencing pointer to incomplete type
hwsetup.c:559: error: dereferencing pointer to incomplete type
hwsetup.c:560: error: dereferencing pointer to incomplete type
hwsetup.c:560: error: dereferencing pointer to incomplete type
hwsetup.c:561: error: dereferencing pointer to incomplete type
hwsetup.c:563: error: 'CLASS_VIDEO' undeclared (first use in this function)
hwsetup.c:569: warning: passing argument 1 of 'getxinfo' from incompatible pointer type
hwsetup.c:582: error: 'CLASS_FLOPPY' undeclared (first use in this function)
hwsetup.c:584: error: dereferencing pointer to incomplete type
hwsetup.c:584: error: dereferencing pointer to incomplete type
hwsetup.c:585: error: dereferencing pointer to incomplete type
hwsetup.c:586: error: dereferencing pointer to incomplete type
hwsetup.c:586: error: dereferencing pointer to incomplete type
hwsetup.c:587: error: dereferencing pointer to incomplete type
hwsetup.c:588: error: dereferencing pointer to incomplete type
hwsetup.c:588: error: dereferencing pointer to incomplete type
hwsetup.c:589: error: dereferencing pointer to incomplete type
hwsetup.c: At top level:
hwsetup.c:597: warning: 'enum deviceClass' declared inside parameter list
hwsetup.c:597: error: parameter 1 ('dc') has incomplete type
hwsetup.c: In function 'hw_setup':
hwsetup.c:600: error: 'PROBE_SAFE' undeclared (first use in this function)
hwsetup.c:600: error: 'PROBE_ALL' undeclared (first use in this function)
hwsetup.c:603: warning: implicit declaration of function 'probeDevices'
hwsetup.c:603: error: 'BUS_UNSPEC' undeclared (first use in this function)
hwsetup.c:603: warning: assignment makes pointer from integer without a cast
hwsetup.c:607: warning: passing argument 1 of 'hw_info' from incompatible pointer type
hwsetup.c:613: error: dereferencing pointer to incomplete type
hwsetup.c:615: error: 'CLASS_MOUSE' undeclared (first use in this function)
hwsetup.c:617: error: dereferencing pointer to incomplete type
hwsetup.c:617: error: 'BUS_SERIAL' undeclared (first use in this function)
hwsetup.c:619: error: dereferencing pointer to incomplete type
hwsetup.c:619: error: 'BUS_USB' undeclared (first use in this function)
hwsetup.c:621: error: dereferencing pointer to incomplete type
hwsetup.c:623: warning: passing argument 2 of 'writeconfig' from incompatible pointer type
hwsetup.c:624: warning: passing argument 1 of 'link_dev' from incompatible pointer type
hwsetup.c:626: error: 'CLASS_CDROM' undeclared (first use in this function)
hwsetup.c:626: error: dereferencing pointer to incomplete type
hwsetup.c:626: error: dereferencing pointer to incomplete type
hwsetup.c:627: warning: passing argument 1 of 'link_dev' from incompatible pointer type
hwsetup.c:628: error: 'CLASS_MODEM' undeclared (first use in this function)
hwsetup.c:628: error: dereferencing pointer to incomplete type
hwsetup.c:628: error: dereferencing pointer to incomplete type
hwsetup.c:629: warning: passing argument 1 of 'link_dev' from incompatible pointer type
hwsetup.c:630: error: 'CLASS_SCANNER' undeclared (first use in this function)
hwsetup.c:630: error: dereferencing pointer to incomplete type
hwsetup.c:630: error: dereferencing pointer to incomplete type
hwsetup.c:631: warning: passing argument 1 of 'link_dev' from incompatible pointer type
hwsetup.c:632: error: 'CLASS_VIDEO' undeclared (first use in this function)
hwsetup.c:632: warning: passing argument 2 of 'writeconfig' from incompatible pointer type
hwsetup.c:634: error: 'CLASS_AUDIO' undeclared (first use in this function)
hwsetup.c:635: warning: passing argument 2 of 'writeconfig' from incompatible pointer type
hwsetup.c:636: error: dereferencing pointer to incomplete type
hwsetup.c:637: error: 'CLASS_NETWORK' undeclared (first use in this function)
hwsetup.c:637: warning: passing argument 2 of 'writeconfig' from incompatible pointer type
hwsetup.c:638: error: dereferencing pointer to incomplete type
hwsetup.c:639: error: 'CLASS_FLOPPY' undeclared (first use in this function)
hwsetup.c:639: warning: passing argument 2 of 'writeconfig' from incompatible pointer type
hwsetup.c:640: error: dereferencing pointer to incomplete type
hwsetup.c:641: error: 'CLASS_KEYBOARD' undeclared (first use in this function)
hwsetup.c:641: error: dereferencing pointer to incomplete type
hwsetup.c:641: error: dereferencing pointer to incomplete type
hwsetup.c:643: error: 'CLASS_CAPTURE' undeclared (first use in this function)
hwsetup.c:644: error: 'CLASS_SCSI' undeclared (first use in this function)
hwsetup.c:645: error: 'CLASS_OTHER' undeclared (first use in this function)
hwsetup.c:646: error: 'CLASS_RAID' undeclared (first use in this function)
hwsetup.c:646: error: dereferencing pointer to incomplete type
hwsetup.c:647: error: 'CLASS_SOCKET' undeclared (first use in this function)
hwsetup.c: In function 'main':
hwsetup.c:658: error: variable 'dc' has initializer but incomplete type
hwsetup.c:658: error: 'CLASS_UNSPEC' undeclared (first use in this function)
hwsetup.c:658: error: storage size of 'dc' isn't known
hwsetup.c:675: error: type of formal parameter 1 is incomplete
hwsetup.c:658: warning: unused variable 'dc'
make: *** [hwsetup] Error 1

!!! ERROR: sys-apps/hwsetup-1.1 failed.
!!! Function src_compile, Line 34, Exitcode 2
!!! (no error message)
!!! If you need support, post the topmost build error, NOT this status message.