rendered paste bodyi686-pc-linux-gnu-gcc -march=athlon-xp -pipe -O2 -Wall -Wchar-subscripts -Wmissing-declarations -Wmissing-prototypes -Wnested-externs -Wpointer-arith -Wcast-align -Wfloat-equal -Wsign-compare -o .libs/statemachine-client statemachine-client.o sm-marshal.o -pthread ../../../glib/.libs/libdbus-glib-1.so /var/tmp/portage/dbus-0.60-r3/work/dbus-0.60/dbus/.libs/libdbus-1.so /usr/lib/libgtk-x11-2.0.so /usr/lib/libgdk-x11-2.0.so /usr/lib/libatk-1.0.so /usr/lib/libgdk_pixbuf-2.0.so /usr/lib/libpangocairo-1.0.so /usr/lib/libpangoft2-1.0.so /usr/lib/libpango-1.0.so /usr/lib/libcairo.so -lXrender -lX11 -lXext -lpng12 /usr/lib/libfontconfig.so /usr/lib/libexpat.so /usr/lib/libfreetype.so -lz -lm /usr/lib/libgobject-2.0.so /usr/lib/libgmodule-2.0.so -ldl /usr/lib/libgthread-2.0.so -lpthread /usr/lib/libglib-2.0.so -lnsl
creating statemachine-client
make[7]: Leaving directory `/var/tmp/portage/dbus-0.60-r3/work/dbus-0.60/glib/examples/statemachine'
make[6]: Leaving directory `/var/tmp/portage/dbus-0.60-r3/work/dbus-0.60/glib/examples/statemachine'
make[5]: Leaving directory `/var/tmp/portage/dbus-0.60-r3/work/dbus-0.60/glib/examples'
make[4]: Leaving directory `/var/tmp/portage/dbus-0.60-r3/work/dbus-0.60/glib/examples'
make[3]: Leaving directory `/var/tmp/portage/dbus-0.60-r3/work/dbus-0.60/glib'
make[2]: Leaving directory `/var/tmp/portage/dbus-0.60-r3/work/dbus-0.60/glib'
Making all in gcj
make[2]: Entering directory `/var/tmp/portage/dbus-0.60-r3/work/dbus-0.60/gcj'
Making all in org
make[3]: Entering directory `/var/tmp/portage/dbus-0.60-r3/work/dbus-0.60/gcj/org'
Making all in freedesktop
make[4]: Entering directory `/var/tmp/portage/dbus-0.60-r3/work/dbus-0.60/gcj/org/freedesktop'
Making all in dbus
make[5]: Entering directory `/var/tmp/portage/dbus-0.60-r3/work/dbus-0.60/gcj/org/freedesktop/dbus'
gcj -C Message.java -d ../../..
/bin/sh ../../../../libtool --mode=compile i686-pc-linux-gnu-g++ -I../../../.. -I../../../../gcj/org/freedesktop/dbus -march=athlon-xp -pipe -O2 -DDBUS_API_SUBJECT_TO_CHANGE=1 -c -o 'natMessage.lo' 'natMessage.cc'
/bin/sh ../../../../libtool --mode=compile gcj -I../../../.. -I../../../../gcj/org/freedesktop/dbus -c -o 'Message.lo' 'Message.java'
mkdir .libs
i686-pc-linux-gnu-g++ -I../../../.. -I../../../../gcj/org/freedesktop/dbus -march=athlon-xp -pipe -O2 -DDBUS_API_SUBJECT_TO_CHANGE=1 -c natMessage.cc -fPIC -DPIC -o .libs/natMessage.o
natMessage.cc:8:21: Message.h: No such file or directory
natMessage.cc:15: error: syntax error before `::' token
gcj -I../../../.. -I../../../../gcj/org/freedesktop/dbus -c Message.java -fPIC -o .libs/Message.o
make[5]: *** [natMessage.lo] Error 1
make[5]: *** Waiting for unfinished jobs....
gcj -I../../../.. -I../../../../gcj/org/freedesktop/dbus -c Message.java -o Message.o >/dev/null 2>&1
make[5]: Leaving directory `/var/tmp/portage/dbus-0.60-r3/work/dbus-0.60/gcj/org/freedesktop/dbus'
make[4]: *** [all-recursive] Error 1
make[4]: Leaving directory `/var/tmp/portage/dbus-0.60-r3/work/dbus-0.60/gcj/org/freedesktop'
make[3]: *** [all-recursive] Error 1
make[3]: Leaving directory `/var/tmp/portage/dbus-0.60-r3/work/dbus-0.60/gcj/org'
make[2]: *** [all-recursive] Error 1
make[2]: Leaving directory `/var/tmp/portage/dbus-0.60-r3/work/dbus-0.60/gcj'
make[1]: *** [all-recursive] Error 1
make[1]: Leaving directory `/var/tmp/portage/dbus-0.60-r3/work/dbus-0.60'
make: *** [all] Error 2
!!! ERROR: sys-apps/dbus-0.60-r3 failed.
!!! Function src_compile, Line 106, Exitcode 2
!!! make failed
!!! If you need support, post the topmost build error, NOT this status message.