All pastes #38658 Raw Edit

Someone

public text v1 · immutable
#38658 ·published 2006-01-26 14:04 UTC
rendered paste body
gcc -DHAVE_CONFIG_H -I. -I. -I.. -I.. -I./.. -I../intl -DCAMEL_LIBEXECDIR=\"/opt/gnome2/libexec\" -DCAMEL_PROVIDERDIR=\"/opt/gnome2/lib/evolution-data-server-1.2/camel-providers\" -DG_LOG_DOMAIN=\"camel\" -DCAMEL_EXPLICIT_TRANSLATION_DOMAIN=\"evolution-data-server-1.6\" -DE_DATA_SERVER_PREFIX=\"/opt/gnome2\" -DEVOLUTION_LOCALEDIR=\"/opt/gnome2/share/locale\" -pthread -I/opt/mozilla/include/nss -I/usr/include/nspr -I/opt/gnome/include/glib-2.0 -I/opt/gnome/lib/glib-2.0/include -g -O2 -Wall -Wmissing-prototypes -Wno-sign-compare -MT camel.lo -MD -MP -MF .deps/camel.Tpo -c camel.c  -fPIC -DPIC -o .libs/camel.o
camel.c:35:17: error: ssl.h: No such file or directory
camel.c: In function 'camel_shutdown':
camel.c:59: warning: implicit declaration of function 'NSS_Shutdown'
camel.c: In function 'camel_init':
camel.c:94: warning: implicit declaration of function 'NSS_InitReadWrite'
camel.c:94: error: 'SECFailure' undeclared (first use in this function)
camel.c:94: error: (Each undeclared identifier is reported only once
camel.c:94: error: for each function it appears in.)
camel.c:96: warning: implicit declaration of function 'NSS_NoDB_Init'
camel.c:102: warning: implicit declaration of function 'NSS_SetDomesticPolicy'
camel.c:104: warning: implicit declaration of function 'SSL_OptionSetDefault'
camel.c:104: error: 'SSL_ENABLE_SSL2' undeclared (first use in this function)
camel.c:105: error: 'SSL_ENABLE_SSL3' undeclared (first use in this function)
camel.c:106: error: 'SSL_ENABLE_TLS' undeclared (first use in this function)
camel.c:107: error: 'SSL_V2_COMPATIBLE_HELLO' undeclared (first use in this function)
make[2]: *** [camel.lo] Error 1
make[2]: Leaving directory `/home/alamelu85/cvs/gnome2/evolution-data-server/camel'
make[1]: *** [install-recursive] Error 1
make[1]: Leaving directory `/home/alamelu85/cvs/gnome2/evolution-data-server/camel'
make: *** [install-recursive] Error 1