rendered paste body>>> emerge (3 of 6) sys-apps/kudzu-knoppix-1.1.36-r2 to /
>>> Downloading http://distfiles.gentoo.org/distfiles/kudzu-knoppix_1.1.36-2.tar.gz
--11:48:03-- http://distfiles.gentoo.org/distfiles/kudzu-knoppix_1.1.36-2.tar.gz
=> `/usr/portage/distfiles/kudzu-knoppix_1.1.36-2.tar.gz'
Resolving distfiles.gentoo.org... 64.50.236.52, 216.165.129.135, 156.56.247.195Connecting to distfiles.gentoo.org|64.50.236.52|:80... connected.
HTTP request sent, awaiting response... 404 Not Found
11:48:03 ERROR 404: Not Found.
>>> Downloading http://distro.ibiblio.org/pub/linux/distributions/gentoo/distfiles/kudzu-knoppix_1.1.36-2.tar.gz
--11:48:03-- http://distro.ibiblio.org/pub/linux/distributions/gentoo/distfiles/kudzu-knoppix_1.1.36-2.tar.gz
=> `/usr/portage/distfiles/kudzu-knoppix_1.1.36-2.tar.gz'
Resolving distro.ibiblio.org... 152.2.210.109
Connecting to distro.ibiblio.org|152.2.210.109|:80... connected.
HTTP request sent, awaiting response... 404 Not Found
11:48:04 ERROR 404: Not Found.
>>> Downloading http://gentoo.mirrors.tds.net/gentoo/distfiles/kudzu-knoppix_1.1.36-2.tar.gz
--11:48:04-- http://gentoo.mirrors.tds.net/gentoo/distfiles/kudzu-knoppix_1.1.36-2.tar.gz
=> `/usr/portage/distfiles/kudzu-knoppix_1.1.36-2.tar.gz'
Resolving gentoo.mirrors.tds.net... 216.165.129.134
Connecting to gentoo.mirrors.tds.net|216.165.129.134|:80... connected.
HTTP request sent, awaiting response... 404 Not Found
11:48:04 ERROR 404: Not Found.
>>> Downloading http://priorartdb.org/files/kudzu-knoppix_1.1.36-2.tar.gz
--11:48:04-- http://priorartdb.org/files/kudzu-knoppix_1.1.36-2.tar.gz
=> `/usr/portage/distfiles/kudzu-knoppix_1.1.36-2.tar.gz'
Resolving priorartdb.org... 67.106.77.160
Connecting to priorartdb.org|67.106.77.160|:80... connected.
HTTP request sent, awaiting response... 200 OK
Length: 708,324 (692K) [application/x-gzip]
100%[===================================>] 708,324 502.28K/s
11:48:06 (500.51 KB/s) - `/usr/portage/distfiles/kudzu-knoppix_1.1.36-2.tar.gz' saved [708324/708324]
>>> checksums files ;-) kudzu-knoppix-1.1.36-r2.ebuild
>>> checksums files ;-) files/sunlance.patch
>>> checksums files ;-) files/kudzu.conf.d
>>> checksums files ;-) files/kudzu-knoppix-1.1.36-nonls-v4.patch
>>> checksums files ;-) files/kudzu.rc
>>> checksums files ;-) files/digest-kudzu-knoppix-1.1.36-r2
>>> checksums src_uri ;-) kudzu-knoppix_1.1.36-2.tar.gz
>>> Unpacking source...
>>> Unpacking kudzu-knoppix_1.1.36-2.tar.gz to /var/tmp/portage/kudzu-knoppix-1.1.36-r2/work
* Applying sunlance.patch ... [ ok ]>>> Source unpacked.
>>> Compiling source in /var/tmp/portage/kudzu-knoppix-1.1.36-r2/work/kudzu-1.1.36 ...
( cd ddcprobe ; make libvbe.a CFLAGS="-march=pentium4 -O2 -pipe -fomit-frame-pointer" )
make[1]: Entering directory `/var/tmp/portage/kudzu-knoppix-1.1.36-r2/work/kudzu-1.1.36/ddcprobe'
gcc -march=pentium4 -O2 -pipe -fomit-frame-pointer -c -o lrmi.o lrmi.c
gcc -march=pentium4 -O2 -pipe -fomit-frame-pointer -c -o vesamode.o vesamode.c
gcc -march=pentium4 -O2 -pipe -fomit-frame-pointer -c -o vbe.o vbe.c
vbe.c: In function 'vbe_get_vbe_info':
vbe.c:129: warning: pointer targets in assignment differ in signedness
vbe.c:130: warning: pointer targets in passing argument 1 of 'strlen' differ in signedness
vbe.c:133: warning: pointer targets in assignment differ in signedness
vbe.c:143: warning: pointer targets in assignment differ in signedness
vbe.c:144: warning: pointer targets in passing argument 1 of 'strlen' differ in signedness
vbe.c:147: warning: pointer targets in assignment differ in signedness
vbe.c:154: warning: pointer targets in assignment differ in signedness
vbe.c:155: warning: pointer targets in passing argument 1 of 'strlen' differ in signedness
vbe.c:158: warning: pointer targets in assignment differ in signedness
vbe.c:165: warning: pointer targets in assignment differ in signedness
vbe.c:166: warning: pointer targets in passing argument 1 of 'strlen' differ in signedness
vbe.c:169: warning: pointer targets in assignment differ in signedness
ar cru libvbe.a lrmi.o vesamode.o vbe.o
make[1]: Leaving directory `/var/tmp/portage/kudzu-knoppix-1.1.36-r2/work/kudzu-1.1.36/ddcprobe'
cc -c -march=pentium4 -O2 -pipe -fomit-frame-pointer -Wall -D_GNU_SOURCE -g -I. -DVERSION=\"1.1.36\" -fpic -o kudzu.o kudzu.c
kudzu.c: In function 'writeDevice':
kudzu.c:167: warning: 'class' may be used uninitialized in this function
kudzu.c: In function 'matchNetDevices':
kudzu.c:905: warning: 'b' may be used uninitialized in this function
cc -c -march=pentium4 -O2 -pipe -fomit-frame-pointer -Wall -D_GNU_SOURCE -g -I. -DVERSION=\"1.1.36\" -fpic -o modules.o modules.c
cc -c -march=pentium4 -O2 -pipe -fomit-frame-pointer -Wall -D_GNU_SOURCE -g -I. -DVERSION=\"1.1.36\" -fpic -o pci.o pci.c
pci.c:681: error: syntax error before 'byte'
pci.c: In function 'isDisabled':
pci.c:691: error: 'config' undeclared (first use in this function)
pci.c:691: error: (Each undeclared identifier is reported only once
pci.c:691: error: for each function it appears in.)
pci.c:692: error: 'p' undeclared (first use in this function)
pci.c: In function 'pciProbe':
pci.c:752: error: 'byte' undeclared (first use in this function)
pci.c:752: error: syntax error before 'config'
pci.c:754: error: 'config' undeclared (first use in this function)
pci.c:765: error: syntax error before 'config'
make: *** [pci.o] Error 1
!!! ERROR: sys-apps/kudzu-knoppix-1.1.36-r2 failed.
!!! Function src_compile, Line 53, Exitcode 2
!!! (no error message)
!!! If you need support, post the topmost build error, NOT this status message.