rendered paste bodyThis file contains any messages produced by compilers while
running configure, to aid debugging if configure makes a mistake.
It was created by configure, which was
generated by GNU Autoconf 2.59. Invocation command line was
$ ./configure --prefix=/usr --host=i686-pc-linux-gnu --mandir=/usr/share/man --infodir=/usr/share/info --datadir=/usr/share --sysconfdir=/etc --localstatedir=/var/lib --enable-alsa --enable-vorbis --enable-libmad --without-jack --with-esd --without-nas --with-audiofile --without-mas --with-x --enable-mitshm --without-xinerama --with-qt-dir=/usr/qt/3 --enable-mt --with-qt-libraries=/usr/qt/3/lib --disable-dependency-tracking --disable-debug --without-debug --disable-final --with-arts --prefix=/usr/kde/3.5 --mandir=/usr/kde/3.5/share/man --infodir=/usr/kde/3.5/share/info --datadir=/usr/kde/3.5/share --sysconfdir=/usr/kde/3.5/etc --build=i686-pc-linux-gnu
## --------- ##
## Platform. ##
## --------- ##
hostname = BuddhasFamily
uname -m = i686
uname -r = 2.6.15-gentoo-r1
uname -s = Linux
uname -v = #1 SMP PREEMPT Mon Jan 23 15:57:36 EST 2006
/usr/bin/uname -p = Intel(R) Pentium(R) 4 CPU 3.00GHz
/bin/uname -X = unknown
/bin/arch = i686
/usr/bin/arch -k = unknown
/usr/convex/getsysinfo = unknown
hostinfo = unknown
/bin/machine = unknown
/usr/bin/oslevel = unknown
/bin/universe = unknown
PATH: /usr/kde/3.5/bin
PATH: /sbin
PATH: /usr/sbin
PATH: /usr/lib/portage/bin
PATH: /bin
PATH: /usr/bin
PATH: /opt/bin
PATH: /usr/i686-pc-linux-gnu/gcc-bin/4.0.1
PATH: /opt/ati/bin
PATH: /opt/blackdown-jdk-1.4.2.03/bin
PATH: /opt/blackdown-jdk-1.4.2.03/jre/bin
PATH: /usr/bin
PATH: /usr/qt/3/bin
PATH: /usr/kde/3.4/sbin
PATH: /usr/kde/3.4/bin
## ----------- ##
## Core tests. ##
## ----------- ##
configure:1615: checking build system type
configure:1633: result: i686-pc-linux-gnu
configure:1641: checking host system type
configure:1655: result: i686-pc-linux-gnu
configure:1663: checking target system type
configure:1677: result: i686-pc-linux-gnu
configure:1729: checking for a BSD-compatible install
configure:1784: result: /bin/install -c
configure:1799: checking for -p flag to install
configure:1812: result: yes
configure:1823: checking whether build environment is sane
configure:1866: result: yes
configure:1918: checking for gawk
configure:1934: found /bin/gawk
configure:1944: result: gawk
configure:1954: checking whether make sets $(MAKE)
configure:1974: result: yes
configure:2155: checking for a BSD-compatible install
configure:2210: result: /bin/install -c -p
configure:2236: checking for style of include used by make
configure:2264: result: GNU
configure:2374: checking for i686-pc-linux-gnu-gcc
configure:2390: found /usr/bin/i686-pc-linux-gnu-gcc
configure:2400: result: i686-pc-linux-gnu-gcc
configure:2682: checking for C compiler version
configure:2685: i686-pc-linux-gnu-gcc --version </dev/null >&5
i686-pc-linux-gnu-gcc (GCC) 4.0.1 (Gentoo 4.0.1, pie-8.7.8)
Copyright (C) 2005 Free Software Foundation, Inc.
This is free software; see the source for copying conditions. There is NO
warranty; not even for MERCHANTABILITY or FITNESS FOR A PARTICULAR PURPOSE.
configure:2688: $? = 0
configure:2690: i686-pc-linux-gnu-gcc -v </dev/null >&5
Using built-in specs.
Target: i686-pc-linux-gnu
Configured with: /var/tmp/portage/gcc-4.0.1/work/gcc-4.0.1/configure --prefix=/usr --bindir=/usr/i686-pc-linux-gnu/gcc-bin/4.0.1 --includedir=/usr/lib/gcc/i686-pc-linux-gnu/4.0.1/include --datadir=/usr/share/gcc-data/i686-pc-linux-gnu/4.0.1 --mandir=/usr/share/gcc-data/i686-pc-linux-gnu/4.0.1/man --infodir=/usr/share/gcc-data/i686-pc-linux-gnu/4.0.1/info --with-gxx-include-dir=/usr/lib/gcc/i686-pc-linux-gnu/4.0.1/include/g++-v4 --host=i686-pc-linux-gnu --build=i686-pc-linux-gnu --disable-altivec --enable-nls --without-included-gettext --with-system-zlib --disable-checking --disable-werror --disable-libunwind-exceptions --disable-multilib --disable-libgcj --enable-languages=c,c++,f95 --enable-shared --enable-threads=posix --enable-__cxa_atexit --enable-clocale=gnu
Thread model: posix
gcc version 4.0.1 (Gentoo 4.0.1, pie-8.7.8)
configure:2693: $? = 0
configure:2695: i686-pc-linux-gnu-gcc -V </dev/null >&5
i686-pc-linux-gnu-gcc: '-V' option must have argument
configure:2698: $? = 1
configure:2721: checking for C compiler default output file name
configure:2724: i686-pc-linux-gnu-gcc -march=pentium4 -O2 -pipe -fomit-frame-pointer conftest.c >&5
configure:2727: $? = 0
configure:2773: result: a.out
configure:2778: checking whether the C compiler works
configure:2784: ./a.out
configure:2787: $? = 0
configure:2804: result: yes
configure:2811: checking whether we are cross compiling
configure:2813: result: no
configure:2816: checking for suffix of executables
configure:2818: i686-pc-linux-gnu-gcc -o conftest -march=pentium4 -O2 -pipe -fomit-frame-pointer conftest.c >&5
configure:2821: $? = 0
configure:2846: result:
configure:2852: checking for suffix of object files
configure:2873: i686-pc-linux-gnu-gcc -c -march=pentium4 -O2 -pipe -fomit-frame-pointer conftest.c >&5
configure:2876: $? = 0
configure:2898: result: o
configure:2902: checking whether we are using the GNU C compiler
configure:2926: i686-pc-linux-gnu-gcc -c -march=pentium4 -O2 -pipe -fomit-frame-pointer conftest.c >&5
configure:2932: $? = 0
configure:2936: test -z
|| test ! -s conftest.err
configure:2939: $? = 0
configure:2942: test -s conftest.o
configure:2945: $? = 0
configure:2958: result: yes
configure:2964: checking whether i686-pc-linux-gnu-gcc accepts -g
configure:2985: i686-pc-linux-gnu-gcc -c -g conftest.c >&5
configure:2991: $? = 0
configure:2995: test -z
|| test ! -s conftest.err
configure:2998: $? = 0
configure:3001: test -s conftest.o
configure:3004: $? = 0
configure:3015: result: yes
configure:3032: checking for i686-pc-linux-gnu-gcc option to accept ANSI C
configure:3102: i686-pc-linux-gnu-gcc -c -march=pentium4 -O2 -pipe -fomit-frame-pointer conftest.c >&5
configure:3108: $? = 0
configure:3112: test -z
|| test ! -s conftest.err
configure:3115: $? = 0
configure:3118: test -s conftest.o
configure:3121: $? = 0
configure:3139: result: none needed
configure:3157: i686-pc-linux-gnu-gcc -c -march=pentium4 -O2 -pipe -fomit-frame-pointer conftest.c >&5
conftest.c:2: error: syntax error before 'me'
configure:3163: $? = 1
configure: failed program was:
| #ifndef __cplusplus
| choke me
| #endif
configure:3298: checking dependency style of i686-pc-linux-gnu-gcc
configure:3388: result: none
configure:3411: checking how to run the C preprocessor
configure:3446: i686-pc-linux-gnu-gcc -E conftest.c
configure:3452: $? = 0
configure:3484: i686-pc-linux-gnu-gcc -E conftest.c
conftest.c:11:28: error: ac_nonexistent.h: No such file or directory
configure:3490: $? = 1
configure: failed program was:
| /* confdefs.h. */
|
| #define PACKAGE_NAME ""
| #define PACKAGE_TARNAME ""
| #define PACKAGE_VERSION ""
| #define PACKAGE_STRING ""
| #define PACKAGE_BUGREPORT ""
| #define PACKAGE "arts"
| #define VERSION "1.5.0"
| /* end confdefs.h. */
| #include <ac_nonexistent.h>
configure:3529: result: i686-pc-linux-gnu-gcc -E
configure:3553: i686-pc-linux-gnu-gcc -E conftest.c
configure:3559: $? = 0
configure:3591: i686-pc-linux-gnu-gcc -E conftest.c
conftest.c:11:28: error: ac_nonexistent.h: No such file or directory
configure:3597: $? = 1
configure: failed program was:
| /* confdefs.h. */
|
| #define PACKAGE_NAME ""
| #define PACKAGE_TARNAME ""
| #define PACKAGE_VERSION ""
| #define PACKAGE_STRING ""
| #define PACKAGE_BUGREPORT ""
| #define PACKAGE "arts"
| #define VERSION "1.5.0"
| /* end confdefs.h. */
| #include <ac_nonexistent.h>
configure:3679: checking for i686-pc-linux-gnu-g++
configure:3695: found /usr/bin/i686-pc-linux-gnu-g++
configure:3705: result: i686-pc-linux-gnu-g++
configure:3763: checking for C++ compiler version
configure:3766: i686-pc-linux-gnu-g++ --version </dev/null >&5
i686-pc-linux-gnu-g++ (GCC) 4.0.1 (Gentoo 4.0.1, pie-8.7.8)
Copyright (C) 2005 Free Software Foundation, Inc.
This is free software; see the source for copying conditions. There is NO
warranty; not even for MERCHANTABILITY or FITNESS FOR A PARTICULAR PURPOSE.
configure:3769: $? = 0
configure:3771: i686-pc-linux-gnu-g++ -v </dev/null >&5
Using built-in specs.
Target: i686-pc-linux-gnu
Configured with: /var/tmp/portage/gcc-4.0.1/work/gcc-4.0.1/configure --prefix=/usr --bindir=/usr/i686-pc-linux-gnu/gcc-bin/4.0.1 --includedir=/usr/lib/gcc/i686-pc-linux-gnu/4.0.1/include --datadir=/usr/share/gcc-data/i686-pc-linux-gnu/4.0.1 --mandir=/usr/share/gcc-data/i686-pc-linux-gnu/4.0.1/man --infodir=/usr/share/gcc-data/i686-pc-linux-gnu/4.0.1/info --with-gxx-include-dir=/usr/lib/gcc/i686-pc-linux-gnu/4.0.1/include/g++-v4 --host=i686-pc-linux-gnu --build=i686-pc-linux-gnu --disable-altivec --enable-nls --without-included-gettext --with-system-zlib --disable-checking --disable-werror --disable-libunwind-exceptions --disable-multilib --disable-libgcj --enable-languages=c,c++,f95 --enable-shared --enable-threads=posix --enable-__cxa_atexit --enable-clocale=gnu
Thread model: posix
gcc version 4.0.1 (Gentoo 4.0.1, pie-8.7.8)
configure:3774: $? = 0
configure:3776: i686-pc-linux-gnu-g++ -V </dev/null >&5
i686-pc-linux-gnu-g++: '-V' option must have argument
configure:3779: $? = 1
configure:3782: checking whether we are using the GNU C++ compiler
configure:3806: i686-pc-linux-gnu-g++ -c -march=pentium4 -O2 -pipe -fomit-frame-pointer conftest.cc >&5
configure:3812: $? = 0
configure:3816: test -z
|| test ! -s conftest.err
configure:3819: $? = 0
configure:3822: test -s conftest.o
configure:3825: $? = 0
configure:3838: result: yes
configure:3844: checking whether i686-pc-linux-gnu-g++ accepts -g
configure:3865: i686-pc-linux-gnu-g++ -c -g conftest.cc >&5
configure:3871: $? = 0
configure:3875: test -z
|| test ! -s conftest.err
configure:3878: $? = 0
configure:3881: test -s conftest.o
configure:3884: $? = 0
configure:3895: result: yes
configure:3937: i686-pc-linux-gnu-g++ -c -march=pentium4 -O2 -pipe -fomit-frame-pointer conftest.cc >&5
configure:3943: $? = 0
configure:3947: test -z
|| test ! -s conftest.err
configure:3950: $? = 0
configure:3953: test -s conftest.o
configure:3956: $? = 0
configure:3982: i686-pc-linux-gnu-g++ -c -march=pentium4 -O2 -pipe -fomit-frame-pointer conftest.cc >&5
conftest.cc: In function 'int main()':
conftest.cc:15: error: 'exit' was not declared in this scope
configure:3988: $? = 1
configure: failed program was:
| /* confdefs.h. */
|
| #define PACKAGE_NAME ""
| #define PACKAGE_TARNAME ""
| #define PACKAGE_VERSION ""
| #define PACKAGE_STRING ""
| #define PACKAGE_BUGREPORT ""
| #define PACKAGE "arts"
| #define VERSION "1.5.0"
| /* end confdefs.h. */
|
| int
| main ()
| {
| exit (42);
| ;
| return 0;
| }
configure:3937: i686-pc-linux-gnu-g++ -c -march=pentium4 -O2 -pipe -fomit-frame-pointer conftest.cc >&5
configure:3943: $? = 0
configure:3947: test -z
|| test ! -s conftest.err
configure:3950: $? = 0
configure:3953: test -s conftest.o
configure:3956: $? = 0
configure:3982: i686-pc-linux-gnu-g++ -c -march=pentium4 -O2 -pipe -fomit-frame-pointer conftest.cc >&5
configure:3988: $? = 0
configure:3992: test -z
|| test ! -s conftest.err
configure:3995: $? = 0
configure:3998: test -s conftest.o
configure:4001: $? = 0
configure:4026: checking dependency style of i686-pc-linux-gnu-g++
configure:4116: result: none
configure:4135: checking whether i686-pc-linux-gnu-gcc is blacklisted
configure:4161: i686-pc-linux-gnu-gcc -c -DNDEBUG -O2 -march=pentium4 -O2 -pipe -fomit-frame-pointer conftest.c >&5
configure:4167: $? = 0
configure:4171: test -z
|| test ! -s conftest.err
configure:4174: $? = 0
configure:4177: test -s conftest.o
configure:4180: $? = 0
configure:4192: result: no
configure:4529: checking whether i686-pc-linux-gnu-g++ supports -Wmissing-format-attribute
configure:4565: rm -rf SunWS_cache; i686-pc-linux-gnu-g++ -o conftest -ansi -D_XOPEN_SOURCE=500 -D_BSD_SOURCE -Wcast-align -Wconversion -Wchar-subscripts -Wall -W -Wpointer-arith -DNDEBUG -DNO_DEBUG -O2 -march=pentium4 -O2 -pipe -fomit-frame-pointer -Wmissing-format-attribute conftest.cc 1>&5
configure:4571: $? = 0
configure:4575: test -z
|| test ! -s conftest.err
configure:4578: $? = 0
configure:4581: test -s conftest
configure:4584: $? = 0
configure:4605: result: yes
configure:4617: checking whether i686-pc-linux-gnu-gcc supports -Wmissing-format-attribute
configure:4650: i686-pc-linux-gnu-gcc -o conftest -std=iso9899:1990 -W -Wall -Wchar-subscripts -Wshadow -Wpointer-arith -Wmissing-prototypes -Wwrite-strings -D_XOPEN_SOURCE=500 -D_BSD_SOURCE -DNDEBUG -O2 -march=pentium4 -O2 -pipe -fomit-frame-pointer -Wmissing-format-attribute conftest.c >&5
configure:4656: $? = 0
configure:4660: test -z
|| test ! -s conftest.err
configure:4663: $? = 0
configure:4666: test -s conftest
configure:4669: $? = 0
configure:4690: result: yes
configure:4704: checking whether i686-pc-linux-gnu-g++ supports -Wundef
configure:4740: rm -rf SunWS_cache; i686-pc-linux-gnu-g++ -o conftest -ansi -D_XOPEN_SOURCE=500 -D_BSD_SOURCE -Wcast-align -Wconversion -Wchar-subscripts -Wall -W -Wpointer-arith -DNDEBUG -DNO_DEBUG -O2 -march=pentium4 -O2 -pipe -fomit-frame-pointer -Wformat-security -Wmissing-format-attribute -Wundef conftest.cc 1>&5
configure:4746: $? = 0
configure:4750: test -z
|| test ! -s conftest.err
configure:4753: $? = 0
configure:4756: test -s conftest
configure:4759: $? = 0
configure:4780: result: yes
configure:4792: checking whether i686-pc-linux-gnu-g++ supports -Wno-long-long
configure:4828: rm -rf SunWS_cache; i686-pc-linux-gnu-g++ -o conftest -Wundef -ansi -D_XOPEN_SOURCE=500 -D_BSD_SOURCE -Wcast-align -Wconversion -Wchar-subscripts -Wall -W -Wpointer-arith -DNDEBUG -DNO_DEBUG -O2 -march=pentium4 -O2 -pipe -fomit-frame-pointer -Wformat-security -Wmissing-format-attribute -Wno-long-long conftest.cc 1>&5
configure:4834: $? = 0
configure:4838: test -z
|| test ! -s conftest.err
configure:4841: $? = 0
configure:4844: test -s conftest
configure:4847: $? = 0
configure:4868: result: yes
configure:4880: checking whether i686-pc-linux-gnu-g++ supports -Wno-non-virtual-dtor
configure:4916: rm -rf SunWS_cache; i686-pc-linux-gnu-g++ -o conftest -Wno-long-long -Wundef -ansi -D_XOPEN_SOURCE=500 -D_BSD_SOURCE -Wcast-align -Wconversion -Wchar-subscripts -Wall -W -Wpointer-arith -DNDEBUG -DNO_DEBUG -O2 -march=pentium4 -O2 -pipe -fomit-frame-pointer -Wformat-security -Wmissing-format-attribute -Wno-non-virtual-dtor conftest.cc 1>&5
configure:4922: $? = 0
configure:4926: test -z
|| test ! -s conftest.err
configure:4929: $? = 0
configure:4932: test -s conftest
configure:4935: $? = 0
configure:4956: result: yes
configure:4987: checking whether i686-pc-linux-gnu-g++ supports -fno-exceptions
configure:5023: rm -rf SunWS_cache; i686-pc-linux-gnu-g++ -o conftest -Wno-long-long -Wundef -ansi -D_XOPEN_SOURCE=500 -D_BSD_SOURCE -Wcast-align -Wconversion -Wchar-subscripts -Wall -W -Wpointer-arith -DNDEBUG -DNO_DEBUG -O2 -march=pentium4 -O2 -pipe -fomit-frame-pointer -Wformat-security -Wmissing-format-attribute -Wno-non-virtual-dtor -fno-exceptions conftest.cc 1>&5
configure:5029: $? = 0
configure:5033: test -z
|| test ! -s conftest.err
configure:5036: $? = 0
configure:5039: test -s conftest
configure:5042: $? = 0
configure:5063: result: yes
configure:5075: checking whether i686-pc-linux-gnu-g++ supports -fno-check-new
configure:5111: rm -rf SunWS_cache; i686-pc-linux-gnu-g++ -o conftest -Wno-long-long -Wundef -ansi -D_XOPEN_SOURCE=500 -D_BSD_SOURCE -Wcast-align -Wconversion -Wchar-subscripts -Wall -W -Wpointer-arith -DNDEBUG -DNO_DEBUG -O2 -march=pentium4 -O2 -pipe -fomit-frame-pointer -Wformat-security -Wmissing-format-attribute -Wno-non-virtual-dtor -fno-exceptions -fno-check-new conftest.cc 1>&5
configure:5117: $? = 0
configure:5121: test -z
|| test ! -s conftest.err
configure:5124: $? = 0
configure:5127: test -s conftest
configure:5130: $? = 0
configure:5151: result: yes
configure:5163: checking whether i686-pc-linux-gnu-g++ supports -fno-common
configure:5199: rm -rf SunWS_cache; i686-pc-linux-gnu-g++ -o conftest -Wno-long-long -Wundef -ansi -D_XOPEN_SOURCE=500 -D_BSD_SOURCE -Wcast-align -Wconversion -Wchar-subscripts -Wall -W -Wpointer-arith -DNDEBUG -DNO_DEBUG -O2 -march=pentium4 -O2 -pipe -fomit-frame-pointer -Wformat-security -Wmissing-format-attribute -Wno-non-virtual-dtor -fno-exceptions -fno-check-new -fno-common conftest.cc 1>&5
configure:5205: $? = 0
configure:5209: test -z
|| test ! -s conftest.err
configure:5212: $? = 0
configure:5215: test -s conftest
configure:5218: $? = 0
configure:5239: result: yes
configure:5251: checking whether i686-pc-linux-gnu-g++ supports -fexceptions
configure:5287: rm -rf SunWS_cache; i686-pc-linux-gnu-g++ -o conftest -Wno-long-long -Wundef -ansi -D_XOPEN_SOURCE=500 -D_BSD_SOURCE -Wcast-align -Wconversion -Wchar-subscripts -Wall -W -Wpointer-arith -DNDEBUG -DNO_DEBUG -O2 -march=pentium4 -O2 -pipe -fomit-frame-pointer -Wformat-security -Wmissing-format-attribute -Wno-non-virtual-dtor -fno-exceptions -fno-check-new -fno-common -fexceptions conftest.cc 1>&5
configure:5293: $? = 0
configure:5297: test -z
|| test ! -s conftest.err
configure:5300: $? = 0
configure:5303: test -s conftest
configure:5306: $? = 0
configure:5327: result: yes
configure:6018: checking how to run the C++ preprocessor
configure:6049: i686-pc-linux-gnu-g++ -E conftest.cc
configure:6055: $? = 0
configure:6087: i686-pc-linux-gnu-g++ -E conftest.cc
conftest.cc:14:28: error: ac_nonexistent.h: No such file or directory
configure:6093: $? = 1
configure: failed program was:
| /* confdefs.h. */
|
| #define PACKAGE_NAME ""
| #define PACKAGE_TARNAME ""
| #define PACKAGE_VERSION ""
| #define PACKAGE_STRING ""
| #define PACKAGE_BUGREPORT ""
| #define PACKAGE "arts"
| #define VERSION "1.5.0"
| #ifdef __cplusplus
| extern "C" void std::exit (int) throw (); using std::exit;
| #endif
| /* end confdefs.h. */
| #include <ac_nonexistent.h>
configure:6132: result: i686-pc-linux-gnu-g++ -E
configure:6156: i686-pc-linux-gnu-g++ -E conftest.cc
configure:6162: $? = 0
configure:6194: i686-pc-linux-gnu-g++ -E conftest.cc
conftest.cc:14:28: error: ac_nonexistent.h: No such file or directory
configure:6200: $? = 1
configure: failed program was:
| /* confdefs.h. */
|
| #define PACKAGE_NAME ""
| #define PACKAGE_TARNAME ""
| #define PACKAGE_VERSION ""
| #define PACKAGE_STRING ""
| #define PACKAGE_BUGREPORT ""
| #define PACKAGE "arts"
| #define VERSION "1.5.0"
| #ifdef __cplusplus
| extern "C" void std::exit (int) throw (); using std::exit;
| #endif
| /* end confdefs.h. */
| #include <ac_nonexistent.h>
configure:6248: checking whether i686-pc-linux-gnu-g++ supports -O0
configure:6284: rm -rf SunWS_cache; i686-pc-linux-gnu-g++ -o conftest -Wno-long-long -Wundef -ansi -D_XOPEN_SOURCE=500 -D_BSD_SOURCE -Wcast-align -Wconversion -Wchar-subscripts -Wall -W -Wpointer-arith -DNDEBUG -DNO_DEBUG -O2 -march=pentium4 -O2 -pipe -fomit-frame-pointer -Wformat-security -Wmissing-format-attribute -Wno-non-virtual-dtor -fno-exceptions -fno-check-new -fno-common -O0 conftest.cc 1>&5
configure:6290: $? = 0
configure:6294: test -z
|| test ! -s conftest.err
configure:6297: $? = 0
configure:6300: test -s conftest
configure:6303: $? = 0
configure:6324: result: yes
configure:6595: checking whether i686-pc-linux-gnu-g++ supports -Wl,--no-undefined
configure:6631: rm -rf SunWS_cache; i686-pc-linux-gnu-g++ -o conftest -Wno-long-long -Wundef -ansi -D_XOPEN_SOURCE=500 -D_BSD_SOURCE -Wcast-align -Wconversion -Wchar-subscripts -Wall -W -Wpointer-arith -DNDEBUG -DNO_DEBUG -O2 -march=pentium4 -O2 -pipe -fomit-frame-pointer -Wformat-security -Wmissing-format-attribute -Wno-non-virtual-dtor -fno-exceptions -fno-check-new -fno-common -Wl,--no-undefined conftest.cc 1>&5
configure:6637: $? = 0
configure:6641: test -z
|| test ! -s conftest.err
configure:6644: $? = 0
configure:6647: test -s conftest
configure:6650: $? = 0
configure:6671: result: yes
configure:6675: checking whether i686-pc-linux-gnu-g++ supports -Wl,--allow-shlib-undefined
configure:6711: rm -rf SunWS_cache; i686-pc-linux-gnu-g++ -o conftest -Wno-long-long -Wundef -ansi -D_XOPEN_SOURCE=500 -D_BSD_SOURCE -Wcast-align -Wconversion -Wchar-subscripts -Wall -W -Wpointer-arith -DNDEBUG -DNO_DEBUG -O2 -march=pentium4 -O2 -pipe -fomit-frame-pointer -Wformat-security -Wmissing-format-attribute -Wno-non-virtual-dtor -fno-exceptions -fno-check-new -fno-common -Wl,--allow-shlib-undefined conftest.cc 1>&5
configure:6717: $? = 0
configure:6721: test -z
|| test ! -s conftest.err
configure:6724: $? = 0
configure:6727: test -s conftest
configure:6730: $? = 0
configure:6751: result: yes
configure:6877: result: not using lib directory suffix
configure:6922: checking for a sed that does not truncate output
configure:6976: result: /bin/sed
configure:6979: checking for egrep
configure:6989: result: grep -E
configure:7005: checking for ld used by i686-pc-linux-gnu-gcc
configure:7072: result: /usr/i686-pc-linux-gnu/bin/ld
configure:7081: checking if the linker (/usr/i686-pc-linux-gnu/bin/ld) is GNU ld
configure:7096: result: yes
configure:7101: checking for /usr/i686-pc-linux-gnu/bin/ld option to reload object files
configure:7108: result: -r
configure:7117: checking for BSD-compatible nm
configure:7159: result: /usr/bin/i686-pc-linux-gnu-nm -B
configure:7163: checking whether ln -s works
configure:7167: result: yes
configure:7174: checking how to recognise dependent libraries
configure:7381: result: pass_all
configure:7590: checking for ANSI C header files
configure:7615: i686-pc-linux-gnu-gcc -c -std=iso9899:1990 -W -Wall -Wchar-subscripts -Wshadow -Wpointer-arith -Wmissing-prototypes -Wwrite-strings -D_XOPEN_SOURCE=500 -D_BSD_SOURCE -DNDEBUG -O2 -march=pentium4 -O2 -pipe -fomit-frame-pointer -Wformat-security -Wmissing-format-attribute conftest.c >&5
configure:7621: $? = 0
configure:7625: test -z
|| test ! -s conftest.err
configure:7628: $? = 0
configure:7631: test -s conftest.o
configure:7634: $? = 0
configure:7723: i686-pc-linux-gnu-gcc -o conftest -std=iso9899:1990 -W -Wall -Wchar-subscripts -Wshadow -Wpointer-arith -Wmissing-prototypes -Wwrite-strings -D_XOPEN_SOURCE=500 -D_BSD_SOURCE -DNDEBUG -O2 -march=pentium4 -O2 -pipe -fomit-frame-pointer -Wformat-security -Wmissing-format-attribute conftest.c >&5
conftest.c: In function 'main':
conftest.c:32: warning: implicit declaration of function 'exit'
conftest.c:32: warning: incompatible implicit declaration of built-in function 'exit'
configure:7726: $? = 0
configure:7728: ./conftest
configure:7731: $? = 0
configure:7746: result: yes
configure:7770: checking for sys/types.h
configure:7786: i686-pc-linux-gnu-gcc -c -std=iso9899:1990 -W -Wall -Wchar-subscripts -Wshadow -Wpointer-arith -Wmissing-prototypes -Wwrite-strings -D_XOPEN_SOURCE=500 -D_BSD_SOURCE -DNDEBUG -O2 -march=pentium4 -O2 -pipe -fomit-frame-pointer -Wformat-security -Wmissing-format-attribute conftest.c >&5
configure:7792: $? = 0
configure:7796: test -z
|| test ! -s conftest.err
configure:7799: $? = 0
configure:7802: test -s conftest.o
configure:7805: $? = 0
configure:7816: result: yes
configure:7770: checking for sys/stat.h
configure:7786: i686-pc-linux-gnu-gcc -c -std=iso9899:1990 -W -Wall -Wchar-subscripts -Wshadow -Wpointer-arith -Wmissing-prototypes -Wwrite-strings -D_XOPEN_SOURCE=500 -D_BSD_SOURCE -DNDEBUG -O2 -march=pentium4 -O2 -pipe -fomit-frame-pointer -Wformat-security -Wmissing-format-attribute conftest.c >&5
configure:7792: $? = 0
configure:7796: test -z
|| test ! -s conftest.err
configure:7799: $? = 0
configure:7802: test -s conftest.o
configure:7805: $? = 0
configure:7816: result: yes
configure:7770: checking for stdlib.h
configure:7786: i686-pc-linux-gnu-gcc -c -std=iso9899:1990 -W -Wall -Wchar-subscripts -Wshadow -Wpointer-arith -Wmissing-prototypes -Wwrite-strings -D_XOPEN_SOURCE=500 -D_BSD_SOURCE -DNDEBUG -O2 -march=pentium4 -O2 -pipe -fomit-frame-pointer -Wformat-security -Wmissing-format-attribute conftest.c >&5
configure:7792: $? = 0
configure:7796: test -z
|| test ! -s conftest.err
configure:7799: $? = 0
configure:7802: test -s conftest.o
configure:7805: $? = 0
configure:7816: result: yes
configure:7770: checking for string.h
configure:7786: i686-pc-linux-gnu-gcc -c -std=iso9899:1990 -W -Wall -Wchar-subscripts -Wshadow -Wpointer-arith -Wmissing-prototypes -Wwrite-strings -D_XOPEN_SOURCE=500 -D_BSD_SOURCE -DNDEBUG -O2 -march=pentium4 -O2 -pipe -fomit-frame-pointer -Wformat-security -Wmissing-format-attribute conftest.c >&5
configure:7792: $? = 0
configure:7796: test -z
|| test ! -s conftest.err
configure:7799: $? = 0
configure:7802: test -s conftest.o
configure:7805: $? = 0
configure:7816: result: yes
configure:7770: checking for memory.h
configure:7786: i686-pc-linux-gnu-gcc -c -std=iso9899:1990 -W -Wall -Wchar-subscripts -Wshadow -Wpointer-arith -Wmissing-prototypes -Wwrite-strings -D_XOPEN_SOURCE=500 -D_BSD_SOURCE -DNDEBUG -O2 -march=pentium4 -O2 -pipe -fomit-frame-pointer -Wformat-security -Wmissing-format-attribute conftest.c >&5
configure:7792: $? = 0
configure:7796: test -z
|| test ! -s conftest.err
configure:7799: $? = 0
configure:7802: test -s conftest.o
configure:7805: $? = 0
configure:7816: result: yes
configure:7770: checking for strings.h
configure:7786: i686-pc-linux-gnu-gcc -c -std=iso9899:1990 -W -Wall -Wchar-subscripts -Wshadow -Wpointer-arith -Wmissing-prototypes -Wwrite-strings -D_XOPEN_SOURCE=500 -D_BSD_SOURCE -DNDEBUG -O2 -march=pentium4 -O2 -pipe -fomit-frame-pointer -Wformat-security -Wmissing-format-attribute conftest.c >&5
configure:7792: $? = 0
configure:7796: test -z
|| test ! -s conftest.err
configure:7799: $? = 0
configure:7802: test -s conftest.o
configure:7805: $? = 0
configure:7816: result: yes
configure:7770: checking for inttypes.h
configure:7786: i686-pc-linux-gnu-gcc -c -std=iso9899:1990 -W -Wall -Wchar-subscripts -Wshadow -Wpointer-arith -Wmissing-prototypes -Wwrite-strings -D_XOPEN_SOURCE=500 -D_BSD_SOURCE -DNDEBUG -O2 -march=pentium4 -O2 -pipe -fomit-frame-pointer -Wformat-security -Wmissing-format-attribute conftest.c >&5
configure:7792: $? = 0
configure:7796: test -z
|| test ! -s conftest.err
configure:7799: $? = 0
configure:7802: test -s conftest.o
configure:7805: $? = 0
configure:7816: result: yes
configure:7770: checking for stdint.h
configure:7786: i686-pc-linux-gnu-gcc -c -std=iso9899:1990 -W -Wall -Wchar-subscripts -Wshadow -Wpointer-arith -Wmissing-prototypes -Wwrite-strings -D_XOPEN_SOURCE=500 -D_BSD_SOURCE -DNDEBUG -O2 -march=pentium4 -O2 -pipe -fomit-frame-pointer -Wformat-security -Wmissing-format-attribute conftest.c >&5
configure:7792: $? = 0
configure:7796: test -z
|| test ! -s conftest.err
configure:7799: $? = 0
configure:7802: test -s conftest.o
configure:7805: $? = 0
configure:7816: result: yes
configure:7770: checking for unistd.h
configure:7786: i686-pc-linux-gnu-gcc -c -std=iso9899:1990 -W -Wall -Wchar-subscripts -Wshadow -Wpointer-arith -Wmissing-prototypes -Wwrite-strings -D_XOPEN_SOURCE=500 -D_BSD_SOURCE -DNDEBUG -O2 -march=pentium4 -O2 -pipe -fomit-frame-pointer -Wformat-security -Wmissing-format-attribute conftest.c >&5
configure:7792: $? = 0
configure:7796: test -z
|| test ! -s conftest.err
configure:7799: $? = 0
configure:7802: test -s conftest.o
configure:7805: $? = 0
configure:7816: result: yes
configure:7842: checking dlfcn.h usability
configure:7854: i686-pc-linux-gnu-gcc -c -std=iso9899:1990 -W -Wall -Wchar-subscripts -Wshadow -Wpointer-arith -Wmissing-prototypes -Wwrite-strings -D_XOPEN_SOURCE=500 -D_BSD_SOURCE -DNDEBUG -O2 -march=pentium4 -O2 -pipe -fomit-frame-pointer -Wformat-security -Wmissing-format-attribute conftest.c >&5
configure:7860: $? = 0
configure:7864: test -z
|| test ! -s conftest.err
configure:7867: $? = 0
configure:7870: test -s conftest.o
configure:7873: $? = 0
configure:7883: result: yes
configure:7887: checking dlfcn.h presence
configure:7897: i686-pc-linux-gnu-gcc -E conftest.c
configure:7903: $? = 0
configure:7923: result: yes
configure:7958: checking for dlfcn.h
configure:7965: result: yes
configure:7987: checking for i686-pc-linux-gnu-g77
configure:8016: result: no
configure:7987: checking for i686-pc-linux-gnu-f77
configure:8016: result: no
configure:7987: checking for i686-pc-linux-gnu-xlf
configure:8016: result: no
configure:7987: checking for i686-pc-linux-gnu-frt
configure:8016: result: no
configure:7987: checking for i686-pc-linux-gnu-pgf77
configure:8016: result: no
configure:7987: checking for i686-pc-linux-gnu-fort77
configure:8016: result: no
configure:7987: checking for i686-pc-linux-gnu-fl32
configure:8016: result: no
configure:7987: checking for i686-pc-linux-gnu-af77
configure:8016: result: no
configure:7987: checking for i686-pc-linux-gnu-f90
configure:8016: result: no
configure:7987: checking for i686-pc-linux-gnu-xlf90
configure:8016: result: no
configure:7987: checking for i686-pc-linux-gnu-pgf90
configure:8016: result: no
configure:7987: checking for i686-pc-linux-gnu-epcf90
configure:8016: result: no
configure:7987: checking for i686-pc-linux-gnu-f95
configure:8016: result: no
configure:7987: checking for i686-pc-linux-gnu-fort
configure:8016: result: no
configure:7987: checking for i686-pc-linux-gnu-xlf95
configure:8016: result: no
configure:7987: checking for i686-pc-linux-gnu-ifc
configure:8016: result: no
configure:7987: checking for i686-pc-linux-gnu-efc
configure:8016: result: no
configure:7987: checking for i686-pc-linux-gnu-pgf95
configure:8016: result: no
configure:7987: checking for i686-pc-linux-gnu-lf95
configure:8016: result: no
configure:7987: checking for i686-pc-linux-gnu-gfortran
configure:8003: found /usr/i686-pc-linux-gnu/gcc-bin/4.0.1/i686-pc-linux-gnu-gfortran
configure:8013: result: i686-pc-linux-gnu-gfortran
configure:8070: checking for Fortran 77 compiler version
configure:8073: i686-pc-linux-gnu-gfortran --version </dev/null >&5
GNU Fortran 95 (GCC 4.0.1 (Gentoo 4.0.1, pie-8.7.8))
Copyright (C) 2005 Free Software Foundation, Inc.
GNU Fortran comes with NO WARRANTY, to the extent permitted by law.
You may redistribute copies of GNU Fortran
under the terms of the GNU General Public License.
For more information about these matters, see the file named COPYING
configure:8076: $? = 0
configure:8078: i686-pc-linux-gnu-gfortran -v </dev/null >&5
Using built-in specs.
Target: i686-pc-linux-gnu
Configured with: /var/tmp/portage/gcc-4.0.1/work/gcc-4.0.1/configure --prefix=/usr --bindir=/usr/i686-pc-linux-gnu/gcc-bin/4.0.1 --includedir=/usr/lib/gcc/i686-pc-linux-gnu/4.0.1/include --datadir=/usr/share/gcc-data/i686-pc-linux-gnu/4.0.1 --mandir=/usr/share/gcc-data/i686-pc-linux-gnu/4.0.1/man --infodir=/usr/share/gcc-data/i686-pc-linux-gnu/4.0.1/info --with-gxx-include-dir=/usr/lib/gcc/i686-pc-linux-gnu/4.0.1/include/g++-v4 --host=i686-pc-linux-gnu --build=i686-pc-linux-gnu --disable-altivec --enable-nls --without-included-gettext --with-system-zlib --disable-checking --disable-werror --disable-libunwind-exceptions --disable-multilib --disable-libgcj --enable-languages=c,c++,f95 --enable-shared --enable-threads=posix --enable-__cxa_atexit --enable-clocale=gnu
Thread model: posix
gcc version 4.0.1 (Gentoo 4.0.1, pie-8.7.8)
configure:8081: $? = 0
configure:8083: i686-pc-linux-gnu-gfortran -V </dev/null >&5
i686-pc-linux-gnu-gfortran: '-V' option must have argument
configure:8086: $? = 1
configure:8094: checking whether we are using the GNU Fortran 77 compiler
configure:8108: i686-pc-linux-gnu-gfortran -c conftest.F >&5
configure:8114: $? = 0
configure:8118: test -z
|| test ! -s conftest.err
configure:8121: $? = 0
configure:8124: test -s conftest.o
configure:8127: $? = 0
configure:8140: result: yes
configure:8146: checking whether i686-pc-linux-gnu-gfortran accepts -g
configure:8158: i686-pc-linux-gnu-gfortran -c -g conftest.f >&5
configure:8164: $? = 0
configure:8168: test -z
|| test ! -s conftest.err
configure:8171: $? = 0
configure:8174: test -s conftest.o
configure:8177: $? = 0
configure:8189: result: yes
configure:8219: checking the maximum length of command line arguments
configure:8278: result: 32768
configure:8289: checking command to parse /usr/bin/i686-pc-linux-gnu-nm -B output from i686-pc-linux-gnu-gcc object
configure:8378: i686-pc-linux-gnu-gcc -c -std=iso9899:1990 -W -Wall -Wchar-subscripts -Wshadow -Wpointer-arith -Wmissing-prototypes -Wwrite-strings -D_XOPEN_SOURCE=500 -D_BSD_SOURCE -DNDEBUG -O2 -march=pentium4 -O2 -pipe -fomit-frame-pointer -Wformat-security -Wmissing-format-attribute conftest.c >&5
conftest.c:5: warning: no previous prototype for 'nm_test_func'
configure:8381: $? = 0
configure:8385: /usr/bin/i686-pc-linux-gnu-nm -B conftest.o \| sed -n -e 's/^.*[ ]\([ABCDGISTW][ABCDGISTW]*\)[ ][ ]*\(\)\([_A-Za-z][_A-Za-z0-9]*\)$/\1 \2\3 \3/p' \> conftest.nm
configure:8388: $? = 0
configure:8440: i686-pc-linux-gnu-gcc -o conftest -std=iso9899:1990 -W -Wall -Wchar-subscripts -Wshadow -Wpointer-arith -Wmissing-prototypes -Wwrite-strings -D_XOPEN_SOURCE=500 -D_BSD_SOURCE -DNDEBUG -O2 -march=pentium4 -O2 -pipe -fomit-frame-pointer -Wformat-security -Wmissing-format-attribute conftest.c conftstm.o >&5
configure:8443: $? = 0
configure:8481: result: ok
configure:8485: checking for objdir
configure:8500: result: .libs
configure:8552: checking for i686-pc-linux-gnu-ar
configure:8568: found /usr/bin/i686-pc-linux-gnu-ar
configure:8578: result: i686-pc-linux-gnu-ar
configure:8632: checking for i686-pc-linux-gnu-ranlib
configure:8648: found /usr/bin/i686-pc-linux-gnu-ranlib
configure:8658: result: i686-pc-linux-gnu-ranlib
configure:8712: checking for i686-pc-linux-gnu-strip
configure:8728: found /usr/bin/i686-pc-linux-gnu-strip
configure:8738: result: i686-pc-linux-gnu-strip
configure:9039: checking if i686-pc-linux-gnu-gcc static flag works
configure:9062: result: yes
configure:9084: checking if i686-pc-linux-gnu-gcc supports -fno-rtti -fno-exceptions
configure:9102: i686-pc-linux-gnu-gcc -c -std=iso9899:1990 -W -Wall -Wchar-subscripts -Wshadow -Wpointer-arith -Wmissing-prototypes -Wwrite-strings -D_XOPEN_SOURCE=500 -D_BSD_SOURCE -DNDEBUG -O2 -march=pentium4 -O2 -pipe -fomit-frame-pointer -Wformat-security -Wmissing-format-attribute -fno-rtti -fno-exceptions conftest.c >&5
cc1: warning: command line option "-fno-rtti" is valid for C++/ObjC++ but not for C
configure:9106: $? = 0
configure:9117: result: no
configure:9132: checking for i686-pc-linux-gnu-gcc option to produce PIC
configure:9309: result: -fPIC
configure:9317: checking if i686-pc-linux-gnu-gcc PIC flag -fPIC works
configure:9335: i686-pc-linux-gnu-gcc -c -std=iso9899:1990 -W -Wall -Wchar-subscripts -Wshadow -Wpointer-arith -Wmissing-prototypes -Wwrite-strings -D_XOPEN_SOURCE=500 -D_BSD_SOURCE -DNDEBUG -O2 -march=pentium4 -O2 -pipe -fomit-frame-pointer -Wformat-security -Wmissing-format-attribute -fPIC -DPIC conftest.c >&5
configure:9339: $? = 0
configure:9350: result: yes
configure:9374: checking if i686-pc-linux-gnu-gcc supports -c -o file.o
configure:9402: i686-pc-linux-gnu-gcc -c -std=iso9899:1990 -W -Wall -Wchar-subscripts -Wshadow -Wpointer-arith -Wmissing-prototypes -Wwrite-strings -D_XOPEN_SOURCE=500 -D_BSD_SOURCE -DNDEBUG -O2 -march=pentium4 -O2 -pipe -fomit-frame-pointer -Wformat-security -Wmissing-format-attribute -o out/conftest2.o conftest.c >&5
configure:9406: $? = 0
configure:9423: result: yes
configure:9449: checking whether the i686-pc-linux-gnu-gcc linker (/usr/i686-pc-linux-gnu/bin/ld) supports shared libraries
configure:10261: result: yes
configure:10287: checking whether -lc should be explicitly linked in
configure:10292: i686-pc-linux-gnu-gcc -c -std=iso9899:1990 -W -Wall -Wchar-subscripts -Wshadow -Wpointer-arith -Wmissing-prototypes -Wwrite-strings -D_XOPEN_SOURCE=500 -D_BSD_SOURCE -DNDEBUG -O2 -march=pentium4 -O2 -pipe -fomit-frame-pointer -Wformat-security -Wmissing-format-attribute conftest.c >&5
configure:10295: $? = 0
configure:10309: i686-pc-linux-gnu-gcc -shared -v conftest.o -Wl,-soname -Wl,conftest -o conftest 2\>\&1 \| grep -lc \>/dev/null 2\>\&1
configure:10312: $? = 0
configure:10324: result: no
configure:10332: checking dynamic linker characteristics
configure:10850: result: GNU/Linux ld.so
configure:10854: checking how to hardcode library paths into programs
configure:10879: result: immediate
configure:10893: checking whether stripping libraries is possible
configure:10898: result: yes
configure:11024: checking for shl_load
configure:11081: i686-pc-linux-gnu-gcc -o conftest -std=iso9899:1990 -W -Wall -Wchar-subscripts -Wshadow -Wpointer-arith -Wmissing-prototypes -Wwrite-strings -D_XOPEN_SOURCE=500 -D_BSD_SOURCE -DNDEBUG -O2 -march=pentium4 -O2 -pipe -fomit-frame-pointer -Wformat-security -Wmissing-format-attribute conftest.c >&5
/var/tmp/portage/arts-3.5.0-r1/temp/ccvdH2gS.o(.text+0x14): In function `main':
: undefined reference to `shl_load'
/var/tmp/portage/arts-3.5.0-r1/temp/ccvdH2gS.o(.data+0x0): undefined reference to `shl_load'
collect2: ld returned 1 exit status
configure:11087: $? = 1
configure: failed program was:
| /* confdefs.h. */
|
| #define PACKAGE_NAME ""
| #define PACKAGE_TARNAME ""
| #define PACKAGE_VERSION ""
| #define PACKAGE_STRING ""
| #define PACKAGE_BUGREPORT ""
| #define PACKAGE "arts"
| #define VERSION "1.5.0"
| #ifdef __cplusplus
| extern "C" void std::exit (int) throw (); using std::exit;
| #endif
| #define KDELIBSUFF ""
| #define STDC_HEADERS 1
| #define HAVE_SYS_TYPES_H 1
| #define HAVE_SYS_STAT_H 1
| #define HAVE_STDLIB_H 1
| #define HAVE_STRING_H 1
| #define HAVE_MEMORY_H 1
| #define HAVE_STRINGS_H 1
| #define HAVE_INTTYPES_H 1
| #define HAVE_STDINT_H 1
| #define HAVE_UNISTD_H 1
| #define HAVE_DLFCN_H 1
| /* end confdefs.h. */
| /* Define shl_load to an innocuous variant, in case <limits.h> declares shl_load.
| For example, HP-UX 11i <limits.h> declares gettimeofday. */
| #define shl_load innocuous_shl_load
|
| /* System header to define __stub macros and hopefully few prototypes,
| which can conflict with char shl_load (); below.
| Prefer <limits.h> to <assert.h> if __STDC__ is defined, since
| <limits.h> exists even on freestanding compilers. */
|
| #ifdef __STDC__
| # include <limits.h>
| #else
| # include <assert.h>
| #endif
|
| #undef shl_load
|
| /* Override any gcc2 internal prototype to avoid an error. */
| #ifdef __cplusplus
| extern "C"
| {
| #endif
| /* We use char because int might match the return type of a gcc2
| builtin and then its argument prototype would still apply. */
| char shl_load ();
| /* The GNU C library defines this for functions which it implements
| to always fail with ENOSYS. Some functions are actually named
| something starting with __ and the normal name is an alias. */
| #if defined (__stub_shl_load) || defined (__stub___shl_load)
| choke me
| #else
| char (*f) () = shl_load;
| #endif
| #ifdef __cplusplus
| }
| #endif
|
| int
| main ()
| {
| return f != shl_load;
| ;
| return 0;
| }
configure:11112: result: no
configure:11117: checking for shl_load in -ldld
configure:11147: i686-pc-linux-gnu-gcc -o conftest -std=iso9899:1990 -W -Wall -Wchar-subscripts -Wshadow -Wpointer-arith -Wmissing-prototypes -Wwrite-strings -D_XOPEN_SOURCE=500 -D_BSD_SOURCE -DNDEBUG -O2 -march=pentium4 -O2 -pipe -fomit-frame-pointer -Wformat-security -Wmissing-format-attribute conftest.c -ldld >&5
/usr/lib/gcc/i686-pc-linux-gnu/4.0.1/../../../../i686-pc-linux-gnu/bin/ld: cannot find -ldld
collect2: ld returned 1 exit status
configure:11153: $? = 1
configure: failed program was:
| /* confdefs.h. */
|
| #define PACKAGE_NAME ""
| #define PACKAGE_TARNAME ""
| #define PACKAGE_VERSION ""
| #define PACKAGE_STRING ""
| #define PACKAGE_BUGREPORT ""
| #define PACKAGE "arts"
| #define VERSION "1.5.0"
| #ifdef __cplusplus
| extern "C" void std::exit (int) throw (); using std::exit;
| #endif
| #define KDELIBSUFF ""
| #define STDC_HEADERS 1
| #define HAVE_SYS_TYPES_H 1
| #define HAVE_SYS_STAT_H 1
| #define HAVE_STDLIB_H 1
| #define HAVE_STRING_H 1
| #define HAVE_MEMORY_H 1
| #define HAVE_STRINGS_H 1
| #define HAVE_INTTYPES_H 1
| #define HAVE_STDINT_H 1
| #define HAVE_UNISTD_H 1
| #define HAVE_DLFCN_H 1
| /* end confdefs.h. */
|
| /* Override any gcc2 internal prototype to avoid an error. */
| #ifdef __cplusplus
| extern "C"
| #endif
| /* We use char because int might match the return type of a gcc2
| builtin and then its argument prototype would still apply. */
| char shl_load ();
| int
| main ()
| {
| shl_load ();
| ;
| return 0;
| }
configure:11179: result: no
configure:11184: checking for dlopen
configure:11241: i686-pc-linux-gnu-gcc -o conftest -std=iso9899:1990 -W -Wall -Wchar-subscripts -Wshadow -Wpointer-arith -Wmissing-prototypes -Wwrite-strings -D_XOPEN_SOURCE=500 -D_BSD_SOURCE -DNDEBUG -O2 -march=pentium4 -O2 -pipe -fomit-frame-pointer -Wformat-security -Wmissing-format-attribute conftest.c >&5
/var/tmp/portage/arts-3.5.0-r1/temp/cc77eWf4.o(.text+0x14): In function `main':
: undefined reference to `dlopen'
/var/tmp/portage/arts-3.5.0-r1/temp/cc77eWf4.o(.data+0x0): undefined reference to `dlopen'
collect2: ld returned 1 exit status
configure:11247: $? = 1
configure: failed program was:
| /* confdefs.h. */
|
| #define PACKAGE_NAME ""
| #define PACKAGE_TARNAME ""
| #define PACKAGE_VERSION ""
| #define PACKAGE_STRING ""
| #define PACKAGE_BUGREPORT ""
| #define PACKAGE "arts"
| #define VERSION "1.5.0"
| #ifdef __cplusplus
| extern "C" void std::exit (int) throw (); using std::exit;
| #endif
| #define KDELIBSUFF ""
| #define STDC_HEADERS 1
| #define HAVE_SYS_TYPES_H 1
| #define HAVE_SYS_STAT_H 1
| #define HAVE_STDLIB_H 1
| #define HAVE_STRING_H 1
| #define HAVE_MEMORY_H 1
| #define HAVE_STRINGS_H 1
| #define HAVE_INTTYPES_H 1
| #define HAVE_STDINT_H 1
| #define HAVE_UNISTD_H 1
| #define HAVE_DLFCN_H 1
| /* end confdefs.h. */
| /* Define dlopen to an innocuous variant, in case <limits.h> declares dlopen.
| For example, HP-UX 11i <limits.h> declares gettimeofday. */
| #define dlopen innocuous_dlopen
|
| /* System header to define __stub macros and hopefully few prototypes,
| which can conflict with char dlopen (); below.
| Prefer <limits.h> to <assert.h> if __STDC__ is defined, since
| <limits.h> exists even on freestanding compilers. */
|
| #ifdef __STDC__
| # include <limits.h>
| #else
| # include <assert.h>
| #endif
|
| #undef dlopen
|
| /* Override any gcc2 internal prototype to avoid an error. */
| #ifdef __cplusplus
| extern "C"
| {
| #endif
| /* We use char because int might match the return type of a gcc2
| builtin and then its argument prototype would still apply. */
| char dlopen ();
| /* The GNU C library defines this for functions which it implements
| to always fail with ENOSYS. Some functions are actually named
| something starting with __ and the normal name is an alias. */
| #if defined (__stub_dlopen) || defined (__stub___dlopen)
| choke me
| #else
| char (*f) () = dlopen;
| #endif
| #ifdef __cplusplus
| }
| #endif
|
| int
| main ()
| {
| return f != dlopen;
| ;
| return 0;
| }
configure:11272: result: no
configure:11277: checking for dlopen in -ldl
configure:11307: i686-pc-linux-gnu-gcc -o conftest -std=iso9899:1990 -W -Wall -Wchar-subscripts -Wshadow -Wpointer-arith -Wmissing-prototypes -Wwrite-strings -D_XOPEN_SOURCE=500 -D_BSD_SOURCE -DNDEBUG -O2 -march=pentium4 -O2 -pipe -fomit-frame-pointer -Wformat-security -Wmissing-format-attribute conftest.c -ldl >&5
configure:11313: $? = 0
configure:11317: test -z
|| test ! -s conftest.err
configure:11320: $? = 0
configure:11323: test -s conftest
configure:11326: $? = 0
configure:11339: result: yes
configure:11514: checking whether a program can dlopen itself
configure:11586: i686-pc-linux-gnu-gcc -o conftest -std=iso9899:1990 -W -Wall -Wchar-subscripts -Wshadow -Wpointer-arith -Wmissing-prototypes -Wwrite-strings -D_XOPEN_SOURCE=500 -D_BSD_SOURCE -DNDEBUG -O2 -march=pentium4 -O2 -pipe -fomit-frame-pointer -Wformat-security -Wmissing-format-attribute -DHAVE_DLFCN_H -Wl,--export-dynamic conftest.c -ldl >&5
configure:11569: warning: no previous prototype for 'fnord'
configure: In function 'fnord':
configure:11569: warning: unused variable 'i'
configure: In function 'main':
configure:11582: warning: implicit declaration of function 'exit'
configure:11582: warning: incompatible implicit declaration of built-in function 'exit'
configure:11589: $? = 0
configure:11607: result: yes
configure:11612: checking whether a statically linked program can dlopen itself
configure:11684: i686-pc-linux-gnu-gcc -o conftest -std=iso9899:1990 -W -Wall -Wchar-subscripts -Wshadow -Wpointer-arith -Wmissing-prototypes -Wwrite-strings -D_XOPEN_SOURCE=500 -D_BSD_SOURCE -DNDEBUG -O2 -march=pentium4 -O2 -pipe -fomit-frame-pointer -Wformat-security -Wmissing-format-attribute -DHAVE_DLFCN_H -Wl,--export-dynamic conftest.c -ldl >&5
configure:11667: warning: no previous prototype for 'fnord'
configure: In function 'fnord':
configure:11667: warning: unused variable 'i'
configure: In function 'main':
configure:11680: warning: implicit declaration of function 'exit'
configure:11680: warning: incompatible implicit declaration of built-in function 'exit'
configure:11687: $? = 0
configure:11705: result: yes
configure:11728: checking if libtool supports shared libraries
configure:11730: result: yes
configure:11733: checking whether to build shared libraries
configure:11791: result: yes
configure:11794: checking whether to build static libraries
configure:11798: result: no
configure:11889: creating libtool
configure:12433: checking for ld used by i686-pc-linux-gnu-g++
configure:12500: result: /usr/i686-pc-linux-gnu/bin/ld
configure:12509: checking if the linker (/usr/i686-pc-linux-gnu/bin/ld) is GNU ld
configure:12524: result: yes
configure:12575: checking whether the i686-pc-linux-gnu-g++ linker (/usr/i686-pc-linux-gnu/bin/ld) supports shared libraries
configure:13389: result: yes
configure:13411: i686-pc-linux-gnu-g++ -c -Wno-long-long -Wundef -ansi -D_XOPEN_SOURCE=500 -D_BSD_SOURCE -Wcast-align -Wconversion -Wchar-subscripts -Wall -W -Wpointer-arith -DNDEBUG -DNO_DEBUG -O2 -march=pentium4 -O2 -pipe -fomit-frame-pointer -Wformat-security -Wmissing-format-attribute -Wno-non-virtual-dtor -fno-exceptions -fno-check-new -fno-common conftest.cc >&5
configure:13414: $? = 0
configure:13510: checking for i686-pc-linux-gnu-g++ option to produce PIC
configure:13762: result: -fPIC
configure:13770: checking if i686-pc-linux-gnu-g++ PIC flag -fPIC works
configure:13788: i686-pc-linux-gnu-g++ -c -Wno-long-long -Wundef -ansi -D_XOPEN_SOURCE=500 -D_BSD_SOURCE -Wcast-align -Wconversion -Wchar-subscripts -Wall -W -Wpointer-arith -DNDEBUG -DNO_DEBUG -O2 -march=pentium4 -O2 -pipe -fomit-frame-pointer -Wformat-security -Wmissing-format-attribute -Wno-non-virtual-dtor -fno-exceptions -fno-check-new -fno-common -fPIC -DPIC conftest.cc >&5
configure:13792: $? = 0
configure:13803: result: yes
configure:13827: checking if i686-pc-linux-gnu-g++ supports -c -o file.o
configure:13855: i686-pc-linux-gnu-g++ -c -Wno-long-long -Wundef -ansi -D_XOPEN_SOURCE=500 -D_BSD_SOURCE -Wcast-align -Wconversion -Wchar-subscripts -Wall -W -Wpointer-arith -DNDEBUG -DNO_DEBUG -O2 -march=pentium4 -O2 -pipe -fomit-frame-pointer -Wformat-security -Wmissing-format-attribute -Wno-non-virtual-dtor -fno-exceptions -fno-check-new -fno-common -o out/conftest2.o conftest.cc >&5
configure:13859: $? = 0
configure:13876: result: yes
configure:13902: checking whether the i686-pc-linux-gnu-g++ linker (/usr/i686-pc-linux-gnu/bin/ld) supports shared libraries
configure:13927: result: yes
configure:13998: checking dynamic linker characteristics
configure:14516: result: GNU/Linux ld.so
configure:14520: checking how to hardcode library paths into programs
configure:14545: result: immediate
configure:14559: checking whether stripping libraries is possible
configure:14564: result: yes
configure:14690: checking for shl_load
configure:14778: result: no
configure:14783: checking for shl_load in -ldld
configure:14845: result: no
configure:14850: checking for dlopen
configure:14938: result: no
configure:14943: checking for dlopen in -ldl
configure:15005: result: yes
configure:15180: checking whether a program can dlopen itself
configure:15273: result: yes
configure:15278: checking whether a statically linked program can dlopen itself
configure:15371: result: yes
configure:15867: checking if libtool supports shared libraries
configure:15869: result: yes
configure:15872: checking whether to build shared libraries
configure:15890: result: yes
configure:15893: checking whether to build static libraries
configure:15897: result: no
configure:15909: checking for i686-pc-linux-gnu-gfortran option to produce PIC
configure:16086: result: -fPIC
configure:16094: checking if i686-pc-linux-gnu-gfortran PIC flag -fPIC works
configure:16112: i686-pc-linux-gnu-gfortran -c -g -O2 -fPIC conftest.f >&5
configure:16116: $? = 0
configure:16127: result: yes
configure:16151: checking if i686-pc-linux-gnu-gfortran supports -c -o file.o
configure:16179: i686-pc-linux-gnu-gfortran -c -g -O2 -o out/conftest2.o conftest.f >&5
configure:16183: $? = 0
configure:16200: result: yes
configure:16226: checking whether the i686-pc-linux-gnu-gfortran linker (/usr/i686-pc-linux-gnu/bin/ld) supports shared libraries
configure:17018: result: yes
configure:17089: checking dynamic linker characteristics
configure:17607: result: GNU/Linux ld.so
configure:17611: checking how to hardcode library paths into programs
configure:17636: result: immediate
configure:17650: checking whether stripping libraries is possible
configure:17655: result: yes
configure:21748: checking which extension is used for shared libraries
configure:21773: result:
configure:21783: checking which variable specifies run-time library path
configure:21790: result: LD_LIBRARY_PATH
configure:21800: checking for the default library search path
configure:21807: result: /lib /usr/lib
configure:21829: checking for objdir
configure:21849: result: .libs
configure:21858: checking command to parse /usr/bin/i686-pc-linux-gnu-nm -B output
configure:21922: i686-pc-linux-gnu-gcc -c -std=iso9899:1990 -W -Wall -Wchar-subscripts -Wshadow -Wpointer-arith -Wmissing-prototypes -Wwrite-strings -D_XOPEN_SOURCE=500 -D_BSD_SOURCE -DNDEBUG -O2 -march=pentium4 -O2 -pipe -fomit-frame-pointer -Wformat-security -Wmissing-format-attribute conftest.c >&5
conftest.c:5: warning: no previous prototype for 'nm_test_func'
conftest.c: In function 'main':
conftest.c:9: warning: statement with no effect
configure:21925: $? = 0
configure:21930: /usr/bin/i686-pc-linux-gnu-nm -B conftest.o \| sed -n -e 's/^.* \([ABCDGISTW]\) *\(\)\([_A-Za-z][_A-Za-z0-9]*\)$/\1 \2\3 \3/p' \> conftest.nm
configure:21933: $? = 0
configure:21986: i686-pc-linux-gnu-gcc -o conftest -std=iso9899:1990 -W -Wall -Wchar-subscripts -Wshadow -Wpointer-arith -Wmissing-prototypes -Wwrite-strings -D_XOPEN_SOURCE=500 -D_BSD_SOURCE -DNDEBUG -O2 -march=pentium4 -O2 -pipe -fomit-frame-pointer -Wformat-security -Wmissing-format-attribute -fno-builtin conftest.c conftstm.o >&5
conftest.c:6: warning: 'main' is usually a function
configure:21989: $? = 0
configure:22033: result: yes
configure:22036: checking whether libtool supports -dlopen/-dlpreopen
configure:22048: result: yes
configure:22059: checking for dlopen in -ldl
configure:22121: result: yes
configure:22304: checking for shl_load
configure:22392: result: no
configure:22401: checking for shl_load in -ldld
configure:22463: result: no
configure:22477: checking for dld_link in -ldld
configure:22507: i686-pc-linux-gnu-gcc -o conftest -std=iso9899:1990 -W -Wall -Wchar-subscripts -Wshadow -Wpointer-arith -Wmissing-prototypes -Wwrite-strings -D_XOPEN_SOURCE=500 -D_BSD_SOURCE -DNDEBUG -O2 -march=pentium4 -O2 -pipe -fomit-frame-pointer -Wformat-security -Wmissing-format-attribute conftest.c -ldld >&5
/usr/lib/gcc/i686-pc-linux-gnu/4.0.1/../../../../i686-pc-linux-gnu/bin/ld: cannot find -ldld
collect2: ld returned 1 exit status
configure:22513: $? = 1
configure: failed program was:
| /* confdefs.h. */
|
| #define PACKAGE_NAME ""
| #define PACKAGE_TARNAME ""
| #define PACKAGE_VERSION ""
| #define PACKAGE_STRING ""
| #define PACKAGE_BUGREPORT ""
| #define PACKAGE "arts"
| #define VERSION "1.5.0"
| #ifdef __cplusplus
| extern "C" void std::exit (int) throw (); using std::exit;
| #endif
| #define KDELIBSUFF ""
| #define STDC_HEADERS 1
| #define HAVE_SYS_TYPES_H 1
| #define HAVE_SYS_STAT_H 1
| #define HAVE_STDLIB_H 1
| #define HAVE_STRING_H 1
| #define HAVE_MEMORY_H 1
| #define HAVE_STRINGS_H 1
| #define HAVE_INTTYPES_H 1
| #define HAVE_STDINT_H 1
| #define HAVE_UNISTD_H 1
| #define HAVE_DLFCN_H 1
| #define LTDL_SHLIBPATH_VAR "LD_LIBRARY_PATH"
| #define LTDL_SYSSEARCHPATH "/lib:/usr/lib"
| #define LTDL_OBJDIR ".libs/"
| #define HAVE_PRELOADED_SYMBOLS 1
| #define HAVE_LIBDL 1
| /* end confdefs.h. */
|
| /* Override any gcc2 internal prototype to avoid an error. */
| #ifdef __cplusplus
| extern "C"
| #endif
| /* We use char because int might match the return type of a gcc2
| builtin and then its argument prototype would still apply. */
| char dld_link ();
| int
| main ()
| {
| dld_link ();
| ;
| return 0;
| }
configure:22539: result: no
configure:22558: checking for dlerror
configure:22615: i686-pc-linux-gnu-gcc -o conftest -std=iso9899:1990 -W -Wall -Wchar-subscripts -Wshadow -Wpointer-arith -Wmissing-prototypes -Wwrite-strings -D_XOPEN_SOURCE=500 -D_BSD_SOURCE -DNDEBUG -O2 -march=pentium4 -O2 -pipe -fomit-frame-pointer -Wformat-security -Wmissing-format-attribute conftest.c -ldl >&5
configure:22621: $? = 0
configure:22625: test -z
|| test ! -s conftest.err
configure:22628: $? = 0
configure:22631: test -s conftest
configure:22634: $? = 0
configure:22646: result: yes
configure:22659: checking for _ prefix in compiled symbols
configure:22702: result: no
configure:22811: checking whether deplibs are loaded by dlopen
configure:22843: result: yes
configure:22875: checking malloc.h usability
configure:22887: i686-pc-linux-gnu-gcc -c -std=iso9899:1990 -W -Wall -Wchar-subscripts -Wshadow -Wpointer-arith -Wmissing-prototypes -Wwrite-strings -D_XOPEN_SOURCE=500 -D_BSD_SOURCE -DNDEBUG -O2 -march=pentium4 -O2 -pipe -fomit-frame-pointer -Wformat-security -Wmissing-format-attribute conftest.c >&5
configure:22893: $? = 0
configure:22897: test -z
|| test ! -s conftest.err
configure:22900: $? = 0
configure:22903: test -s conftest.o
configure:22906: $? = 0
configure:22916: result: yes
configure:22920: checking malloc.h presence
configure:22930: i686-pc-linux-gnu-gcc -E conftest.c
configure:22936: $? = 0
configure:22956: result: yes
configure:22991: checking for malloc.h
configure:22998: result: yes
configure:22866: checking for memory.h
configure:22871: result: yes
configure:22866: checking for stdlib.h
configure:22871: result: yes
configure:22875: checking stdio.h usability
configure:22887: i686-pc-linux-gnu-gcc -c -std=iso9899:1990 -W -Wall -Wchar-subscripts -Wshadow -Wpointer-arith -Wmissing-prototypes -Wwrite-strings -D_XOPEN_SOURCE=500 -D_BSD_SOURCE -DNDEBUG -O2 -march=pentium4 -O2 -pipe -fomit-frame-pointer -Wformat-security -Wmissing-format-attribute conftest.c >&5
configure:22893: $? = 0
configure:22897: test -z
|| test ! -s conftest.err
configure:22900: $? = 0
configure:22903: test -s conftest.o
configure:22906: $? = 0
configure:22916: result: yes
configure:22920: checking stdio.h presence
configure:22930: i686-pc-linux-gnu-gcc -E conftest.c
configure:22936: $? = 0
configure:22956: result: yes
configure:22991: checking for stdio.h
configure:22998: result: yes
configure:22875: checking ctype.h usability
configure:22887: i686-pc-linux-gnu-gcc -c -std=iso9899:1990 -W -Wall -Wchar-subscripts -Wshadow -Wpointer-arith -Wmissing-prototypes -Wwrite-strings -D_XOPEN_SOURCE=500 -D_BSD_SOURCE -DNDEBUG -O2 -march=pentium4 -O2 -pipe -fomit-frame-pointer -Wformat-security -Wmissing-format-attribute conftest.c >&5
configure:22893: $? = 0
configure:22897: test -z
|| test ! -s conftest.err
configure:22900: $? = 0
configure:22903: test -s conftest.o
configure:22906: $? = 0
configure:22916: result: yes
configure:22920: checking ctype.h presence
configure:22930: i686-pc-linux-gnu-gcc -E conftest.c
configure:22936: $? = 0
configure:22956: result: yes
configure:22991: checking for ctype.h
configure:22998: result: yes
configure:22866: checking for dlfcn.h
configure:22871: result: yes
configure:22875: checking dl.h usability
configure:22887: i686-pc-linux-gnu-gcc -c -std=iso9899:1990 -W -Wall -Wchar-subscripts -Wshadow -Wpointer-arith -Wmissing-prototypes -Wwrite-strings -D_XOPEN_SOURCE=500 -D_BSD_SOURCE -DNDEBUG -O2 -march=pentium4 -O2 -pipe -fomit-frame-pointer -Wformat-security -Wmissing-format-attribute conftest.c >&5
conftest.c:72:16: error: dl.h: No such file or directory
configure:22893: $? = 1
configure: failed program was:
| /* confdefs.h. */
|
| #define PACKAGE_NAME ""
| #define PACKAGE_TARNAME ""
| #define PACKAGE_VERSION ""
| #define PACKAGE_STRING ""
| #define PACKAGE_BUGREPORT ""
| #define PACKAGE "arts"
| #define VERSION "1.5.0"
| #ifdef __cplusplus
| extern "C" void std::exit (int) throw (); using std::exit;
| #endif
| #define KDELIBSUFF ""
| #define STDC_HEADERS 1
| #define HAVE_SYS_TYPES_H 1
| #define HAVE_SYS_STAT_H 1
| #define HAVE_STDLIB_H 1
| #define HAVE_STRING_H 1
| #define HAVE_MEMORY_H 1
| #define HAVE_STRINGS_H 1
| #define HAVE_INTTYPES_H 1
| #define HAVE_STDINT_H 1
| #define HAVE_UNISTD_H 1
| #define HAVE_DLFCN_H 1
| #define LTDL_SHLIBPATH_VAR "LD_LIBRARY_PATH"
| #define LTDL_SYSSEARCHPATH "/lib:/usr/lib"
| #define LTDL_OBJDIR ".libs/"
| #define HAVE_PRELOADED_SYMBOLS 1
| #define HAVE_LIBDL 1
| #define HAVE_DLERROR 1
| #define HAVE_MALLOC_H 1
| #define HAVE_MEMORY_H 1
| #define HAVE_STDLIB_H 1
| #define HAVE_STDIO_H 1
| #define HAVE_CTYPE_H 1
| #define HAVE_DLFCN_H 1
| /* end confdefs.h. */
| #include <stdio.h>
| #if HAVE_SYS_TYPES_H
| # include <sys/types.h>
| #endif
| #if HAVE_SYS_STAT_H
| # include <sys/stat.h>
| #endif
| #if STDC_HEADERS
| # include <stdlib.h>
| # include <stddef.h>
| #else
| # if HAVE_STDLIB_H
| # include <stdlib.h>
| # endif
| #endif
| #if HAVE_STRING_H
| # if !STDC_HEADERS && HAVE_MEMORY_H
| # include <memory.h>
| # endif
| # include <string.h>
| #endif
| #if HAVE_STRINGS_H
| # include <strings.h>
| #endif
| #if HAVE_INTTYPES_H
| # include <inttypes.h>
| #else
| # if HAVE_STDINT_H
| # include <stdint.h>
| # endif
| #endif
| #if HAVE_UNISTD_H
| # include <unistd.h>
| #endif
| #include <dl.h>
configure:22916: result: no
configure:22920: checking dl.h presence
configure:22930: i686-pc-linux-gnu-gcc -E conftest.c
conftest.c:38:16: error: dl.h: No such file or directory
configure:22936: $? = 1
configure: failed program was:
| /* confdefs.h. */
|
| #define PACKAGE_NAME ""
| #define PACKAGE_TARNAME ""
| #define PACKAGE_VERSION ""
| #define PACKAGE_STRING ""
| #define PACKAGE_BUGREPORT ""
| #define PACKAGE "arts"
| #define VERSION "1.5.0"
| #ifdef __cplusplus
| extern "C" void std::exit (int) throw (); using std::exit;
| #endif
| #define KDELIBSUFF ""
| #define STDC_HEADERS 1
| #define HAVE_SYS_TYPES_H 1
| #define HAVE_SYS_STAT_H 1
| #define HAVE_STDLIB_H 1
| #define HAVE_STRING_H 1
| #define HAVE_MEMORY_H 1
| #define HAVE_STRINGS_H 1
| #define HAVE_INTTYPES_H 1
| #define HAVE_STDINT_H 1
| #define HAVE_UNISTD_H 1
| #define HAVE_DLFCN_H 1
| #define LTDL_SHLIBPATH_VAR "LD_LIBRARY_PATH"
| #define LTDL_SYSSEARCHPATH "/lib:/usr/lib"
| #define LTDL_OBJDIR ".libs/"
| #define HAVE_PRELOADED_SYMBOLS 1
| #define HAVE_LIBDL 1
| #define HAVE_DLERROR 1
| #define HAVE_MALLOC_H 1
| #define HAVE_MEMORY_H 1
| #define HAVE_STDLIB_H 1
| #define HAVE_STDIO_H 1
| #define HAVE_CTYPE_H 1
| #define HAVE_DLFCN_H 1
| /* end confdefs.h. */
| #include <dl.h>
configure:22956: result: no
configure:22991: checking for dl.h
configure:22998: result: no
configure:22875: checking dld.h usability
configure:22887: i686-pc-linux-gnu-gcc -c -std=iso9899:1990 -W -Wall -Wchar-subscripts -Wshadow -Wpointer-arith -Wmissing-prototypes -Wwrite-strings -D_XOPEN_SOURCE=500 -D_BSD_SOURCE -DNDEBUG -O2 -march=pentium4 -O2 -pipe -fomit-frame-pointer -Wformat-security -Wmissing-format-attribute conftest.c >&5
conftest.c:72:17: error: dld.h: No such file or directory
configure:22893: $? = 1
configure: failed program was:
| /* confdefs.h. */
|
| #define PACKAGE_NAME ""
| #define PACKAGE_TARNAME ""
| #define PACKAGE_VERSION ""
| #define PACKAGE_STRING ""
| #define PACKAGE_BUGREPORT ""
| #define PACKAGE "arts"
| #define VERSION "1.5.0"
| #ifdef __cplusplus
| extern "C" void std::exit (int) throw (); using std::exit;
| #endif
| #define KDELIBSUFF ""
| #define STDC_HEADERS 1
| #define HAVE_SYS_TYPES_H 1
| #define HAVE_SYS_STAT_H 1
| #define HAVE_STDLIB_H 1
| #define HAVE_STRING_H 1
| #define HAVE_MEMORY_H 1
| #define HAVE_STRINGS_H 1
| #define HAVE_INTTYPES_H 1
| #define HAVE_STDINT_H 1
| #define HAVE_UNISTD_H 1
| #define HAVE_DLFCN_H 1
| #define LTDL_SHLIBPATH_VAR "LD_LIBRARY_PATH"
| #define LTDL_SYSSEARCHPATH "/lib:/usr/lib"
| #define LTDL_OBJDIR ".libs/"
| #define HAVE_PRELOADED_SYMBOLS 1
| #define HAVE_LIBDL 1
| #define HAVE_DLERROR 1
| #define HAVE_MALLOC_H 1
| #define HAVE_MEMORY_H 1
| #define HAVE_STDLIB_H 1
| #define HAVE_STDIO_H 1
| #define HAVE_CTYPE_H 1
| #define HAVE_DLFCN_H 1
| /* end confdefs.h. */
| #include <stdio.h>
| #if HAVE_SYS_TYPES_H
| # include <sys/types.h>
| #endif
| #if HAVE_SYS_STAT_H
| # include <sys/stat.h>
| #endif
| #if STDC_HEADERS
| # include <stdlib.h>
| # include <stddef.h>
| #else
| # if HAVE_STDLIB_H
| # include <stdlib.h>
| # endif
| #endif
| #if HAVE_STRING_H
| # if !STDC_HEADERS && HAVE_MEMORY_H
| # include <memory.h>
| # endif
| # include <string.h>
| #endif
| #if HAVE_STRINGS_H
| # include <strings.h>
| #endif
| #if HAVE_INTTYPES_H
| # include <inttypes.h>
| #else
| # if HAVE_STDINT_H
| # include <stdint.h>
| # endif
| #endif
| #if HAVE_UNISTD_H
| # include <unistd.h>
| #endif
| #include <dld.h>
configure:22916: result: no
configure:22920: checking dld.h presence
configure:22930: i686-pc-linux-gnu-gcc -E conftest.c
conftest.c:38:17: error: dld.h: No such file or directory
configure:22936: $? = 1
configure: failed program was:
| /* confdefs.h. */
|
| #define PACKAGE_NAME ""
| #define PACKAGE_TARNAME ""
| #define PACKAGE_VERSION ""
| #define PACKAGE_STRING ""
| #define PACKAGE_BUGREPORT ""
| #define PACKAGE "arts"
| #define VERSION "1.5.0"
| #ifdef __cplusplus
| extern "C" void std::exit (int) throw (); using std::exit;
| #endif
| #define KDELIBSUFF ""
| #define STDC_HEADERS 1
| #define HAVE_SYS_TYPES_H 1
| #define HAVE_SYS_STAT_H 1
| #define HAVE_STDLIB_H 1
| #define HAVE_STRING_H 1
| #define HAVE_MEMORY_H 1
| #define HAVE_STRINGS_H 1
| #define HAVE_INTTYPES_H 1
| #define HAVE_STDINT_H 1
| #define HAVE_UNISTD_H 1
| #define HAVE_DLFCN_H 1
| #define LTDL_SHLIBPATH_VAR "LD_LIBRARY_PATH"
| #define LTDL_SYSSEARCHPATH "/lib:/usr/lib"
| #define LTDL_OBJDIR ".libs/"
| #define HAVE_PRELOADED_SYMBOLS 1
| #define HAVE_LIBDL 1
| #define HAVE_DLERROR 1
| #define HAVE_MALLOC_H 1
| #define HAVE_MEMORY_H 1
| #define HAVE_STDLIB_H 1
| #define HAVE_STDIO_H 1
| #define HAVE_CTYPE_H 1
| #define HAVE_DLFCN_H 1
| /* end confdefs.h. */
| #include <dld.h>
configure:22956: result: no
configure:22991: checking for dld.h
configure:22998: result: no
configure:23017: checking for string.h
configure:23022: result: yes
configure:23167: checking for strchr
configure:23224: i686-pc-linux-gnu-gcc -o conftest -std=iso9899:1990 -W -Wall -Wchar-subscripts -Wshadow -Wpointer-arith -Wmissing-prototypes -Wwrite-strings -D_XOPEN_SOURCE=500 -D_BSD_SOURCE -DNDEBUG -O2 -march=pentium4 -O2 -pipe -fomit-frame-pointer -Wformat-security -Wmissing-format-attribute conftest.c >&5
conftest.c:63: warning: conflicting types for built-in function 'strchr'
configure:23230: $? = 0
configure:23234: test -z
|| test ! -s conftest.err
configure:23237: $? = 0
configure:23240: test -s conftest
configure:23243: $? = 0
configure:23255: result: yes
configure:23270: checking for strrchr
configure:23327: i686-pc-linux-gnu-gcc -o conftest -std=iso9899:1990 -W -Wall -Wchar-subscripts -Wshadow -Wpointer-arith -Wmissing-prototypes -Wwrite-strings -D_XOPEN_SOURCE=500 -D_BSD_SOURCE -DNDEBUG -O2 -march=pentium4 -O2 -pipe -fomit-frame-pointer -Wformat-security -Wmissing-format-attribute conftest.c >&5
conftest.c:64: warning: conflicting types for built-in function 'strrchr'
configure:23333: $? = 0
configure:23337: test -z
|| test ! -s conftest.err
configure:23340: $? = 0
configure:23343: test -s conftest
configure:23346: $? = 0
configure:23358: result: yes
configure:23373: checking for memcpy
configure:23430: i686-pc-linux-gnu-gcc -o conftest -std=iso9899:1990 -W -Wall -Wchar-subscripts -Wshadow -Wpointer-arith -Wmissing-prototypes -Wwrite-strings -D_XOPEN_SOURCE=500 -D_BSD_SOURCE -DNDEBUG -O2 -march=pentium4 -O2 -pipe -fomit-frame-pointer -Wformat-security -Wmissing-format-attribute conftest.c >&5
conftest.c:65: warning: conflicting types for built-in function 'memcpy'
configure:23436: $? = 0
configure:23440: test -z
|| test ! -s conftest.err
configure:23443: $? = 0
configure:23446: test -s conftest
configure:23449: $? = 0
configure:23461: result: yes
configure:23475: checking for strcmp
configure:23532: i686-pc-linux-gnu-gcc -o conftest -std=iso9899:1990 -W -Wall -Wchar-subscripts -Wshadow -Wpointer-arith -Wmissing-prototypes -Wwrite-strings -D_XOPEN_SOURCE=500 -D_BSD_SOURCE -DNDEBUG -O2 -march=pentium4 -O2 -pipe -fomit-frame-pointer -Wformat-security -Wmissing-format-attribute conftest.c >&5
conftest.c:66: warning: conflicting types for built-in function 'strcmp'
configure:23538: $? = 0
configure:23542: test -z
|| test ! -s conftest.err
configure:23545: $? = 0
configure:23548: test -s conftest
configure:23551: $? = 0
configure:23563: result: yes
configure:23585: checking for extra includes
configure:23613: result: no
configure:23617: checking for extra libs
configure:23646: result: no
configure:23652: checking for strlcat
configure:23700: i686-pc-linux-gnu-g++ -c -Wno-long-long -Wundef -ansi -D_XOPEN_SOURCE=500 -D_BSD_SOURCE -Wcast-align -Wconversion -Wchar-subscripts -Wall -W -Wpointer-arith -DNDEBUG -DNO_DEBUG -O2 -march=pentium4 -O2 -pipe -fomit-frame-pointer -Wformat-security -Wmissing-format-attribute -Wno-non-virtual-dtor -fno-exceptions -fno-check-new -fno-common -pedantic-errors conftest.cc >&5
conftest.cc: In function 'int main()':
conftest.cc:54: error: 'strlcat' was not declared in this scope
configure:23706: $? = 1
configure: failed program was:
| /* confdefs.h. */
|
| #define PACKAGE_NAME ""
| #define PACKAGE_TARNAME ""
| #define PACKAGE_VERSION ""
| #define PACKAGE_STRING ""
| #define PACKAGE_BUGREPORT ""
| #define PACKAGE "arts"
| #define VERSION "1.5.0"
| #ifdef __cplusplus
| extern "C" void std::exit (int) throw (); using std::exit;
| #endif
| #define KDELIBSUFF ""
| #define STDC_HEADERS 1
| #define HAVE_SYS_TYPES_H 1
| #define HAVE_SYS_STAT_H 1
| #define HAVE_STDLIB_H 1
| #define HAVE_STRING_H 1
| #define HAVE_MEMORY_H 1
| #define HAVE_STRINGS_H 1
| #define HAVE_INTTYPES_H 1
| #define HAVE_STDINT_H 1
| #define HAVE_UNISTD_H 1
| #define HAVE_DLFCN_H 1
| #define LTDL_SHLIBPATH_VAR "LD_LIBRARY_PATH"
| #define LTDL_SYSSEARCHPATH "/lib:/usr/lib"
| #define LTDL_OBJDIR ".libs/"
| #define HAVE_PRELOADED_SYMBOLS 1
| #define HAVE_LIBDL 1
| #define HAVE_DLERROR 1
| #define HAVE_MALLOC_H 1
| #define HAVE_MEMORY_H 1
| #define HAVE_STDLIB_H 1
| #define HAVE_STDIO_H 1
| #define HAVE_CTYPE_H 1
| #define HAVE_DLFCN_H 1
| #define HAVE_STRING_H 1
| #define HAVE_STRCHR 1
| #define HAVE_STRRCHR 1
| #define HAVE_MEMCPY 1
| #define HAVE_STRCMP 1
| /* end confdefs.h. */
|
|
| #include <string.h>
|
|
| int
| main ()
| {
|
| char buf[20];
| buf[0]='\0';
| strlcat(buf, "KDE function test", sizeof(buf));
|
|
| ;
| return 0;
| }
configure:23741: result: no
configure:23744: checking if strlcat needs custom prototype
configure:23848: result: yes - in libkdefakes
configure:23873: checking for strlcpy
configure:23920: i686-pc-linux-gnu-g++ -c -Wno-long-long -Wundef -ansi -D_XOPEN_SOURCE=500 -D_BSD_SOURCE -Wcast-align -Wconversion -Wchar-subscripts -Wall -W -Wpointer-arith -DNDEBUG -DNO_DEBUG -O2 -march=pentium4 -O2 -pipe -fomit-frame-pointer -Wformat-security -Wmissing-format-attribute -Wno-non-virtual-dtor -fno-exceptions -fno-check-new -fno-common -pedantic-errors conftest.cc >&5
conftest.cc: In function 'int main()':
conftest.cc:53: error: 'strlcpy' was not declared in this scope
configure:23926: $? = 1
configure: failed program was:
| /* confdefs.h. */
|
| #define PACKAGE_NAME ""
| #define PACKAGE_TARNAME ""
| #define PACKAGE_VERSION ""
| #define PACKAGE_STRING ""
| #define PACKAGE_BUGREPORT ""
| #define PACKAGE "arts"
| #define VERSION "1.5.0"
| #ifdef __cplusplus
| extern "C" void std::exit (int) throw (); using std::exit;
| #endif
| #define KDELIBSUFF ""
| #define STDC_HEADERS 1
| #define HAVE_SYS_TYPES_H 1
| #define HAVE_SYS_STAT_H 1
| #define HAVE_STDLIB_H 1
| #define HAVE_STRING_H 1
| #define HAVE_MEMORY_H 1
| #define HAVE_STRINGS_H 1
| #define HAVE_INTTYPES_H 1
| #define HAVE_STDINT_H 1
| #define HAVE_UNISTD_H 1
| #define HAVE_DLFCN_H 1
| #define LTDL_SHLIBPATH_VAR "LD_LIBRARY_PATH"
| #define LTDL_SYSSEARCHPATH "/lib:/usr/lib"
| #define LTDL_OBJDIR ".libs/"
| #define HAVE_PRELOADED_SYMBOLS 1
| #define HAVE_LIBDL 1
| #define HAVE_DLERROR 1
| #define HAVE_MALLOC_H 1
| #define HAVE_MEMORY_H 1
| #define HAVE_STDLIB_H 1
| #define HAVE_STDIO_H 1
| #define HAVE_CTYPE_H 1
| #define HAVE_DLFCN_H 1
| #define HAVE_STRING_H 1
| #define HAVE_STRCHR 1
| #define HAVE_STRRCHR 1
| #define HAVE_MEMCPY 1
| #define HAVE_STRCMP 1
| /* end confdefs.h. */
|
|
| #include <string.h>
|
|
| int
| main ()
| {
|
| char buf[20];
| strlcpy(buf, "KDE function test", sizeof(buf));
|
|
| ;
| return 0;
| }
configure:23961: result: no
configure:23964: checking if strlcpy needs custom prototype
configure:24067: result: yes - in libkdefakes
configure:24091: checking for main in -lutil
configure:24115: i686-pc-linux-gnu-gcc -o conftest -std=iso9899:1990 -W -Wall -Wchar-subscripts -Wshadow -Wpointer-arith -Wmissing-prototypes -Wwrite-strings -D_XOPEN_SOURCE=500 -D_BSD_SOURCE -DNDEBUG -O2 -march=pentium4 -O2 -pipe -fomit-frame-pointer -Wformat-security -Wmissing-format-attribute conftest.c -lutil >&5
configure:24121: $? = 0
configure:24125: test -z
|| test ! -s conftest.err
configure:24128: $? = 0
configure:24131: test -s conftest
configure:24134: $? = 0
configure:24147: result: yes
configure:24153: checking for main in -lcompat
configure:24177: i686-pc-linux-gnu-gcc -o conftest -std=iso9899:1990 -W -Wall -Wchar-subscripts -Wshadow -Wpointer-arith -Wmissing-prototypes -Wwrite-strings -D_XOPEN_SOURCE=500 -D_BSD_SOURCE -DNDEBUG -O2 -march=pentium4 -O2 -pipe -fomit-frame-pointer -Wformat-security -Wmissing-format-attribute conftest.c -lcompat >&5
/usr/lib/gcc/i686-pc-linux-gnu/4.0.1/../../../../i686-pc-linux-gnu/bin/ld: cannot find -lcompat
collect2: ld returned 1 exit status
configure:24183: $? = 1
configure: failed program was:
| /* confdefs.h. */
|
| #define PACKAGE_NAME ""
| #define PACKAGE_TARNAME ""
| #define PACKAGE_VERSION ""
| #define PACKAGE_STRING ""
| #define PACKAGE_BUGREPORT ""
| #define PACKAGE "arts"
| #define VERSION "1.5.0"
| #ifdef __cplusplus
| extern "C" void std::exit (int) throw (); using std::exit;
| #endif
| #define KDELIBSUFF ""
| #define STDC_HEADERS 1
| #define HAVE_SYS_TYPES_H 1
| #define HAVE_SYS_STAT_H 1
| #define HAVE_STDLIB_H 1
| #define HAVE_STRING_H 1
| #define HAVE_MEMORY_H 1
| #define HAVE_STRINGS_H 1
| #define HAVE_INTTYPES_H 1
| #define HAVE_STDINT_H 1
| #define HAVE_UNISTD_H 1
| #define HAVE_DLFCN_H 1
| #define LTDL_SHLIBPATH_VAR "LD_LIBRARY_PATH"
| #define LTDL_SYSSEARCHPATH "/lib:/usr/lib"
| #define LTDL_OBJDIR ".libs/"
| #define HAVE_PRELOADED_SYMBOLS 1
| #define HAVE_LIBDL 1
| #define HAVE_DLERROR 1
| #define HAVE_MALLOC_H 1
| #define HAVE_MEMORY_H 1
| #define HAVE_STDLIB_H 1
| #define HAVE_STDIO_H 1
| #define HAVE_CTYPE_H 1
| #define HAVE_DLFCN_H 1
| #define HAVE_STRING_H 1
| #define HAVE_STRCHR 1
| #define HAVE_STRRCHR 1
| #define HAVE_MEMCPY 1
| #define HAVE_STRCMP 1
| /* end confdefs.h. */
|
|
| int
| main ()
| {
| main ();
| ;
| return 0;
| }
configure:24209: result: no
configure:24216: checking for crypt in -lcrypt
configure:24246: i686-pc-linux-gnu-gcc -o conftest -std=iso9899:1990 -W -Wall -Wchar-subscripts -Wshadow -Wpointer-arith -Wmissing-prototypes -Wwrite-strings -D_XOPEN_SOURCE=500 -D_BSD_SOURCE -DNDEBUG -O2 -march=pentium4 -O2 -pipe -fomit-frame-pointer -Wformat-security -Wmissing-format-attribute conftest.c -lcrypt >&5
configure:24252: $? = 0
configure:24256: test -z
|| test ! -s conftest.err
configure:24259: $? = 0
configure:24262: test -s conftest
configure:24265: $? = 0
configure:24278: result: yes
configure:24372: checking for socklen_t
configure:24407: i686-pc-linux-gnu-g++ -c -Wno-long-long -Wundef -ansi -D_XOPEN_SOURCE=500 -D_BSD_SOURCE -Wcast-align -Wconversion -Wchar-subscripts -Wall -W -Wpointer-arith -DNDEBUG -DNO_DEBUG -O2 -march=pentium4 -O2 -pipe -fomit-frame-pointer -Wformat-security -Wmissing-format-attribute -Wno-non-virtual-dtor -fno-exceptions -fno-check-new -fno-common conftest.cc >&5
configure:24413: $? = 0
configure:24417: test -z
|| test ! -s conftest.err
configure:24420: $? = 0
configure:24423: test -s conftest.o
configure:24426: $? = 0
configure:24447: result: yes
configure:24541: checking for dnet_ntoa in -ldnet
configure:24571: i686-pc-linux-gnu-gcc -o conftest -std=iso9899:1990 -W -Wall -Wchar-subscripts -Wshadow -Wpointer-arith -Wmissing-prototypes -Wwrite-strings -D_XOPEN_SOURCE=500 -D_BSD_SOURCE -DNDEBUG -O2 -march=pentium4 -O2 -pipe -fomit-frame-pointer -Wformat-security -Wmissing-format-attribute conftest.c -ldnet >&5
/usr/lib/gcc/i686-pc-linux-gnu/4.0.1/../../../../i686-pc-linux-gnu/bin/ld: cannot find -ldnet
collect2: ld returned 1 exit status
configure:24577: $? = 1
configure: failed program was:
| /* confdefs.h. */
|
| #define PACKAGE_NAME ""
| #define PACKAGE_TARNAME ""
| #define PACKAGE_VERSION ""
| #define PACKAGE_STRING ""
| #define PACKAGE_BUGREPORT ""
| #define PACKAGE "arts"
| #define VERSION "1.5.0"
| #ifdef __cplusplus
| extern "C" void std::exit (int) throw (); using std::exit;
| #endif
| #define KDELIBSUFF ""
| #define STDC_HEADERS 1
| #define HAVE_SYS_TYPES_H 1
| #define HAVE_SYS_STAT_H 1
| #define HAVE_STDLIB_H 1
| #define HAVE_STRING_H 1
| #define HAVE_MEMORY_H 1
| #define HAVE_STRINGS_H 1
| #define HAVE_INTTYPES_H 1
| #define HAVE_STDINT_H 1
| #define HAVE_UNISTD_H 1
| #define HAVE_DLFCN_H 1
| #define LTDL_SHLIBPATH_VAR "LD_LIBRARY_PATH"
| #define LTDL_SYSSEARCHPATH "/lib:/usr/lib"
| #define LTDL_OBJDIR ".libs/"
| #define HAVE_PRELOADED_SYMBOLS 1
| #define HAVE_LIBDL 1
| #define HAVE_DLERROR 1
| #define HAVE_MALLOC_H 1
| #define HAVE_MEMORY_H 1
| #define HAVE_STDLIB_H 1
| #define HAVE_STDIO_H 1
| #define HAVE_CTYPE_H 1
| #define HAVE_DLFCN_H 1
| #define HAVE_STRING_H 1
| #define HAVE_STRCHR 1
| #define HAVE_STRRCHR 1
| #define HAVE_MEMCPY 1
| #define HAVE_STRCMP 1
| #define HAVE_CRYPT 1
| #define kde_socklen_t socklen_t
| #define ksize_t socklen_t
| /* end confdefs.h. */
|
| /* Override any gcc2 internal prototype to avoid an error. */
| #ifdef __cplusplus
| extern "C"
| #endif
| /* We use char because int might match the return type of a gcc2
| builtin and then its argument prototype would still apply. */
| char dnet_ntoa ();
| int
| main ()
| {
| dnet_ntoa ();
| ;
| return 0;
| }
configure:24603: result: no
configure:24610: checking for dnet_ntoa in -ldnet_stub
configure:24640: i686-pc-linux-gnu-gcc -o conftest -std=iso9899:1990 -W -Wall -Wchar-subscripts -Wshadow -Wpointer-arith -Wmissing-prototypes -Wwrite-strings -D_XOPEN_SOURCE=500 -D_BSD_SOURCE -DNDEBUG -O2 -march=pentium4 -O2 -pipe -fomit-frame-pointer -Wformat-security -Wmissing-format-attribute conftest.c -ldnet_stub >&5
/usr/lib/gcc/i686-pc-linux-gnu/4.0.1/../../../../i686-pc-linux-gnu/bin/ld: cannot find -ldnet_stub
collect2: ld returned 1 exit status
configure:24646: $? = 1
configure: failed program was:
| /* confdefs.h. */
|
| #define PACKAGE_NAME ""
| #define PACKAGE_TARNAME ""
| #define PACKAGE_VERSION ""
| #define PACKAGE_STRING ""
| #define PACKAGE_BUGREPORT ""
| #define PACKAGE "arts"
| #define VERSION "1.5.0"
| #ifdef __cplusplus
| extern "C" void std::exit (int) throw (); using std::exit;
| #endif
| #define KDELIBSUFF ""
| #define STDC_HEADERS 1
| #define HAVE_SYS_TYPES_H 1
| #define HAVE_SYS_STAT_H 1
| #define HAVE_STDLIB_H 1
| #define HAVE_STRING_H 1
| #define HAVE_MEMORY_H 1
| #define HAVE_STRINGS_H 1
| #define HAVE_INTTYPES_H 1
| #define HAVE_STDINT_H 1
| #define HAVE_UNISTD_H 1
| #define HAVE_DLFCN_H 1
| #define LTDL_SHLIBPATH_VAR "LD_LIBRARY_PATH"
| #define LTDL_SYSSEARCHPATH "/lib:/usr/lib"
| #define LTDL_OBJDIR ".libs/"
| #define HAVE_PRELOADED_SYMBOLS 1
| #define HAVE_LIBDL 1
| #define HAVE_DLERROR 1
| #define HAVE_MALLOC_H 1
| #define HAVE_MEMORY_H 1
| #define HAVE_STDLIB_H 1
| #define HAVE_STDIO_H 1
| #define HAVE_CTYPE_H 1
| #define HAVE_DLFCN_H 1
| #define HAVE_STRING_H 1
| #define HAVE_STRCHR 1
| #define HAVE_STRRCHR 1
| #define HAVE_MEMCPY 1
| #define HAVE_STRCMP 1
| #define HAVE_CRYPT 1
| #define kde_socklen_t socklen_t
| #define ksize_t socklen_t
| /* end confdefs.h. */
|
| /* Override any gcc2 internal prototype to avoid an error. */
| #ifdef __cplusplus
| extern "C"
| #endif
| /* We use char because int might match the return type of a gcc2
| builtin and then its argument prototype would still apply. */
| char dnet_ntoa ();
| int
| main ()
| {
| dnet_ntoa ();
| ;
| return 0;
| }
configure:24672: result: no
configure:24679: checking for inet_ntoa
configure:24736: i686-pc-linux-gnu-gcc -o conftest -std=iso9899:1990 -W -Wall -Wchar-subscripts -Wshadow -Wpointer-arith -Wmissing-prototypes -Wwrite-strings -D_XOPEN_SOURCE=500 -D_BSD_SOURCE -DNDEBUG -O2 -march=pentium4 -O2 -pipe -fomit-frame-pointer -Wformat-security -Wmissing-format-attribute conftest.c >&5
configure:24742: $? = 0
configure:24746: test -z
|| test ! -s conftest.err
configure:24749: $? = 0
configure:24752: test -s conftest
configure:24755: $? = 0
configure:24767: result: yes
configure:24840: checking for connect
configure:24897: i686-pc-linux-gnu-gcc -o conftest -std=iso9899:1990 -W -Wall -Wchar-subscripts -Wshadow -Wpointer-arith -Wmissing-prototypes -Wwrite-strings -D_XOPEN_SOURCE=500 -D_BSD_SOURCE -DNDEBUG -O2 -march=pentium4 -O2 -pipe -fomit-frame-pointer -Wformat-security -Wmissing-format-attribute conftest.c >&5
configure:24903: $? = 0
configure:24907: test -z
|| test ! -s conftest.err
configure:24910: $? = 0
configure:24913: test -s conftest
configure:24916: $? = 0
configure:24928: result: yes
configure:25002: checking for remove
configure:25059: i686-pc-linux-gnu-gcc -o conftest -std=iso9899:1990 -W -Wall -Wchar-subscripts -Wshadow -Wpointer-arith -Wmissing-prototypes -Wwrite-strings -D_XOPEN_SOURCE=500 -D_BSD_SOURCE -DNDEBUG -O2 -march=pentium4 -O2 -pipe -fomit-frame-pointer -Wformat-security -Wmissing-format-attribute conftest.c >&5
configure:25065: $? = 0
configure:25069: test -z
|| test ! -s conftest.err
configure:25072: $? = 0
configure:25075: test -s conftest
configure:25078: $? = 0
configure:25090: result: yes
configure:25165: checking for shmat
configure:25222: i686-pc-linux-gnu-gcc -o conftest -std=iso9899:1990 -W -Wall -Wchar-subscripts -Wshadow -Wpointer-arith -Wmissing-prototypes -Wwrite-strings -D_XOPEN_SOURCE=500 -D_BSD_SOURCE -DNDEBUG -O2 -march=pentium4 -O2 -pipe -fomit-frame-pointer -Wformat-security -Wmissing-format-attribute conftest.c >&5
configure:25228: $? = 0
configure:25232: test -z
|| test ! -s conftest.err
configure:25235: $? = 0
configure:25238: test -s conftest
configure:25241: $? = 0
configure:25253: result: yes
configure:25336: checking for sys/types.h
configure:25341: result: yes
configure:25336: checking for stdint.h
configure:25341: result: yes
configure:25497: checking sys/bitypes.h usability
configure:25509: i686-pc-linux-gnu-gcc -c -std=iso9899:1990 -W -Wall -Wchar-subscripts -Wshadow -Wpointer-arith -Wmissing-prototypes -Wwrite-strings -D_XOPEN_SOURCE=500 -D_BSD_SOURCE -DNDEBUG -O2 -march=pentium4 -O2 -pipe -fomit-frame-pointer -Wformat-security -Wmissing-format-attribute conftest.c >&5
configure:25515: $? = 0
configure:25519: test -z
|| test ! -s conftest.err
configure:25522: $? = 0
configure:25525: test -s conftest.o
configure:25528: $? = 0
configure:25538: result: yes
configure:25542: checking sys/bitypes.h presence
configure:25552: i686-pc-linux-gnu-gcc -E conftest.c
configure:25558: $? = 0
configure:25578: result: yes
configure:25613: checking for sys/bitypes.h
configure:25620: result: yes
configure:25635: checking for poll in -lpoll
configure:25665: i686-pc-linux-gnu-gcc -o conftest -std=iso9899:1990 -W -Wall -Wchar-subscripts -Wshadow -Wpointer-arith -Wmissing-prototypes -Wwrite-strings -D_XOPEN_SOURCE=500 -D_BSD_SOURCE -DNDEBUG -O2 -march=pentium4 -O2 -pipe -fomit-frame-pointer -Wformat-security -Wmissing-format-attribute conftest.c -lpoll >&5
/usr/lib/gcc/i686-pc-linux-gnu/4.0.1/../../../../i686-pc-linux-gnu/bin/ld: cannot find -lpoll
collect2: ld returned 1 exit status
configure:25671: $? = 1
configure: failed program was:
| /* confdefs.h. */
|
| #define PACKAGE_NAME ""
| #define PACKAGE_TARNAME ""
| #define PACKAGE_VERSION ""
| #define PACKAGE_STRING ""
| #define PACKAGE_BUGREPORT ""
| #define PACKAGE "arts"
| #define VERSION "1.5.0"
| #ifdef __cplusplus
| extern "C" void std::exit (int) throw (); using std::exit;
| #endif
| #define KDELIBSUFF ""
| #define STDC_HEADERS 1
| #define HAVE_SYS_TYPES_H 1
| #define HAVE_SYS_STAT_H 1
| #define HAVE_STDLIB_H 1
| #define HAVE_STRING_H 1
| #define HAVE_MEMORY_H 1
| #define HAVE_STRINGS_H 1
| #define HAVE_INTTYPES_H 1
| #define HAVE_STDINT_H 1
| #define HAVE_UNISTD_H 1
| #define HAVE_DLFCN_H 1
| #define LTDL_SHLIBPATH_VAR "LD_LIBRARY_PATH"
| #define LTDL_SYSSEARCHPATH "/lib:/usr/lib"
| #define LTDL_OBJDIR ".libs/"
| #define HAVE_PRELOADED_SYMBOLS 1
| #define HAVE_LIBDL 1
| #define HAVE_DLERROR 1
| #define HAVE_MALLOC_H 1
| #define HAVE_MEMORY_H 1
| #define HAVE_STDLIB_H 1
| #define HAVE_STDIO_H 1
| #define HAVE_CTYPE_H 1
| #define HAVE_DLFCN_H 1
| #define HAVE_STRING_H 1
| #define HAVE_STRCHR 1
| #define HAVE_STRRCHR 1
| #define HAVE_MEMCPY 1
| #define HAVE_STRCMP 1
| #define HAVE_CRYPT 1
| #define kde_socklen_t socklen_t
| #define ksize_t socklen_t
| #define HAVE_SYS_TYPES_H 1
| #define HAVE_STDINT_H 1
| #define HAVE_SYS_BITYPES_H 1
| /* end confdefs.h. */
|
| /* Override any gcc2 internal prototype to avoid an error. */
| #ifdef __cplusplus
| extern "C"
| #endif
| /* We use char because int might match the return type of a gcc2
| builtin and then its argument prototype would still apply. */
| char poll ();
| int
| main ()
| {
| poll ();
| ;
| return 0;
| }
configure:25697: result: no
configure:25719: checking Carbon/Carbon.h usability
configure:25731: i686-pc-linux-gnu-gcc -c -std=iso9899:1990 -W -Wall -Wchar-subscripts -Wshadow -Wpointer-arith -Wmissing-prototypes -Wwrite-strings -D_XOPEN_SOURCE=500 -D_BSD_SOURCE -DNDEBUG -O2 -march=pentium4 -O2 -pipe -fomit-frame-pointer -Wformat-security -Wmissing-format-attribute conftest.c >&5
conftest.c:83:27: error: Carbon/Carbon.h: No such file or directory
configure:25737: $? = 1
configure: failed program was:
| /* confdefs.h. */
|
| #define PACKAGE_NAME ""
| #define PACKAGE_TARNAME ""
| #define PACKAGE_VERSION ""
| #define PACKAGE_STRING ""
| #define PACKAGE_BUGREPORT ""
| #define PACKAGE "arts"
| #define VERSION "1.5.0"
| #ifdef __cplusplus
| extern "C" void std::exit (int) throw (); using std::exit;
| #endif
| #define KDELIBSUFF ""
| #define STDC_HEADERS 1
| #define HAVE_SYS_TYPES_H 1
| #define HAVE_SYS_STAT_H 1
| #define HAVE_STDLIB_H 1
| #define HAVE_STRING_H 1
| #define HAVE_MEMORY_H 1
| #define HAVE_STRINGS_H 1
| #define HAVE_INTTYPES_H 1
| #define HAVE_STDINT_H 1
| #define HAVE_UNISTD_H 1
| #define HAVE_DLFCN_H 1
| #define LTDL_SHLIBPATH_VAR "LD_LIBRARY_PATH"
| #define LTDL_SYSSEARCHPATH "/lib:/usr/lib"
| #define LTDL_OBJDIR ".libs/"
| #define HAVE_PRELOADED_SYMBOLS 1
| #define HAVE_LIBDL 1
| #define HAVE_DLERROR 1
| #define HAVE_MALLOC_H 1
| #define HAVE_MEMORY_H 1
| #define HAVE_STDLIB_H 1
| #define HAVE_STDIO_H 1
| #define HAVE_CTYPE_H 1
| #define HAVE_DLFCN_H 1
| #define HAVE_STRING_H 1
| #define HAVE_STRCHR 1
| #define HAVE_STRRCHR 1
| #define HAVE_MEMCPY 1
| #define HAVE_STRCMP 1
| #define HAVE_CRYPT 1
| #define kde_socklen_t socklen_t
| #define ksize_t socklen_t
| #define HAVE_SYS_TYPES_H 1
| #define HAVE_STDINT_H 1
| #define HAVE_SYS_BITYPES_H 1
| /* end confdefs.h. */
| #include <stdio.h>
| #if HAVE_SYS_TYPES_H
| # include <sys/types.h>
| #endif
| #if HAVE_SYS_STAT_H
| # include <sys/stat.h>
| #endif
| #if STDC_HEADERS
| # include <stdlib.h>
| # include <stddef.h>
| #else
| # if HAVE_STDLIB_H
| # include <stdlib.h>
| # endif
| #endif
| #if HAVE_STRING_H
| # if !STDC_HEADERS && HAVE_MEMORY_H
| # include <memory.h>
| # endif
| # include <string.h>
| #endif
| #if HAVE_STRINGS_H
| # include <strings.h>
| #endif
| #if HAVE_INTTYPES_H
| # include <inttypes.h>
| #else
| # if HAVE_STDINT_H
| # include <stdint.h>
| # endif
| #endif
| #if HAVE_UNISTD_H
| # include <unistd.h>
| #endif
| #include <Carbon/Carbon.h>
configure:25760: result: no
configure:25764: checking Carbon/Carbon.h presence
configure:25774: i686-pc-linux-gnu-gcc -E conftest.c
conftest.c:49:27: error: Carbon/Carbon.h: No such file or directory
configure:25780: $? = 1
configure: failed program was:
| /* confdefs.h. */
|
| #define PACKAGE_NAME ""
| #define PACKAGE_TARNAME ""
| #define PACKAGE_VERSION ""
| #define PACKAGE_STRING ""
| #define PACKAGE_BUGREPORT ""
| #define PACKAGE "arts"
| #define VERSION "1.5.0"
| #ifdef __cplusplus
| extern "C" void std::exit (int) throw (); using std::exit;
| #endif
| #define KDELIBSUFF ""
| #define STDC_HEADERS 1
| #define HAVE_SYS_TYPES_H 1
| #define HAVE_SYS_STAT_H 1
| #define HAVE_STDLIB_H 1
| #define HAVE_STRING_H 1
| #define HAVE_MEMORY_H 1
| #define HAVE_STRINGS_H 1
| #define HAVE_INTTYPES_H 1
| #define HAVE_STDINT_H 1
| #define HAVE_UNISTD_H 1
| #define HAVE_DLFCN_H 1
| #define LTDL_SHLIBPATH_VAR "LD_LIBRARY_PATH"
| #define LTDL_SYSSEARCHPATH "/lib:/usr/lib"
| #define LTDL_OBJDIR ".libs/"
| #define HAVE_PRELOADED_SYMBOLS 1
| #define HAVE_LIBDL 1
| #define HAVE_DLERROR 1
| #define HAVE_MALLOC_H 1
| #define HAVE_MEMORY_H 1
| #define HAVE_STDLIB_H 1
| #define HAVE_STDIO_H 1
| #define HAVE_CTYPE_H 1
| #define HAVE_DLFCN_H 1
| #define HAVE_STRING_H 1
| #define HAVE_STRCHR 1
| #define HAVE_STRRCHR 1
| #define HAVE_MEMCPY 1
| #define HAVE_STRCMP 1
| #define HAVE_CRYPT 1
| #define kde_socklen_t socklen_t
| #define ksize_t socklen_t
| #define HAVE_SYS_TYPES_H 1
| #define HAVE_STDINT_H 1
| #define HAVE_SYS_BITYPES_H 1
| /* end confdefs.h. */
| #include <Carbon/Carbon.h>
configure:25800: result: no
configure:25835: checking for Carbon/Carbon.h
configure:25842: result: no
configure:25867: checking CoreAudio/CoreAudio.h usability
configure:25879: i686-pc-linux-gnu-gcc -c -std=iso9899:1990 -W -Wall -Wchar-subscripts -Wshadow -Wpointer-arith -Wmissing-prototypes -Wwrite-strings -D_XOPEN_SOURCE=500 -D_BSD_SOURCE -DNDEBUG -O2 -march=pentium4 -O2 -pipe -fomit-frame-pointer -Wformat-security -Wmissing-format-attribute conftest.c >&5
conftest.c:83:33: error: CoreAudio/CoreAudio.h: No such file or directory
configure:25885: $? = 1
configure: failed program was:
| /* confdefs.h. */
|
| #define PACKAGE_NAME ""
| #define PACKAGE_TARNAME ""
| #define PACKAGE_VERSION ""
| #define PACKAGE_STRING ""
| #define PACKAGE_BUGREPORT ""
| #define PACKAGE "arts"
| #define VERSION "1.5.0"
| #ifdef __cplusplus
| extern "C" void std::exit (int) throw (); using std::exit;
| #endif
| #define KDELIBSUFF ""
| #define STDC_HEADERS 1
| #define HAVE_SYS_TYPES_H 1
| #define HAVE_SYS_STAT_H 1
| #define HAVE_STDLIB_H 1
| #define HAVE_STRING_H 1
| #define HAVE_MEMORY_H 1
| #define HAVE_STRINGS_H 1
| #define HAVE_INTTYPES_H 1
| #define HAVE_STDINT_H 1
| #define HAVE_UNISTD_H 1
| #define HAVE_DLFCN_H 1
| #define LTDL_SHLIBPATH_VAR "LD_LIBRARY_PATH"
| #define LTDL_SYSSEARCHPATH "/lib:/usr/lib"
| #define LTDL_OBJDIR ".libs/"
| #define HAVE_PRELOADED_SYMBOLS 1
| #define HAVE_LIBDL 1
| #define HAVE_DLERROR 1
| #define HAVE_MALLOC_H 1
| #define HAVE_MEMORY_H 1
| #define HAVE_STDLIB_H 1
| #define HAVE_STDIO_H 1
| #define HAVE_CTYPE_H 1
| #define HAVE_DLFCN_H 1
| #define HAVE_STRING_H 1
| #define HAVE_STRCHR 1
| #define HAVE_STRRCHR 1
| #define HAVE_MEMCPY 1
| #define HAVE_STRCMP 1
| #define HAVE_CRYPT 1
| #define kde_socklen_t socklen_t
| #define ksize_t socklen_t
| #define HAVE_SYS_TYPES_H 1
| #define HAVE_STDINT_H 1
| #define HAVE_SYS_BITYPES_H 1
| /* end confdefs.h. */
| #include <stdio.h>
| #if HAVE_SYS_TYPES_H
| # include <sys/types.h>
| #endif
| #if HAVE_SYS_STAT_H
| # include <sys/stat.h>
| #endif
| #if STDC_HEADERS
| # include <stdlib.h>
| # include <stddef.h>
| #else
| # if HAVE_STDLIB_H
| # include <stdlib.h>
| # endif
| #endif
| #if HAVE_STRING_H
| # if !STDC_HEADERS && HAVE_MEMORY_H
| # include <memory.h>
| # endif
| # include <string.h>
| #endif
| #if HAVE_STRINGS_H
| # include <strings.h>
| #endif
| #if HAVE_INTTYPES_H
| # include <inttypes.h>
| #else
| # if HAVE_STDINT_H
| # include <stdint.h>
| # endif
| #endif
| #if HAVE_UNISTD_H
| # include <unistd.h>
| #endif
| #include <CoreAudio/CoreAudio.h>
configure:25908: result: no
configure:25912: checking CoreAudio/CoreAudio.h presence
configure:25922: i686-pc-linux-gnu-gcc -E conftest.c
conftest.c:49:33: error: CoreAudio/CoreAudio.h: No such file or directory
configure:25928: $? = 1
configure: failed program was:
| /* confdefs.h. */
|
| #define PACKAGE_NAME ""
| #define PACKAGE_TARNAME ""
| #define PACKAGE_VERSION ""
| #define PACKAGE_STRING ""
| #define PACKAGE_BUGREPORT ""
| #define PACKAGE "arts"
| #define VERSION "1.5.0"
| #ifdef __cplusplus
| extern "C" void std::exit (int) throw (); using std::exit;
| #endif
| #define KDELIBSUFF ""
| #define STDC_HEADERS 1
| #define HAVE_SYS_TYPES_H 1
| #define HAVE_SYS_STAT_H 1
| #define HAVE_STDLIB_H 1
| #define HAVE_STRING_H 1
| #define HAVE_MEMORY_H 1
| #define HAVE_STRINGS_H 1
| #define HAVE_INTTYPES_H 1
| #define HAVE_STDINT_H 1
| #define HAVE_UNISTD_H 1
| #define HAVE_DLFCN_H 1
| #define LTDL_SHLIBPATH_VAR "LD_LIBRARY_PATH"
| #define LTDL_SYSSEARCHPATH "/lib:/usr/lib"
| #define LTDL_OBJDIR ".libs/"
| #define HAVE_PRELOADED_SYMBOLS 1
| #define HAVE_LIBDL 1
| #define HAVE_DLERROR 1
| #define HAVE_MALLOC_H 1
| #define HAVE_MEMORY_H 1
| #define HAVE_STDLIB_H 1
| #define HAVE_STDIO_H 1
| #define HAVE_CTYPE_H 1
| #define HAVE_DLFCN_H 1
| #define HAVE_STRING_H 1
| #define HAVE_STRCHR 1
| #define HAVE_STRRCHR 1
| #define HAVE_MEMCPY 1
| #define HAVE_STRCMP 1
| #define HAVE_CRYPT 1
| #define kde_socklen_t socklen_t
| #define ksize_t socklen_t
| #define HAVE_SYS_TYPES_H 1
| #define HAVE_STDINT_H 1
| #define HAVE_SYS_BITYPES_H 1
| /* end confdefs.h. */
| #include <CoreAudio/CoreAudio.h>
configure:25948: result: no
configure:25983: checking for CoreAudio/CoreAudio.h
configure:25990: result: no
configure:26008: checking if res_init needs -lresolv
configure:26035: i686-pc-linux-gnu-gcc -o conftest -std=iso9899:1990 -W -Wall -Wchar-subscripts -Wshadow -Wpointer-arith -Wmissing-prototypes -Wwrite-strings -D_XOPEN_SOURCE=500 -D_BSD_SOURCE -DNDEBUG -O2 -march=pentium4 -O2 -pipe -fomit-frame-pointer -Wformat-security -Wmissing-format-attribute conftest.c -lresolv >&5
configure:26041: $? = 0
configure:26045: test -z
|| test ! -s conftest.err
configure:26048: $? = 0
configure:26051: test -s conftest
configure:26054: $? = 0
configure:26058: result: yes
configure:26080: checking for res_init
configure:26128: i686-pc-linux-gnu-g++ -c -Wno-long-long -Wundef -ansi -D_XOPEN_SOURCE=500 -D_BSD_SOURCE -Wcast-align -Wconversion -Wchar-subscripts -Wall -W -Wpointer-arith -DNDEBUG -DNO_DEBUG -O2 -march=pentium4 -O2 -pipe -fomit-frame-pointer -Wformat-security -Wmissing-format-attribute -Wno-non-virtual-dtor -fno-exceptions -fno-check-new -fno-common -pedantic-errors conftest.cc >&5
configure:26134: $? = 0
configure:26138: test -z
|| test ! -s conftest.err
configure:26141: $? = 0
configure:26144: test -s conftest.o
configure:26147: $? = 0
configure:26169: result: yes
configure:26172: checking if res_init needs custom prototype
configure:26276: result: no
configure:26304: checking for killpg in -lucb
configure:26334: i686-pc-linux-gnu-gcc -o conftest -std=iso9899:1990 -W -Wall -Wchar-subscripts -Wshadow -Wpointer-arith -Wmissing-prototypes -Wwrite-strings -D_XOPEN_SOURCE=500 -D_BSD_SOURCE -DNDEBUG -O2 -march=pentium4 -O2 -pipe -fomit-frame-pointer -Wformat-security -Wmissing-format-attribute conftest.c -lucb >&5
/usr/lib/gcc/i686-pc-linux-gnu/4.0.1/../../../../i686-pc-linux-gnu/bin/ld: cannot find -lucb
collect2: ld returned 1 exit status
configure:26340: $? = 1
configure: failed program was:
| /* confdefs.h. */
|
| #define PACKAGE_NAME ""
| #define PACKAGE_TARNAME ""
| #define PACKAGE_VERSION ""
| #define PACKAGE_STRING ""
| #define PACKAGE_BUGREPORT ""
| #define PACKAGE "arts"
| #define VERSION "1.5.0"
| #ifdef __cplusplus
| extern "C" void std::exit (int) throw (); using std::exit;
| #endif
| #define KDELIBSUFF ""
| #define STDC_HEADERS 1
| #define HAVE_SYS_TYPES_H 1
| #define HAVE_SYS_STAT_H 1
| #define HAVE_STDLIB_H 1
| #define HAVE_STRING_H 1
| #define HAVE_MEMORY_H 1
| #define HAVE_STRINGS_H 1
| #define HAVE_INTTYPES_H 1
| #define HAVE_STDINT_H 1
| #define HAVE_UNISTD_H 1
| #define HAVE_DLFCN_H 1
| #define LTDL_SHLIBPATH_VAR "LD_LIBRARY_PATH"
| #define LTDL_SYSSEARCHPATH "/lib:/usr/lib"
| #define LTDL_OBJDIR ".libs/"
| #define HAVE_PRELOADED_SYMBOLS 1
| #define HAVE_LIBDL 1
| #define HAVE_DLERROR 1
| #define HAVE_MALLOC_H 1
| #define HAVE_MEMORY_H 1
| #define HAVE_STDLIB_H 1
| #define HAVE_STDIO_H 1
| #define HAVE_CTYPE_H 1
| #define HAVE_DLFCN_H 1
| #define HAVE_STRING_H 1
| #define HAVE_STRCHR 1
| #define HAVE_STRRCHR 1
| #define HAVE_MEMCPY 1
| #define HAVE_STRCMP 1
| #define HAVE_CRYPT 1
| #define kde_socklen_t socklen_t
| #define ksize_t socklen_t
| #define HAVE_SYS_TYPES_H 1
| #define HAVE_STDINT_H 1
| #define HAVE_SYS_BITYPES_H 1
| #define HAVE_RES_INIT 1
| #define HAVE_RES_INIT 1
| #define HAVE_RES_INIT_PROTO 1
| /* end confdefs.h. */
|
| /* Override any gcc2 internal prototype to avoid an error. */
| #ifdef __cplusplus
| extern "C"
| #endif
| /* We use char because int might match the return type of a gcc2
| builtin and then its argument prototype would still apply. */
| char killpg ();
| int
| main ()
| {
| killpg ();
| ;
| return 0;
| }
configure:26366: result: no
configure:26449: checking for int
configure:26473: i686-pc-linux-gnu-gcc -c -std=iso9899:1990 -W -Wall -Wchar-subscripts -Wshadow -Wpointer-arith -Wmissing-prototypes -Wwrite-strings -D_XOPEN_SOURCE=500 -D_BSD_SOURCE -DNDEBUG -O2 -march=pentium4 -O2 -pipe -fomit-frame-pointer -Wformat-security -Wmissing-format-attribute conftest.c >&5
configure:26479: $? = 0
configure:26483: test -z
|| test ! -s conftest.err
configure:26486: $? = 0
configure:26489: test -s conftest.o
configure:26492: $? = 0
configure:26503: result: yes
configure:26506: checking size of int
configure:26825: i686-pc-linux-gnu-gcc -o conftest -std=iso9899:1990 -W -Wall -Wchar-subscripts -Wshadow -Wpointer-arith -Wmissing-prototypes -Wwrite-strings -D_XOPEN_SOURCE=500 -D_BSD_SOURCE -DNDEBUG -O2 -march=pentium4 -O2 -pipe -fomit-frame-pointer -Wformat-security -Wmissing-format-attribute conftest.c >&5
conftest.c:86: warning: no previous prototype for 'longval'
conftest.c:87: warning: no previous prototype for 'ulongval'
configure:26828: $? = 0
configure:26830: ./conftest
configure:26833: $? = 0
configure:26856: result: 4
configure:26862: checking for short
configure:26886: i686-pc-linux-gnu-gcc -c -std=iso9899:1990 -W -Wall -Wchar-subscripts -Wshadow -Wpointer-arith -Wmissing-prototypes -Wwrite-strings -D_XOPEN_SOURCE=500 -D_BSD_SOURCE -DNDEBUG -O2 -march=pentium4 -O2 -pipe -fomit-frame-pointer -Wformat-security -Wmissing-format-attribute conftest.c >&5
configure:26892: $? = 0
configure:26896: test -z
|| test ! -s conftest.err
configure:26899: $? = 0
configure:26902: test -s conftest.o
configure:26905: $? = 0
configure:26916: result: yes
configure:26919: checking size of short
configure:27238: i686-pc-linux-gnu-gcc -o conftest -std=iso9899:1990 -W -Wall -Wchar-subscripts -Wshadow -Wpointer-arith -Wmissing-prototypes -Wwrite-strings -D_XOPEN_SOURCE=500 -D_BSD_SOURCE -DNDEBUG -O2 -march=pentium4 -O2 -pipe -fomit-frame-pointer -Wformat-security -Wmissing-format-attribute conftest.c >&5
conftest.c:87: warning: no previous prototype for 'longval'
conftest.c:88: warning: no previous prototype for 'ulongval'
configure:27241: $? = 0
configure:27243: ./conftest
configure:27246: $? = 0
configure:27269: result: 2
configure:27275: checking for long
configure:27299: i686-pc-linux-gnu-gcc -c -std=iso9899:1990 -W -Wall -Wchar-subscripts -Wshadow -Wpointer-arith -Wmissing-prototypes -Wwrite-strings -D_XOPEN_SOURCE=500 -D_BSD_SOURCE -DNDEBUG -O2 -march=pentium4 -O2 -pipe -fomit-frame-pointer -Wformat-security -Wmissing-format-attribute conftest.c >&5
configure:27305: $? = 0
configure:27309: test -z
|| test ! -s conftest.err
configure:27312: $? = 0
configure:27315: test -s conftest.o
configure:27318: $? = 0
configure:27329: result: yes
configure:27332: checking size of long
configure:27651: i686-pc-linux-gnu-gcc -o conftest -std=iso9899:1990 -W -Wall -Wchar-subscripts -Wshadow -Wpointer-arith -Wmissing-prototypes -Wwrite-strings -D_XOPEN_SOURCE=500 -D_BSD_SOURCE -DNDEBUG -O2 -march=pentium4 -O2 -pipe -fomit-frame-pointer -Wformat-security -Wmissing-format-attribute conftest.c >&5
conftest.c:88: warning: no previous prototype for 'longval'
conftest.c:89: warning: no previous prototype for 'ulongval'
configure:27654: $? = 0
configure:27656: ./conftest
configure:27659: $? = 0
configure:27682: result: 4
configure:27688: checking for char *
configure:27712: i686-pc-linux-gnu-gcc -c -std=iso9899:1990 -W -Wall -Wchar-subscripts -Wshadow -Wpointer-arith -Wmissing-prototypes -Wwrite-strings -D_XOPEN_SOURCE=500 -D_BSD_SOURCE -DNDEBUG -O2 -march=pentium4 -O2 -pipe -fomit-frame-pointer -Wformat-security -Wmissing-format-attribute conftest.c >&5
configure:27718: $? = 0
configure:27722: test -z
|| test ! -s conftest.err
configure:27725: $? = 0
configure:27728: test -s conftest.o
configure:27731: $? = 0
configure:27742: result: yes
configure:27745: checking size of char *
configure:28064: i686-pc-linux-gnu-gcc -o conftest -std=iso9899:1990 -W -Wall -Wchar-subscripts -Wshadow -Wpointer-arith -Wmissing-prototypes -Wwrite-strings -D_XOPEN_SOURCE=500 -D_BSD_SOURCE -DNDEBUG -O2 -march=pentium4 -O2 -pipe -fomit-frame-pointer -Wformat-security -Wmissing-format-attribute conftest.c >&5
conftest.c:89: warning: no previous prototype for 'longval'
conftest.c:90: warning: no previous prototype for 'ulongval'
configure:28067: $? = 0
configure:28069: ./conftest
configure:28072: $? = 0
configure:28095: result: 4
configure:28103: checking for dlopen in -ldl
configure:28165: result: yes
configure:28175: checking for shl_unload in -ldld
configure:28205: i686-pc-linux-gnu-gcc -o conftest -std=iso9899:1990 -W -Wall -Wchar-subscripts -Wshadow -Wpointer-arith -Wmissing-prototypes -Wwrite-strings -D_XOPEN_SOURCE=500 -D_BSD_SOURCE -DNDEBUG -O2 -march=pentium4 -O2 -pipe -fomit-frame-pointer -Wformat-security -Wmissing-format-attribute conftest.c -ldld >&5
/usr/lib/gcc/i686-pc-linux-gnu/4.0.1/../../../../i686-pc-linux-gnu/bin/ld: cannot find -ldld
collect2: ld returned 1 exit status
configure:28211: $? = 1
configure: failed program was:
| /* confdefs.h. */
|
| #define PACKAGE_NAME ""
| #define PACKAGE_TARNAME ""
| #define PACKAGE_VERSION ""
| #define PACKAGE_STRING ""
| #define PACKAGE_BUGREPORT ""
| #define PACKAGE "arts"
| #define VERSION "1.5.0"
| #ifdef __cplusplus
| extern "C" void std::exit (int) throw (); using std::exit;
| #endif
| #define KDELIBSUFF ""
| #define STDC_HEADERS 1
| #define HAVE_SYS_TYPES_H 1
| #define HAVE_SYS_STAT_H 1
| #define HAVE_STDLIB_H 1
| #define HAVE_STRING_H 1
| #define HAVE_MEMORY_H 1
| #define HAVE_STRINGS_H 1
| #define HAVE_INTTYPES_H 1
| #define HAVE_STDINT_H 1
| #define HAVE_UNISTD_H 1
| #define HAVE_DLFCN_H 1
| #define LTDL_SHLIBPATH_VAR "LD_LIBRARY_PATH"
| #define LTDL_SYSSEARCHPATH "/lib:/usr/lib"
| #define LTDL_OBJDIR ".libs/"
| #define HAVE_PRELOADED_SYMBOLS 1
| #define HAVE_LIBDL 1
| #define HAVE_DLERROR 1
| #define HAVE_MALLOC_H 1
| #define HAVE_MEMORY_H 1
| #define HAVE_STDLIB_H 1
| #define HAVE_STDIO_H 1
| #define HAVE_CTYPE_H 1
| #define HAVE_DLFCN_H 1
| #define HAVE_STRING_H 1
| #define HAVE_STRCHR 1
| #define HAVE_STRRCHR 1
| #define HAVE_MEMCPY 1
| #define HAVE_STRCMP 1
| #define HAVE_CRYPT 1
| #define kde_socklen_t socklen_t
| #define ksize_t socklen_t
| #define HAVE_SYS_TYPES_H 1
| #define HAVE_STDINT_H 1
| #define HAVE_SYS_BITYPES_H 1
| #define HAVE_RES_INIT 1
| #define HAVE_RES_INIT 1
| #define HAVE_RES_INIT_PROTO 1
| #define SIZEOF_INT 4
| #define SIZEOF_SHORT 2
| #define SIZEOF_LONG 4
| #define SIZEOF_CHAR_P 4
| /* end confdefs.h. */
|
| /* Override any gcc2 internal prototype to avoid an error. */
| #ifdef __cplusplus
| extern "C"
| #endif
| /* We use char because int might match the return type of a gcc2
| builtin and then its argument prototype would still apply. */
| char shl_unload ();
| int
| main ()
| {
| shl_unload ();
| ;
| return 0;
| }
configure:28237: result: no
configure:28252: checking for size_t
configure:28276: i686-pc-linux-gnu-gcc -c -std=iso9899:1990 -W -Wall -Wchar-subscripts -Wshadow -Wpointer-arith -Wmissing-prototypes -Wwrite-strings -D_XOPEN_SOURCE=500 -D_BSD_SOURCE -DNDEBUG -O2 -march=pentium4 -O2 -pipe -fomit-frame-pointer -Wformat-security -Wmissing-format-attribute conftest.c >&5
configure:28282: $? = 0
configure:28286: test -z
|| test ! -s conftest.err
configure:28289: $? = 0
configure:28292: test -s conftest.o
configure:28295: $? = 0
configure:28306: result: yes
configure:28309: checking size of size_t
configure:28628: i686-pc-linux-gnu-gcc -o conftest -std=iso9899:1990 -W -Wall -Wchar-subscripts -Wshadow -Wpointer-arith -Wmissing-prototypes -Wwrite-strings -D_XOPEN_SOURCE=500 -D_BSD_SOURCE -DNDEBUG -O2 -march=pentium4 -O2 -pipe -fomit-frame-pointer -Wformat-security -Wmissing-format-attribute conftest.c >&5
conftest.c:90: warning: no previous prototype for 'longval'
conftest.c:91: warning: no previous prototype for 'ulongval'
configure:28631: $? = 0
configure:28633: ./conftest
configure:28636: $? = 0
configure:28659: result: 4
configure:28666: checking for unsigned long
configure:28690: i686-pc-linux-gnu-gcc -c -std=iso9899:1990 -W -Wall -Wchar-subscripts -Wshadow -Wpointer-arith -Wmissing-prototypes -Wwrite-strings -D_XOPEN_SOURCE=500 -D_BSD_SOURCE -DNDEBUG -O2 -march=pentium4 -O2 -pipe -fomit-frame-pointer -Wformat-security -Wmissing-format-attribute conftest.c >&5
configure:28696: $? = 0
configure:28700: test -z
|| test ! -s conftest.err
configure:28703: $? = 0
configure:28706: test -s conftest.o
configure:28709: $? = 0
configure:28720: result: yes
configure:28723: checking size of unsigned long
configure:29042: i686-pc-linux-gnu-gcc -o conftest -std=iso9899:1990 -W -Wall -Wchar-subscripts -Wshadow -Wpointer-arith -Wmissing-prototypes -Wwrite-strings -D_XOPEN_SOURCE=500 -D_BSD_SOURCE -DNDEBUG -O2 -march=pentium4 -O2 -pipe -fomit-frame-pointer -Wformat-security -Wmissing-format-attribute conftest.c >&5
conftest.c:91: warning: no previous prototype for 'longval'
conftest.c:92: warning: no previous prototype for 'ulongval'
configure:29045: $? = 0
configure:29047: ./conftest
configure:29050: $? = 0
configure:29073: result: 4
configure:29081: checking sizeof size_t == sizeof unsigned long
configure:29103: i686-pc-linux-gnu-gcc -c -std=iso9899:1990 -W -Wall -Wchar-subscripts -Wshadow -Wpointer-arith -Wmissing-prototypes -Wwrite-strings -D_XOPEN_SOURCE=500 -D_BSD_SOURCE -DNDEBUG -O2 -march=pentium4 -O2 -pipe -fomit-frame-pointer -Wformat-security -Wmissing-format-attribute conftest.c >&5
configure:29109: $? = 0
configure:29113: test -z
|| test ! -s conftest.err
configure:29116: $? = 0
configure:29119: test -s conftest.o
configure:29122: $? = 0
configure:29124: result: yes
configure:29147: checking for PIE support
configure:29185: rm -rf SunWS_cache; i686-pc-linux-gnu-g++ -o conftest -Wno-long-long -Wundef -ansi -D_XOPEN_SOURCE=500 -D_BSD_SOURCE -Wcast-align -Wconversion -Wchar-subscripts -Wall -W -Wpointer-arith -DNDEBUG -DNO_DEBUG -O2 -march=pentium4 -O2 -pipe -fomit-frame-pointer -Wformat-security -Wmissing-format-attribute -Wno-non-virtual-dtor -fno-exceptions -fno-check-new -fno-common -fpie -pie conftest.cc 1>&5
configure:29191: $? = 0
configure:29195: test -z
|| test ! -s conftest.err
configure:29198: $? = 0
configure:29201: test -s conftest
configure:29204: $? = 0
configure:29226: result: yes
configure:29229: checking if enabling -pie/fpie support
configure:29244: result: yes
configure:29274: checking crt_externs.h usability
configure:29286: i686-pc-linux-gnu-gcc -c -std=iso9899:1990 -W -Wall -Wchar-subscripts -Wshadow -Wpointer-arith -Wmissing-prototypes -Wwrite-strings -D_XOPEN_SOURCE=500 -D_BSD_SOURCE -DNDEBUG -O2 -march=pentium4 -O2 -pipe -fomit-frame-pointer -Wformat-security -Wmissing-format-attribute conftest.c >&5
conftest.c:92:25: error: crt_externs.h: No such file or directory
configure:29292: $? = 1
configure: failed program was:
| /* confdefs.h. */
|
| #define PACKAGE_NAME ""
| #define PACKAGE_TARNAME ""
| #define PACKAGE_VERSION ""
| #define PACKAGE_STRING ""
| #define PACKAGE_BUGREPORT ""
| #define PACKAGE "arts"
| #define VERSION "1.5.0"
| #ifdef __cplusplus
| extern "C" void std::exit (int) throw (); using std::exit;
| #endif
| #define KDELIBSUFF ""
| #define STDC_HEADERS 1
| #define HAVE_SYS_TYPES_H 1
| #define HAVE_SYS_STAT_H 1
| #define HAVE_STDLIB_H 1
| #define HAVE_STRING_H 1
| #define HAVE_MEMORY_H 1
| #define HAVE_STRINGS_H 1
| #define HAVE_INTTYPES_H 1
| #define HAVE_STDINT_H 1
| #define HAVE_UNISTD_H 1
| #define HAVE_DLFCN_H 1
| #define LTDL_SHLIBPATH_VAR "LD_LIBRARY_PATH"
| #define LTDL_SYSSEARCHPATH "/lib:/usr/lib"
| #define LTDL_OBJDIR ".libs/"
| #define HAVE_PRELOADED_SYMBOLS 1
| #define HAVE_LIBDL 1
| #define HAVE_DLERROR 1
| #define HAVE_MALLOC_H 1
| #define HAVE_MEMORY_H 1
| #define HAVE_STDLIB_H 1
| #define HAVE_STDIO_H 1
| #define HAVE_CTYPE_H 1
| #define HAVE_DLFCN_H 1
| #define HAVE_STRING_H 1
| #define HAVE_STRCHR 1
| #define HAVE_STRRCHR 1
| #define HAVE_MEMCPY 1
| #define HAVE_STRCMP 1
| #define HAVE_CRYPT 1
| #define kde_socklen_t socklen_t
| #define ksize_t socklen_t
| #define HAVE_SYS_TYPES_H 1
| #define HAVE_STDINT_H 1
| #define HAVE_SYS_BITYPES_H 1
| #define HAVE_RES_INIT 1
| #define HAVE_RES_INIT 1
| #define HAVE_RES_INIT_PROTO 1
| #define SIZEOF_INT 4
| #define SIZEOF_SHORT 2
| #define SIZEOF_LONG 4
| #define SIZEOF_CHAR_P 4
| #define SIZEOF_SIZE_T 4
| #define SIZEOF_UNSIGNED_LONG 4
| /* end confdefs.h. */
| #include <stdio.h>
| #if HAVE_SYS_TYPES_H
| # include <sys/types.h>
| #endif
| #if HAVE_SYS_STAT_H
| # include <sys/stat.h>
| #endif
| #if STDC_HEADERS
| # include <stdlib.h>
| # include <stddef.h>
| #else
| # if HAVE_STDLIB_H
| # include <stdlib.h>
| # endif
| #endif
| #if HAVE_STRING_H
| # if !STDC_HEADERS && HAVE_MEMORY_H
| # include <memory.h>
| # endif
| # include <string.h>
| #endif
| #if HAVE_STRINGS_H
| # include <strings.h>
| #endif
| #if HAVE_INTTYPES_H
| # include <inttypes.h>
| #else
| # if HAVE_STDINT_H
| # include <stdint.h>
| # endif
| #endif
| #if HAVE_UNISTD_H
| # include <unistd.h>
| #endif
| #include <crt_externs.h>
configure:29315: result: no
configure:29319: checking crt_externs.h presence
configure:29329: i686-pc-linux-gnu-gcc -E conftest.c
conftest.c:58:25: error: crt_externs.h: No such file or directory
configure:29335: $? = 1
configure: failed program was:
| /* confdefs.h. */
|
| #define PACKAGE_NAME ""
| #define PACKAGE_TARNAME ""
| #define PACKAGE_VERSION ""
| #define PACKAGE_STRING ""
| #define PACKAGE_BUGREPORT ""
| #define PACKAGE "arts"
| #define VERSION "1.5.0"
| #ifdef __cplusplus
| extern "C" void std::exit (int) throw (); using std::exit;
| #endif
| #define KDELIBSUFF ""
| #define STDC_HEADERS 1
| #define HAVE_SYS_TYPES_H 1
| #define HAVE_SYS_STAT_H 1
| #define HAVE_STDLIB_H 1
| #define HAVE_STRING_H 1
| #define HAVE_MEMORY_H 1
| #define HAVE_STRINGS_H 1
| #define HAVE_INTTYPES_H 1
| #define HAVE_STDINT_H 1
| #define HAVE_UNISTD_H 1
| #define HAVE_DLFCN_H 1
| #define LTDL_SHLIBPATH_VAR "LD_LIBRARY_PATH"
| #define LTDL_SYSSEARCHPATH "/lib:/usr/lib"
| #define LTDL_OBJDIR ".libs/"
| #define HAVE_PRELOADED_SYMBOLS 1
| #define HAVE_LIBDL 1
| #define HAVE_DLERROR 1
| #define HAVE_MALLOC_H 1
| #define HAVE_MEMORY_H 1
| #define HAVE_STDLIB_H 1
| #define HAVE_STDIO_H 1
| #define HAVE_CTYPE_H 1
| #define HAVE_DLFCN_H 1
| #define HAVE_STRING_H 1
| #define HAVE_STRCHR 1
| #define HAVE_STRRCHR 1
| #define HAVE_MEMCPY 1
| #define HAVE_STRCMP 1
| #define HAVE_CRYPT 1
| #define kde_socklen_t socklen_t
| #define ksize_t socklen_t
| #define HAVE_SYS_TYPES_H 1
| #define HAVE_STDINT_H 1
| #define HAVE_SYS_BITYPES_H 1
| #define HAVE_RES_INIT 1
| #define HAVE_RES_INIT 1
| #define HAVE_RES_INIT_PROTO 1
| #define SIZEOF_INT 4
| #define SIZEOF_SHORT 2
| #define SIZEOF_LONG 4
| #define SIZEOF_CHAR_P 4
| #define SIZEOF_SIZE_T 4
| #define SIZEOF_UNSIGNED_LONG 4
| /* end confdefs.h. */
| #include <crt_externs.h>
configure:29355: result: no
configure:29390: checking for crt_externs.h
configure:29397: result: no
configure:29410: checking for _NSGetEnviron
configure:29467: i686-pc-linux-gnu-gcc -o conftest -std=iso9899:1990 -W -Wall -Wchar-subscripts -Wshadow -Wpointer-arith -Wmissing-prototypes -Wwrite-strings -D_XOPEN_SOURCE=500 -D_BSD_SOURCE -DNDEBUG -O2 -march=pentium4 -O2 -pipe -fomit-frame-pointer -Wformat-security -Wmissing-format-attribute conftest.c >&5
/var/tmp/portage/arts-3.5.0-r1/temp/ccNm1Y2d.o(.text+0x14): In function `main':
: undefined reference to `_NSGetEnviron'
/var/tmp/portage/arts-3.5.0-r1/temp/ccNm1Y2d.o(.data+0x0): undefined reference to `_NSGetEnviron'
collect2: ld returned 1 exit status
configure:29473: $? = 1
configure: failed program was:
| /* confdefs.h. */
|
| #define PACKAGE_NAME ""
| #define PACKAGE_TARNAME ""
| #define PACKAGE_VERSION ""
| #define PACKAGE_STRING ""
| #define PACKAGE_BUGREPORT ""
| #define PACKAGE "arts"
| #define VERSION "1.5.0"
| #ifdef __cplusplus
| extern "C" void std::exit (int) throw (); using std::exit;
| #endif
| #define KDELIBSUFF ""
| #define STDC_HEADERS 1
| #define HAVE_SYS_TYPES_H 1
| #define HAVE_SYS_STAT_H 1
| #define HAVE_STDLIB_H 1
| #define HAVE_STRING_H 1
| #define HAVE_MEMORY_H 1
| #define HAVE_STRINGS_H 1
| #define HAVE_INTTYPES_H 1
| #define HAVE_STDINT_H 1
| #define HAVE_UNISTD_H 1
| #define HAVE_DLFCN_H 1
| #define LTDL_SHLIBPATH_VAR "LD_LIBRARY_PATH"
| #define LTDL_SYSSEARCHPATH "/lib:/usr/lib"
| #define LTDL_OBJDIR ".libs/"
| #define HAVE_PRELOADED_SYMBOLS 1
| #define HAVE_LIBDL 1
| #define HAVE_DLERROR 1
| #define HAVE_MALLOC_H 1
| #define HAVE_MEMORY_H 1
| #define HAVE_STDLIB_H 1
| #define HAVE_STDIO_H 1
| #define HAVE_CTYPE_H 1
| #define HAVE_DLFCN_H 1
| #define HAVE_STRING_H 1
| #define HAVE_STRCHR 1
| #define HAVE_STRRCHR 1
| #define HAVE_MEMCPY 1
| #define HAVE_STRCMP 1
| #define HAVE_CRYPT 1
| #define kde_socklen_t socklen_t
| #define ksize_t socklen_t
| #define HAVE_SYS_TYPES_H 1
| #define HAVE_STDINT_H 1
| #define HAVE_SYS_BITYPES_H 1
| #define HAVE_RES_INIT 1
| #define HAVE_RES_INIT 1
| #define HAVE_RES_INIT_PROTO 1
| #define SIZEOF_INT 4
| #define SIZEOF_SHORT 2
| #define SIZEOF_LONG 4
| #define SIZEOF_CHAR_P 4
| #define SIZEOF_SIZE_T 4
| #define SIZEOF_UNSIGNED_LONG 4
| /* end confdefs.h. */
| /* Define _NSGetEnviron to an innocuous variant, in case <limits.h> declares _NSGetEnviron.
| For example, HP-UX 11i <limits.h> declares gettimeofday. */
| #define _NSGetEnviron innocuous__NSGetEnviron
|
| /* System header to define __stub macros and hopefully few prototypes,
| which can conflict with char _NSGetEnviron (); below.
| Prefer <limits.h> to <assert.h> if __STDC__ is defined, since
| <limits.h> exists even on freestanding compilers. */
|
| #ifdef __STDC__
| # include <limits.h>
| #else
| # include <assert.h>
| #endif
|
| #undef _NSGetEnviron
|
| /* Override any gcc2 internal prototype to avoid an error. */
| #ifdef __cplusplus
| extern "C"
| {
| #endif
| /* We use char because int might match the return type of a gcc2
| builtin and then its argument prototype would still apply. */
| char _NSGetEnviron ();
| /* The GNU C library defines this for functions which it implements
| to always fail with ENOSYS. Some functions are actually named
| something starting with __ and the normal name is an alias. */
| #if defined (__stub__NSGetEnviron) || defined (__stub____NSGetEnviron)
| choke me
| #else
| char (*f) () = _NSGetEnviron;
| #endif
| #ifdef __cplusplus
| }
| #endif
|
| int
| main ()
| {
| return f != _NSGetEnviron;
| ;
| return 0;
| }
configure:29498: result: no
configure:29520: checking for vsnprintf
configure:29577: i686-pc-linux-gnu-gcc -o conftest -std=iso9899:1990 -W -Wall -Wchar-subscripts -Wshadow -Wpointer-arith -Wmissing-prototypes -Wwrite-strings -D_XOPEN_SOURCE=500 -D_BSD_SOURCE -DNDEBUG -O2 -march=pentium4 -O2 -pipe -fomit-frame-pointer -Wformat-security -Wmissing-format-attribute conftest.c >&5
configure:29583: $? = 0
configure:29587: test -z
|| test ! -s conftest.err
configure:29590: $? = 0
configure:29593: test -s conftest
configure:29596: $? = 0
configure:29608: result: yes
configure:29520: checking for snprintf
configure:29577: i686-pc-linux-gnu-gcc -o conftest -std=iso9899:1990 -W -Wall -Wchar-subscripts -Wshadow -Wpointer-arith -Wmissing-prototypes -Wwrite-strings -D_XOPEN_SOURCE=500 -D_BSD_SOURCE -DNDEBUG -O2 -march=pentium4 -O2 -pipe -fomit-frame-pointer -Wformat-security -Wmissing-format-attribute conftest.c >&5
configure:29583: $? = 0
configure:29587: test -z
|| test ! -s conftest.err
configure:29590: $? = 0
configure:29593: test -s conftest
configure:29596: $? = 0
configure:29608: result: yes
configure:29709: checking if Qt compiles without flags
configure:29806: rm -rf SunWS_cache; i686-pc-linux-gnu-g++ -o conftest -Wno-long-long -Wundef -ansi -D_XOPEN_SOURCE=500 -D_BSD_SOURCE -Wcast-align -Wconversion -Wchar-subscripts -Wall -W -Wpointer-arith -DNDEBUG -DNO_DEBUG -O2 -march=pentium4 -O2 -pipe -fomit-frame-pointer -Wformat-security -Wmissing-format-attribute -Wno-non-virtual-dtor -fno-exceptions -fno-check-new -fno-common -I conftest.cc -lXext -lX11 1>&5
/usr/lib/gcc/i686-pc-linux-gnu/4.0.1/../../../crt1.o(.text+0x18): In function `_start':
: undefined reference to `main'
collect2: ld returned 1 exit status
configure:29809: $? = 1
configure: failed program was:
#include "confdefs.h"
#include <qglobal.h>
#include <qapplication.h>
#include <qcursor.h>
#include <qstylefactory.h>
#include <private/qucomextra_p.h>
#if ! (QT_VERSION >= 0x030300 && QT_VERSION < 0x040000)
#error 1
#endif
int main() {
(void)QStyleFactory::create(QString::null);
QCursor c(Qt::WhatsThisCursor);
return 0;
}
configure:29842: result: no
configure:29851: checking grepping for visibility push/pop in headers
configure:29878: result: yes
configure:29904: checking whether i686-pc-linux-gnu-g++ supports -fvisibility=hidden
configure:30189: result: no
configure:30214: checking if C++ programs can be compiled
configure:30243: i686-pc-linux-gnu-g++ -c -Wno-long-long -Wundef -ansi -D_XOPEN_SOURCE=500 -D_BSD_SOURCE -Wcast-align -Wconversion -Wchar-subscripts -Wall -W -Wpointer-arith -DNDEBUG -DNO_DEBUG -O2 -march=pentium4 -O2 -pipe -fomit-frame-pointer -Wformat-security -Wmissing-format-attribute -Wno-non-virtual-dtor -fno-check-new -fno-common conftest.cc >&5
configure:30249: $? = 0
configure:30253: test -z
|| test ! -s conftest.err
configure:30256: $? = 0
configure:30259: test -s conftest.o
configure:30262: $? = 0
configure:30276: result: yes
configure:30312: checking for dirent.h that defines DIR
configure:30336: i686-pc-linux-gnu-gcc -c -std=iso9899:1990 -W -Wall -Wchar-subscripts -Wshadow -Wpointer-arith -Wmissing-prototypes -Wwrite-strings -D_XOPEN_SOURCE=500 -D_BSD_SOURCE -DNDEBUG -O2 -march=pentium4 -O2 -pipe -fomit-frame-pointer -Wformat-security -Wmissing-format-attribute conftest.c >&5
configure:30342: $? = 0
configure:30346: test -z
|| test ! -s conftest.err
configure:30349: $? = 0
configure:30352: test -s conftest.o
configure:30355: $? = 0
configure:30366: result: yes
configure:30379: checking for library containing opendir
configure:30409: i686-pc-linux-gnu-gcc -o conftest -std=iso9899:1990 -W -Wall -Wchar-subscripts -Wshadow -Wpointer-arith -Wmissing-prototypes -Wwrite-strings -D_XOPEN_SOURCE=500 -D_BSD_SOURCE -DNDEBUG -O2 -march=pentium4 -O2 -pipe -fomit-frame-pointer -Wformat-security -Wmissing-format-attribute conftest.c >&5
configure:30415: $? = 0
configure:30419: test -z
|| test ! -s conftest.err
configure:30422: $? = 0
configure:30425: test -s conftest
configure:30428: $? = 0
configure:30498: result: none required
configure:30634: checking for ANSI C header files
configure:30790: result: yes
configure:30834: checking fcntl.h usability
configure:30846: i686-pc-linux-gnu-gcc -c -std=iso9899:1990 -W -Wall -Wchar-subscripts -Wshadow -Wpointer-arith -Wmissing-prototypes -Wwrite-strings -D_XOPEN_SOURCE=500 -D_BSD_SOURCE -DNDEBUG -O2 -march=pentium4 -O2 -pipe -fomit-frame-pointer -Wformat-security -Wmissing-format-attribute conftest.c >&5
configure:30852: $? = 0
configure:30856: test -z
|| test ! -s conftest.err
configure:30859: $? = 0
configure:30862: test -s conftest.o
configure:30865: $? = 0
configure:30875: result: yes
configure:30879: checking fcntl.h presence
configure:30889: i686-pc-linux-gnu-gcc -E conftest.c
configure:30895: $? = 0
configure:30915: result: yes
configure:30950: checking for fcntl.h
configure:30957: result: yes
configure:30834: checking sys/time.h usability
configure:30846: i686-pc-linux-gnu-gcc -c -std=iso9899:1990 -W -Wall -Wchar-subscripts -Wshadow -Wpointer-arith -Wmissing-prototypes -Wwrite-strings -D_XOPEN_SOURCE=500 -D_BSD_SOURCE -DNDEBUG -O2 -march=pentium4 -O2 -pipe -fomit-frame-pointer -Wformat-security -Wmissing-format-attribute conftest.c >&5
configure:30852: $? = 0
configure:30856: test -z
|| test ! -s conftest.err
configure:30859: $? = 0
configure:30862: test -s conftest.o
configure:30865: $? = 0
configure:30875: result: yes
configure:30879: checking sys/time.h presence
configure:30889: i686-pc-linux-gnu-gcc -E conftest.c
configure:30895: $? = 0
configure:30915: result: yes
configure:30950: checking for sys/time.h
configure:30957: result: yes
configure:30825: checking for unistd.h
configure:30830: result: yes
configure:30834: checking sys/cdefs.h usability
configure:30846: i686-pc-linux-gnu-gcc -c -std=iso9899:1990 -W -Wall -Wchar-subscripts -Wshadow -Wpointer-arith -Wmissing-prototypes -Wwrite-strings -D_XOPEN_SOURCE=500 -D_BSD_SOURCE -DNDEBUG -O2 -march=pentium4 -O2 -pipe -fomit-frame-pointer -Wformat-security -Wmissing-format-attribute conftest.c >&5
configure:30852: $? = 0
configure:30856: test -z
|| test ! -s conftest.err
configure:30859: $? = 0
configure:30862: test -s conftest.o
configure:30865: $? = 0
configure:30875: result: yes
configure:30879: checking sys/cdefs.h presence
configure:30889: i686-pc-linux-gnu-gcc -E conftest.c
configure:30895: $? = 0
configure:30915: result: yes
configure:30950: checking for sys/cdefs.h
configure:30957: result: yes
configure:30834: checking fnmatch.h usability
configure:30846: i686-pc-linux-gnu-gcc -c -std=iso9899:1990 -W -Wall -Wchar-subscripts -Wshadow -Wpointer-arith -Wmissing-prototypes -Wwrite-strings -D_XOPEN_SOURCE=500 -D_BSD_SOURCE -DNDEBUG -O2 -march=pentium4 -O2 -pipe -fomit-frame-pointer -Wformat-security -Wmissing-format-attribute conftest.c >&5
configure:30852: $? = 0
configure:30856: test -z
|| test ! -s conftest.err
configure:30859: $? = 0
configure:30862: test -s conftest.o
configure:30865: $? = 0
configure:30875: result: yes
configure:30879: checking fnmatch.h presence
configure:30889: i686-pc-linux-gnu-gcc -E conftest.c
configure:30895: $? = 0
configure:30915: result: yes
configure:30950: checking for fnmatch.h
configure:30957: result: yes
configure:30834: checking sysent.h usability
configure:30846: i686-pc-linux-gnu-gcc -c -std=iso9899:1990 -W -Wall -Wchar-subscripts -Wshadow -Wpointer-arith -Wmissing-prototypes -Wwrite-strings -D_XOPEN_SOURCE=500 -D_BSD_SOURCE -DNDEBUG -O2 -march=pentium4 -O2 -pipe -fomit-frame-pointer -Wformat-security -Wmissing-format-attribute conftest.c >&5
conftest.c:102:20: error: sysent.h: No such file or directory
configure:30852: $? = 1
configure: failed program was:
| /* confdefs.h. */
|
| #define PACKAGE_NAME ""
| #define PACKAGE_TARNAME ""
| #define PACKAGE_VERSION ""
| #define PACKAGE_STRING ""
| #define PACKAGE_BUGREPORT ""
| #define PACKAGE "arts"
| #define VERSION "1.5.0"
| #ifdef __cplusplus
| extern "C" void std::exit (int) throw (); using std::exit;
| #endif
| #define KDELIBSUFF ""
| #define STDC_HEADERS 1
| #define HAVE_SYS_TYPES_H 1
| #define HAVE_SYS_STAT_H 1
| #define HAVE_STDLIB_H 1
| #define HAVE_STRING_H 1
| #define HAVE_MEMORY_H 1
| #define HAVE_STRINGS_H 1
| #define HAVE_INTTYPES_H 1
| #define HAVE_STDINT_H 1
| #define HAVE_UNISTD_H 1
| #define HAVE_DLFCN_H 1
| #define LTDL_SHLIBPATH_VAR "LD_LIBRARY_PATH"
| #define LTDL_SYSSEARCHPATH "/lib:/usr/lib"
| #define LTDL_OBJDIR ".libs/"
| #define HAVE_PRELOADED_SYMBOLS 1
| #define HAVE_LIBDL 1
| #define HAVE_DLERROR 1
| #define HAVE_MALLOC_H 1
| #define HAVE_MEMORY_H 1
| #define HAVE_STDLIB_H 1
| #define HAVE_STDIO_H 1
| #define HAVE_CTYPE_H 1
| #define HAVE_DLFCN_H 1
| #define HAVE_STRING_H 1
| #define HAVE_STRCHR 1
| #define HAVE_STRRCHR 1
| #define HAVE_MEMCPY 1
| #define HAVE_STRCMP 1
| #define HAVE_CRYPT 1
| #define kde_socklen_t socklen_t
| #define ksize_t socklen_t
| #define HAVE_SYS_TYPES_H 1
| #define HAVE_STDINT_H 1
| #define HAVE_SYS_BITYPES_H 1
| #define HAVE_RES_INIT 1
| #define HAVE_RES_INIT 1
| #define HAVE_RES_INIT_PROTO 1
| #define SIZEOF_INT 4
| #define SIZEOF_SHORT 2
| #define SIZEOF_LONG 4
| #define SIZEOF_CHAR_P 4
| #define SIZEOF_SIZE_T 4
| #define SIZEOF_UNSIGNED_LONG 4
| #define HAVE_VSNPRINTF 1
| #define HAVE_SNPRINTF 1
| #define HAVE_SGI_STL 1
| #define HAVE_DIRENT_H 1
| #define STDC_HEADERS 1
| #define HAVE_FCNTL_H 1
| #define HAVE_SYS_TIME_H 1
| #define HAVE_UNISTD_H 1
| #define HAVE_SYS_CDEFS_H 1
| #define HAVE_FNMATCH_H 1
| /* end confdefs.h. */
| #include <stdio.h>
| #if HAVE_SYS_TYPES_H
| # include <sys/types.h>
| #endif
| #if HAVE_SYS_STAT_H
| # include <sys/stat.h>
| #endif
| #if STDC_HEADERS
| # include <stdlib.h>
| # include <stddef.h>
| #else
| # if HAVE_STDLIB_H
| # include <stdlib.h>
| # endif
| #endif
| #if HAVE_STRING_H
| # if !STDC_HEADERS && HAVE_MEMORY_H
| # include <memory.h>
| # endif
| # include <string.h>
| #endif
| #if HAVE_STRINGS_H
| # include <strings.h>
| #endif
| #if HAVE_INTTYPES_H
| # include <inttypes.h>
| #else
| # if HAVE_STDINT_H
| # include <stdint.h>
| # endif
| #endif
| #if HAVE_UNISTD_H
| # include <unistd.h>
| #endif
| #include <sysent.h>
configure:30875: result: no
configure:30879: checking sysent.h presence
configure:30889: i686-pc-linux-gnu-gcc -E conftest.c
conftest.c:68:20: error: sysent.h: No such file or directory
configure:30895: $? = 1
configure: failed program was:
| /* confdefs.h. */
|
| #define PACKAGE_NAME ""
| #define PACKAGE_TARNAME ""
| #define PACKAGE_VERSION ""
| #define PACKAGE_STRING ""
| #define PACKAGE_BUGREPORT ""
| #define PACKAGE "arts"
| #define VERSION "1.5.0"
| #ifdef __cplusplus
| extern "C" void std::exit (int) throw (); using std::exit;
| #endif
| #define KDELIBSUFF ""
| #define STDC_HEADERS 1
| #define HAVE_SYS_TYPES_H 1
| #define HAVE_SYS_STAT_H 1
| #define HAVE_STDLIB_H 1
| #define HAVE_STRING_H 1
| #define HAVE_MEMORY_H 1
| #define HAVE_STRINGS_H 1
| #define HAVE_INTTYPES_H 1
| #define HAVE_STDINT_H 1
| #define HAVE_UNISTD_H 1
| #define HAVE_DLFCN_H 1
| #define LTDL_SHLIBPATH_VAR "LD_LIBRARY_PATH"
| #define LTDL_SYSSEARCHPATH "/lib:/usr/lib"
| #define LTDL_OBJDIR ".libs/"
| #define HAVE_PRELOADED_SYMBOLS 1
| #define HAVE_LIBDL 1
| #define HAVE_DLERROR 1
| #define HAVE_MALLOC_H 1
| #define HAVE_MEMORY_H 1
| #define HAVE_STDLIB_H 1
| #define HAVE_STDIO_H 1
| #define HAVE_CTYPE_H 1
| #define HAVE_DLFCN_H 1
| #define HAVE_STRING_H 1
| #define HAVE_STRCHR 1
| #define HAVE_STRRCHR 1
| #define HAVE_MEMCPY 1
| #define HAVE_STRCMP 1
| #define HAVE_CRYPT 1
| #define kde_socklen_t socklen_t
| #define ksize_t socklen_t
| #define HAVE_SYS_TYPES_H 1
| #define HAVE_STDINT_H 1
| #define HAVE_SYS_BITYPES_H 1
| #define HAVE_RES_INIT 1
| #define HAVE_RES_INIT 1
| #define HAVE_RES_INIT_PROTO 1
| #define SIZEOF_INT 4
| #define SIZEOF_SHORT 2
| #define SIZEOF_LONG 4
| #define SIZEOF_CHAR_P 4
| #define SIZEOF_SIZE_T 4
| #define SIZEOF_UNSIGNED_LONG 4
| #define HAVE_VSNPRINTF 1
| #define HAVE_SNPRINTF 1
| #define HAVE_SGI_STL 1
| #define HAVE_DIRENT_H 1
| #define STDC_HEADERS 1
| #define HAVE_FCNTL_H 1
| #define HAVE_SYS_TIME_H 1
| #define HAVE_UNISTD_H 1
| #define HAVE_SYS_CDEFS_H 1
| #define HAVE_FNMATCH_H 1
| /* end confdefs.h. */
| #include <sysent.h>
configure:30915: result: no
configure:30950: checking for sysent.h
configure:30957: result: no
configure:30825: checking for strings.h
configure:30830: result: yes
configure:30825: checking for sys/stat.h
configure:30830: result: yes
configure:30834: checking sys/select.h usability
configure:30846: i686-pc-linux-gnu-gcc -c -std=iso9899:1990 -W -Wall -Wchar-subscripts -Wshadow -Wpointer-arith -Wmissing-prototypes -Wwrite-strings -D_XOPEN_SOURCE=500 -D_BSD_SOURCE -DNDEBUG -O2 -march=pentium4 -O2 -pipe -fomit-frame-pointer -Wformat-security -Wmissing-format-attribute conftest.c >&5
configure:30852: $? = 0
configure:30856: test -z
|| test ! -s conftest.err
configure:30859: $? = 0
configure:30862: test -s conftest.o
configure:30865: $? = 0
configure:30875: result: yes
configure:30879: checking sys/select.h presence
configure:30889: i686-pc-linux-gnu-gcc -E conftest.c
configure:30895: $? = 0
configure:30915: result: yes
configure:30950: checking for sys/select.h
configure:30957: result: yes
configure:30834: checking sys/socket.h usability
configure:30846: i686-pc-linux-gnu-gcc -c -std=iso9899:1990 -W -Wall -Wchar-subscripts -Wshadow -Wpointer-arith -Wmissing-prototypes -Wwrite-strings -D_XOPEN_SOURCE=500 -D_BSD_SOURCE -DNDEBUG -O2 -march=pentium4 -O2 -pipe -fomit-frame-pointer -Wformat-security -Wmissing-format-attribute conftest.c >&5
configure:30852: $? = 0
configure:30856: test -z
|| test ! -s conftest.err
configure:30859: $? = 0
configure:30862: test -s conftest.o
configure:30865: $? = 0
configure:30875: result: yes
configure:30879: checking sys/socket.h presence
configure:30889: i686-pc-linux-gnu-gcc -E conftest.c
configure:30895: $? = 0
configure:30915: result: yes
configure:30950: checking for sys/socket.h
configure:30957: result: yes
configure:30834: checking linux/socket.h usability
configure:30846: i686-pc-linux-gnu-gcc -c -std=iso9899:1990 -W -Wall -Wchar-subscripts -Wshadow -Wpointer-arith -Wmissing-prototypes -Wwrite-strings -D_XOPEN_SOURCE=500 -D_BSD_SOURCE -DNDEBUG -O2 -march=pentium4 -O2 -pipe -fomit-frame-pointer -Wformat-security -Wmissing-format-attribute conftest.c >&5
configure:30852: $? = 0
configure:30856: test -z
|| test ! -s conftest.err
configure:30859: $? = 0
configure:30862: test -s conftest.o
configure:30865: $? = 0
configure:30875: result: yes
configure:30879: checking linux/socket.h presence
configure:30889: i686-pc-linux-gnu-gcc -E conftest.c
configure:30895: $? = 0
configure:30915: result: yes
configure:30950: checking for linux/socket.h
configure:30957: result: yes
configure:30834: checking socketbits.h usability
configure:30846: i686-pc-linux-gnu-gcc -c -std=iso9899:1990 -W -Wall -Wchar-subscripts -Wshadow -Wpointer-arith -Wmissing-prototypes -Wwrite-strings -D_XOPEN_SOURCE=500 -D_BSD_SOURCE -DNDEBUG -O2 -march=pentium4 -O2 -pipe -fomit-frame-pointer -Wformat-security -Wmissing-format-attribute conftest.c >&5
conftest.c:107:24: error: socketbits.h: No such file or directory
configure:30852: $? = 1
configure: failed program was:
| /* confdefs.h. */
|
| #define PACKAGE_NAME ""
| #define PACKAGE_TARNAME ""
| #define PACKAGE_VERSION ""
| #define PACKAGE_STRING ""
| #define PACKAGE_BUGREPORT ""
| #define PACKAGE "arts"
| #define VERSION "1.5.0"
| #ifdef __cplusplus
| extern "C" void std::exit (int) throw (); using std::exit;
| #endif
| #define KDELIBSUFF ""
| #define STDC_HEADERS 1
| #define HAVE_SYS_TYPES_H 1
| #define HAVE_SYS_STAT_H 1
| #define HAVE_STDLIB_H 1
| #define HAVE_STRING_H 1
| #define HAVE_MEMORY_H 1
| #define HAVE_STRINGS_H 1
| #define HAVE_INTTYPES_H 1
| #define HAVE_STDINT_H 1
| #define HAVE_UNISTD_H 1
| #define HAVE_DLFCN_H 1
| #define LTDL_SHLIBPATH_VAR "LD_LIBRARY_PATH"
| #define LTDL_SYSSEARCHPATH "/lib:/usr/lib"
| #define LTDL_OBJDIR ".libs/"
| #define HAVE_PRELOADED_SYMBOLS 1
| #define HAVE_LIBDL 1
| #define HAVE_DLERROR 1
| #define HAVE_MALLOC_H 1
| #define HAVE_MEMORY_H 1
| #define HAVE_STDLIB_H 1
| #define HAVE_STDIO_H 1
| #define HAVE_CTYPE_H 1
| #define HAVE_DLFCN_H 1
| #define HAVE_STRING_H 1
| #define HAVE_STRCHR 1
| #define HAVE_STRRCHR 1
| #define HAVE_MEMCPY 1
| #define HAVE_STRCMP 1
| #define HAVE_CRYPT 1
| #define kde_socklen_t socklen_t
| #define ksize_t socklen_t
| #define HAVE_SYS_TYPES_H 1
| #define HAVE_STDINT_H 1
| #define HAVE_SYS_BITYPES_H 1
| #define HAVE_RES_INIT 1
| #define HAVE_RES_INIT 1
| #define HAVE_RES_INIT_PROTO 1
| #define SIZEOF_INT 4
| #define SIZEOF_SHORT 2
| #define SIZEOF_LONG 4
| #define SIZEOF_CHAR_P 4
| #define SIZEOF_SIZE_T 4
| #define SIZEOF_UNSIGNED_LONG 4
| #define HAVE_VSNPRINTF 1
| #define HAVE_SNPRINTF 1
| #define HAVE_SGI_STL 1
| #define HAVE_DIRENT_H 1
| #define STDC_HEADERS 1
| #define HAVE_FCNTL_H 1
| #define HAVE_SYS_TIME_H 1
| #define HAVE_UNISTD_H 1
| #define HAVE_SYS_CDEFS_H 1
| #define HAVE_FNMATCH_H 1
| #define HAVE_STRINGS_H 1
| #define HAVE_SYS_STAT_H 1
| #define HAVE_SYS_SELECT_H 1
| #define HAVE_SYS_SOCKET_H 1
| #define HAVE_LINUX_SOCKET_H 1
| /* end confdefs.h. */
| #include <stdio.h>
| #if HAVE_SYS_TYPES_H
| # include <sys/types.h>
| #endif
| #if HAVE_SYS_STAT_H
| # include <sys/stat.h>
| #endif
| #if STDC_HEADERS
| # include <stdlib.h>
| # include <stddef.h>
| #else
| # if HAVE_STDLIB_H
| # include <stdlib.h>
| # endif
| #endif
| #if HAVE_STRING_H
| # if !STDC_HEADERS && HAVE_MEMORY_H
| # include <memory.h>
| # endif
| # include <string.h>
| #endif
| #if HAVE_STRINGS_H
| # include <strings.h>
| #endif
| #if HAVE_INTTYPES_H
| # include <inttypes.h>
| #else
| # if HAVE_STDINT_H
| # include <stdint.h>
| # endif
| #endif
| #if HAVE_UNISTD_H
| # include <unistd.h>
| #endif
| #include <socketbits.h>
configure:30875: result: no
configure:30879: checking socketbits.h presence
configure:30889: i686-pc-linux-gnu-gcc -E conftest.c
conftest.c:73:24: error: socketbits.h: No such file or directory
configure:30895: $? = 1
configure: failed program was:
| /* confdefs.h. */
|
| #define PACKAGE_NAME ""
| #define PACKAGE_TARNAME ""
| #define PACKAGE_VERSION ""
| #define PACKAGE_STRING ""
| #define PACKAGE_BUGREPORT ""
| #define PACKAGE "arts"
| #define VERSION "1.5.0"
| #ifdef __cplusplus
| extern "C" void std::exit (int) throw (); using std::exit;
| #endif
| #define KDELIBSUFF ""
| #define STDC_HEADERS 1
| #define HAVE_SYS_TYPES_H 1
| #define HAVE_SYS_STAT_H 1
| #define HAVE_STDLIB_H 1
| #define HAVE_STRING_H 1
| #define HAVE_MEMORY_H 1
| #define HAVE_STRINGS_H 1
| #define HAVE_INTTYPES_H 1
| #define HAVE_STDINT_H 1
| #define HAVE_UNISTD_H 1
| #define HAVE_DLFCN_H 1
| #define LTDL_SHLIBPATH_VAR "LD_LIBRARY_PATH"
| #define LTDL_SYSSEARCHPATH "/lib:/usr/lib"
| #define LTDL_OBJDIR ".libs/"
| #define HAVE_PRELOADED_SYMBOLS 1
| #define HAVE_LIBDL 1
| #define HAVE_DLERROR 1
| #define HAVE_MALLOC_H 1
| #define HAVE_MEMORY_H 1
| #define HAVE_STDLIB_H 1
| #define HAVE_STDIO_H 1
| #define HAVE_CTYPE_H 1
| #define HAVE_DLFCN_H 1
| #define HAVE_STRING_H 1
| #define HAVE_STRCHR 1
| #define HAVE_STRRCHR 1
| #define HAVE_MEMCPY 1
| #define HAVE_STRCMP 1
| #define HAVE_CRYPT 1
| #define kde_socklen_t socklen_t
| #define ksize_t socklen_t
| #define HAVE_SYS_TYPES_H 1
| #define HAVE_STDINT_H 1
| #define HAVE_SYS_BITYPES_H 1
| #define HAVE_RES_INIT 1
| #define HAVE_RES_INIT 1
| #define HAVE_RES_INIT_PROTO 1
| #define SIZEOF_INT 4
| #define SIZEOF_SHORT 2
| #define SIZEOF_LONG 4
| #define SIZEOF_CHAR_P 4
| #define SIZEOF_SIZE_T 4
| #define SIZEOF_UNSIGNED_LONG 4
| #define HAVE_VSNPRINTF 1
| #define HAVE_SNPRINTF 1
| #define HAVE_SGI_STL 1
| #define HAVE_DIRENT_H 1
| #define STDC_HEADERS 1
| #define HAVE_FCNTL_H 1
| #define HAVE_SYS_TIME_H 1
| #define HAVE_UNISTD_H 1
| #define HAVE_SYS_CDEFS_H 1
| #define HAVE_FNMATCH_H 1
| #define HAVE_STRINGS_H 1
| #define HAVE_SYS_STAT_H 1
| #define HAVE_SYS_SELECT_H 1
| #define HAVE_SYS_SOCKET_H 1
| #define HAVE_LINUX_SOCKET_H 1
| /* end confdefs.h. */
| #include <socketbits.h>
configure:30915: result: no
configure:30950: checking for socketbits.h
configure:30957: result: no
configure:30834: checking sigaction.h usability
configure:30846: i686-pc-linux-gnu-gcc -c -std=iso9899:1990 -W -Wall -Wchar-subscripts -Wshadow -Wpointer-arith -Wmissing-prototypes -Wwrite-strings -D_XOPEN_SOURCE=500 -D_BSD_SOURCE -DNDEBUG -O2 -march=pentium4 -O2 -pipe -fomit-frame-pointer -Wformat-security -Wmissing-format-attribute conftest.c >&5
conftest.c:107:23: error: sigaction.h: No such file or directory
configure:30852: $? = 1
configure: failed program was:
| /* confdefs.h. */
|
| #define PACKAGE_NAME ""
| #define PACKAGE_TARNAME ""
| #define PACKAGE_VERSION ""
| #define PACKAGE_STRING ""
| #define PACKAGE_BUGREPORT ""
| #define PACKAGE "arts"
| #define VERSION "1.5.0"
| #ifdef __cplusplus
| extern "C" void std::exit (int) throw (); using std::exit;
| #endif
| #define KDELIBSUFF ""
| #define STDC_HEADERS 1
| #define HAVE_SYS_TYPES_H 1
| #define HAVE_SYS_STAT_H 1
| #define HAVE_STDLIB_H 1
| #define HAVE_STRING_H 1
| #define HAVE_MEMORY_H 1
| #define HAVE_STRINGS_H 1
| #define HAVE_INTTYPES_H 1
| #define HAVE_STDINT_H 1
| #define HAVE_UNISTD_H 1
| #define HAVE_DLFCN_H 1
| #define LTDL_SHLIBPATH_VAR "LD_LIBRARY_PATH"
| #define LTDL_SYSSEARCHPATH "/lib:/usr/lib"
| #define LTDL_OBJDIR ".libs/"
| #define HAVE_PRELOADED_SYMBOLS 1
| #define HAVE_LIBDL 1
| #define HAVE_DLERROR 1
| #define HAVE_MALLOC_H 1
| #define HAVE_MEMORY_H 1
| #define HAVE_STDLIB_H 1
| #define HAVE_STDIO_H 1
| #define HAVE_CTYPE_H 1
| #define HAVE_DLFCN_H 1
| #define HAVE_STRING_H 1
| #define HAVE_STRCHR 1
| #define HAVE_STRRCHR 1
| #define HAVE_MEMCPY 1
| #define HAVE_STRCMP 1
| #define HAVE_CRYPT 1
| #define kde_socklen_t socklen_t
| #define ksize_t socklen_t
| #define HAVE_SYS_TYPES_H 1
| #define HAVE_STDINT_H 1
| #define HAVE_SYS_BITYPES_H 1
| #define HAVE_RES_INIT 1
| #define HAVE_RES_INIT 1
| #define HAVE_RES_INIT_PROTO 1
| #define SIZEOF_INT 4
| #define SIZEOF_SHORT 2
| #define SIZEOF_LONG 4
| #define SIZEOF_CHAR_P 4
| #define SIZEOF_SIZE_T 4
| #define SIZEOF_UNSIGNED_LONG 4
| #define HAVE_VSNPRINTF 1
| #define HAVE_SNPRINTF 1
| #define HAVE_SGI_STL 1
| #define HAVE_DIRENT_H 1
| #define STDC_HEADERS 1
| #define HAVE_FCNTL_H 1
| #define HAVE_SYS_TIME_H 1
| #define HAVE_UNISTD_H 1
| #define HAVE_SYS_CDEFS_H 1
| #define HAVE_FNMATCH_H 1
| #define HAVE_STRINGS_H 1
| #define HAVE_SYS_STAT_H 1
| #define HAVE_SYS_SELECT_H 1
| #define HAVE_SYS_SOCKET_H 1
| #define HAVE_LINUX_SOCKET_H 1
| /* end confdefs.h. */
| #include <stdio.h>
| #if HAVE_SYS_TYPES_H
| # include <sys/types.h>
| #endif
| #if HAVE_SYS_STAT_H
| # include <sys/stat.h>
| #endif
| #if STDC_HEADERS
| # include <stdlib.h>
| # include <stddef.h>
| #else
| # if HAVE_STDLIB_H
| # include <stdlib.h>
| # endif
| #endif
| #if HAVE_STRING_H
| # if !STDC_HEADERS && HAVE_MEMORY_H
| # include <memory.h>
| # endif
| # include <string.h>
| #endif
| #if HAVE_STRINGS_H
| # include <strings.h>
| #endif
| #if HAVE_INTTYPES_H
| # include <inttypes.h>
| #else
| # if HAVE_STDINT_H
| # include <stdint.h>
| # endif
| #endif
| #if HAVE_UNISTD_H
| # include <unistd.h>
| #endif
| #include <sigaction.h>
configure:30875: result: no
configure:30879: checking sigaction.h presence
configure:30889: i686-pc-linux-gnu-gcc -E conftest.c
conftest.c:73:23: error: sigaction.h: No such file or directory
configure:30895: $? = 1
configure: failed program was:
| /* confdefs.h. */
|
| #define PACKAGE_NAME ""
| #define PACKAGE_TARNAME ""
| #define PACKAGE_VERSION ""
| #define PACKAGE_STRING ""
| #define PACKAGE_BUGREPORT ""
| #define PACKAGE "arts"
| #define VERSION "1.5.0"
| #ifdef __cplusplus
| extern "C" void std::exit (int) throw (); using std::exit;
| #endif
| #define KDELIBSUFF ""
| #define STDC_HEADERS 1
| #define HAVE_SYS_TYPES_H 1
| #define HAVE_SYS_STAT_H 1
| #define HAVE_STDLIB_H 1
| #define HAVE_STRING_H 1
| #define HAVE_MEMORY_H 1
| #define HAVE_STRINGS_H 1
| #define HAVE_INTTYPES_H 1
| #define HAVE_STDINT_H 1
| #define HAVE_UNISTD_H 1
| #define HAVE_DLFCN_H 1
| #define LTDL_SHLIBPATH_VAR "LD_LIBRARY_PATH"
| #define LTDL_SYSSEARCHPATH "/lib:/usr/lib"
| #define LTDL_OBJDIR ".libs/"
| #define HAVE_PRELOADED_SYMBOLS 1
| #define HAVE_LIBDL 1
| #define HAVE_DLERROR 1
| #define HAVE_MALLOC_H 1
| #define HAVE_MEMORY_H 1
| #define HAVE_STDLIB_H 1
| #define HAVE_STDIO_H 1
| #define HAVE_CTYPE_H 1
| #define HAVE_DLFCN_H 1
| #define HAVE_STRING_H 1
| #define HAVE_STRCHR 1
| #define HAVE_STRRCHR 1
| #define HAVE_MEMCPY 1
| #define HAVE_STRCMP 1
| #define HAVE_CRYPT 1
| #define kde_socklen_t socklen_t
| #define ksize_t socklen_t
| #define HAVE_SYS_TYPES_H 1
| #define HAVE_STDINT_H 1
| #define HAVE_SYS_BITYPES_H 1
| #define HAVE_RES_INIT 1
| #define HAVE_RES_INIT 1
| #define HAVE_RES_INIT_PROTO 1
| #define SIZEOF_INT 4
| #define SIZEOF_SHORT 2
| #define SIZEOF_LONG 4
| #define SIZEOF_CHAR_P 4
| #define SIZEOF_SIZE_T 4
| #define SIZEOF_UNSIGNED_LONG 4
| #define HAVE_VSNPRINTF 1
| #define HAVE_SNPRINTF 1
| #define HAVE_SGI_STL 1
| #define HAVE_DIRENT_H 1
| #define STDC_HEADERS 1
| #define HAVE_FCNTL_H 1
| #define HAVE_SYS_TIME_H 1
| #define HAVE_UNISTD_H 1
| #define HAVE_SYS_CDEFS_H 1
| #define HAVE_FNMATCH_H 1
| #define HAVE_STRINGS_H 1
| #define HAVE_SYS_STAT_H 1
| #define HAVE_SYS_SELECT_H 1
| #define HAVE_SYS_SOCKET_H 1
| #define HAVE_LINUX_SOCKET_H 1
| /* end confdefs.h. */
| #include <sigaction.h>
configure:30915: result: no
configure:30950: checking for sigaction.h
configure:30957: result: no
configure:30834: checking paths.h usability
configure:30846: i686-pc-linux-gnu-gcc -c -std=iso9899:1990 -W -Wall -Wchar-subscripts -Wshadow -Wpointer-arith -Wmissing-prototypes -Wwrite-strings -D_XOPEN_SOURCE=500 -D_BSD_SOURCE -DNDEBUG -O2 -march=pentium4 -O2 -pipe -fomit-frame-pointer -Wformat-security -Wmissing-format-attribute conftest.c >&5
configure:30852: $? = 0
configure:30856: test -z
|| test ! -s conftest.err
configure:30859: $? = 0
configure:30862: test -s conftest.o
configure:30865: $? = 0
configure:30875: result: yes
configure:30879: checking paths.h presence
configure:30889: i686-pc-linux-gnu-gcc -E conftest.c
configure:30895: $? = 0
configure:30915: result: yes
configure:30950: checking for paths.h
configure:30957: result: yes
configure:30825: checking for malloc.h
configure:30830: result: yes
configure:30834: checking monetary.h usability
configure:30846: i686-pc-linux-gnu-gcc -c -std=iso9899:1990 -W -Wall -Wchar-subscripts -Wshadow -Wpointer-arith -Wmissing-prototypes -Wwrite-strings -D_XOPEN_SOURCE=500 -D_BSD_SOURCE -DNDEBUG -O2 -march=pentium4 -O2 -pipe -fomit-frame-pointer -Wformat-security -Wmissing-format-attribute conftest.c >&5
configure:30852: $? = 0
configure:30856: test -z
|| test ! -s conftest.err
configure:30859: $? = 0
configure:30862: test -s conftest.o
configure:30865: $? = 0
configure:30875: result: yes
configure:30879: checking monetary.h presence
configure:30889: i686-pc-linux-gnu-gcc -E conftest.c
configure:30895: $? = 0
configure:30915: result: yes
configure:30950: checking for monetary.h
configure:30957: result: yes
configure:30834: checking sys/param.h usability
configure:30846: i686-pc-linux-gnu-gcc -c -std=iso9899:1990 -W -Wall -Wchar-subscripts -Wshadow -Wpointer-arith -Wmissing-prototypes -Wwrite-strings -D_XOPEN_SOURCE=500 -D_BSD_SOURCE -DNDEBUG -O2 -march=pentium4 -O2 -pipe -fomit-frame-pointer -Wformat-security -Wmissing-format-attribute conftest.c >&5
configure:30852: $? = 0
configure:30856: test -z
|| test ! -s conftest.err
configure:30859: $? = 0
configure:30862: test -s conftest.o
configure:30865: $? = 0
configure:30875: result: yes
configure:30879: checking sys/param.h presence
configure:30889: i686-pc-linux-gnu-gcc -E conftest.c
configure:30895: $? = 0
configure:30915: result: yes
configure:30950: checking for sys/param.h
configure:30957: result: yes
configure:30834: checking limits.h usability
configure:30846: i686-pc-linux-gnu-gcc -c -std=iso9899:1990 -W -Wall -Wchar-subscripts -Wshadow -Wpointer-arith -Wmissing-prototypes -Wwrite-strings -D_XOPEN_SOURCE=500 -D_BSD_SOURCE -DNDEBUG -O2 -march=pentium4 -O2 -pipe -fomit-frame-pointer -Wformat-security -Wmissing-format-attribute conftest.c >&5
configure:30852: $? = 0
configure:30856: test -z
|| test ! -s conftest.err
configure:30859: $? = 0
configure:30862: test -s conftest.o
configure:30865: $? = 0
configure:30875: result: yes
configure:30879: checking limits.h presence
configure:30889: i686-pc-linux-gnu-gcc -E conftest.c
configure:30895: $? = 0
configure:30915: result: yes
configure:30950: checking for limits.h
configure:30957: result: yes
configure:30834: checking sys/mnttab.h usability
configure:30846: i686-pc-linux-gnu-gcc -c -std=iso9899:1990 -W -Wall -Wchar-subscripts -Wshadow -Wpointer-arith -Wmissing-prototypes -Wwrite-strings -D_XOPEN_SOURCE=500 -D_BSD_SOURCE -DNDEBUG -O2 -march=pentium4 -O2 -pipe -fomit-frame-pointer -Wformat-security -Wmissing-format-attribute conftest.c >&5
conftest.c:112:24: error: sys/mnttab.h: No such file or directory
configure:30852: $? = 1
configure: failed program was:
| /* confdefs.h. */
|
| #define PACKAGE_NAME ""
| #define PACKAGE_TARNAME ""
| #define PACKAGE_VERSION ""
| #define PACKAGE_STRING ""
| #define PACKAGE_BUGREPORT ""
| #define PACKAGE "arts"
| #define VERSION "1.5.0"
| #ifdef __cplusplus
| extern "C" void std::exit (int) throw (); using std::exit;
| #endif
| #define KDELIBSUFF ""
| #define STDC_HEADERS 1
| #define HAVE_SYS_TYPES_H 1
| #define HAVE_SYS_STAT_H 1
| #define HAVE_STDLIB_H 1
| #define HAVE_STRING_H 1
| #define HAVE_MEMORY_H 1
| #define HAVE_STRINGS_H 1
| #define HAVE_INTTYPES_H 1
| #define HAVE_STDINT_H 1
| #define HAVE_UNISTD_H 1
| #define HAVE_DLFCN_H 1
| #define LTDL_SHLIBPATH_VAR "LD_LIBRARY_PATH"
| #define LTDL_SYSSEARCHPATH "/lib:/usr/lib"
| #define LTDL_OBJDIR ".libs/"
| #define HAVE_PRELOADED_SYMBOLS 1
| #define HAVE_LIBDL 1
| #define HAVE_DLERROR 1
| #define HAVE_MALLOC_H 1
| #define HAVE_MEMORY_H 1
| #define HAVE_STDLIB_H 1
| #define HAVE_STDIO_H 1
| #define HAVE_CTYPE_H 1
| #define HAVE_DLFCN_H 1
| #define HAVE_STRING_H 1
| #define HAVE_STRCHR 1
| #define HAVE_STRRCHR 1
| #define HAVE_MEMCPY 1
| #define HAVE_STRCMP 1
| #define HAVE_CRYPT 1
| #define kde_socklen_t socklen_t
| #define ksize_t socklen_t
| #define HAVE_SYS_TYPES_H 1
| #define HAVE_STDINT_H 1
| #define HAVE_SYS_BITYPES_H 1
| #define HAVE_RES_INIT 1
| #define HAVE_RES_INIT 1
| #define HAVE_RES_INIT_PROTO 1
| #define SIZEOF_INT 4
| #define SIZEOF_SHORT 2
| #define SIZEOF_LONG 4
| #define SIZEOF_CHAR_P 4
| #define SIZEOF_SIZE_T 4
| #define SIZEOF_UNSIGNED_LONG 4
| #define HAVE_VSNPRINTF 1
| #define HAVE_SNPRINTF 1
| #define HAVE_SGI_STL 1
| #define HAVE_DIRENT_H 1
| #define STDC_HEADERS 1
| #define HAVE_FCNTL_H 1
| #define HAVE_SYS_TIME_H 1
| #define HAVE_UNISTD_H 1
| #define HAVE_SYS_CDEFS_H 1
| #define HAVE_FNMATCH_H 1
| #define HAVE_STRINGS_H 1
| #define HAVE_SYS_STAT_H 1
| #define HAVE_SYS_SELECT_H 1
| #define HAVE_SYS_SOCKET_H 1
| #define HAVE_LINUX_SOCKET_H 1
| #define HAVE_PATHS_H 1
| #define HAVE_MALLOC_H 1
| #define HAVE_MONETARY_H 1
| #define HAVE_SYS_PARAM_H 1
| #define HAVE_LIMITS_H 1
| /* end confdefs.h. */
| #include <stdio.h>
| #if HAVE_SYS_TYPES_H
| # include <sys/types.h>
| #endif
| #if HAVE_SYS_STAT_H
| # include <sys/stat.h>
| #endif
| #if STDC_HEADERS
| # include <stdlib.h>
| # include <stddef.h>
| #else
| # if HAVE_STDLIB_H
| # include <stdlib.h>
| # endif
| #endif
| #if HAVE_STRING_H
| # if !STDC_HEADERS && HAVE_MEMORY_H
| # include <memory.h>
| # endif
| # include <string.h>
| #endif
| #if HAVE_STRINGS_H
| # include <strings.h>
| #endif
| #if HAVE_INTTYPES_H
| # include <inttypes.h>
| #else
| # if HAVE_STDINT_H
| # include <stdint.h>
| # endif
| #endif
| #if HAVE_UNISTD_H
| # include <unistd.h>
| #endif
| #include <sys/mnttab.h>
configure:30875: result: no
configure:30879: checking sys/mnttab.h presence
configure:30889: i686-pc-linux-gnu-gcc -E conftest.c
conftest.c:78:24: error: sys/mnttab.h: No such file or directory
configure:30895: $? = 1
configure: failed program was:
| /* confdefs.h. */
|
| #define PACKAGE_NAME ""
| #define PACKAGE_TARNAME ""
| #define PACKAGE_VERSION ""
| #define PACKAGE_STRING ""
| #define PACKAGE_BUGREPORT ""
| #define PACKAGE "arts"
| #define VERSION "1.5.0"
| #ifdef __cplusplus
| extern "C" void std::exit (int) throw (); using std::exit;
| #endif
| #define KDELIBSUFF ""
| #define STDC_HEADERS 1
| #define HAVE_SYS_TYPES_H 1
| #define HAVE_SYS_STAT_H 1
| #define HAVE_STDLIB_H 1
| #define HAVE_STRING_H 1
| #define HAVE_MEMORY_H 1
| #define HAVE_STRINGS_H 1
| #define HAVE_INTTYPES_H 1
| #define HAVE_STDINT_H 1
| #define HAVE_UNISTD_H 1
| #define HAVE_DLFCN_H 1
| #define LTDL_SHLIBPATH_VAR "LD_LIBRARY_PATH"
| #define LTDL_SYSSEARCHPATH "/lib:/usr/lib"
| #define LTDL_OBJDIR ".libs/"
| #define HAVE_PRELOADED_SYMBOLS 1
| #define HAVE_LIBDL 1
| #define HAVE_DLERROR 1
| #define HAVE_MALLOC_H 1
| #define HAVE_MEMORY_H 1
| #define HAVE_STDLIB_H 1
| #define HAVE_STDIO_H 1
| #define HAVE_CTYPE_H 1
| #define HAVE_DLFCN_H 1
| #define HAVE_STRING_H 1
| #define HAVE_STRCHR 1
| #define HAVE_STRRCHR 1
| #define HAVE_MEMCPY 1
| #define HAVE_STRCMP 1
| #define HAVE_CRYPT 1
| #define kde_socklen_t socklen_t
| #define ksize_t socklen_t
| #define HAVE_SYS_TYPES_H 1
| #define HAVE_STDINT_H 1
| #define HAVE_SYS_BITYPES_H 1
| #define HAVE_RES_INIT 1
| #define HAVE_RES_INIT 1
| #define HAVE_RES_INIT_PROTO 1
| #define SIZEOF_INT 4
| #define SIZEOF_SHORT 2
| #define SIZEOF_LONG 4
| #define SIZEOF_CHAR_P 4
| #define SIZEOF_SIZE_T 4
| #define SIZEOF_UNSIGNED_LONG 4
| #define HAVE_VSNPRINTF 1
| #define HAVE_SNPRINTF 1
| #define HAVE_SGI_STL 1
| #define HAVE_DIRENT_H 1
| #define STDC_HEADERS 1
| #define HAVE_FCNTL_H 1
| #define HAVE_SYS_TIME_H 1
| #define HAVE_UNISTD_H 1
| #define HAVE_SYS_CDEFS_H 1
| #define HAVE_FNMATCH_H 1
| #define HAVE_STRINGS_H 1
| #define HAVE_SYS_STAT_H 1
| #define HAVE_SYS_SELECT_H 1
| #define HAVE_SYS_SOCKET_H 1
| #define HAVE_LINUX_SOCKET_H 1
| #define HAVE_PATHS_H 1
| #define HAVE_MALLOC_H 1
| #define HAVE_MONETARY_H 1
| #define HAVE_SYS_PARAM_H 1
| #define HAVE_LIMITS_H 1
| /* end confdefs.h. */
| #include <sys/mnttab.h>
configure:30915: result: no
configure:30950: checking for sys/mnttab.h
configure:30957: result: no
configure:30834: checking mntent.h usability
configure:30846: i686-pc-linux-gnu-gcc -c -std=iso9899:1990 -W -Wall -Wchar-subscripts -Wshadow -Wpointer-arith -Wmissing-prototypes -Wwrite-strings -D_XOPEN_SOURCE=500 -D_BSD_SOURCE -DNDEBUG -O2 -march=pentium4 -O2 -pipe -fomit-frame-pointer -Wformat-security -Wmissing-format-attribute conftest.c >&5
configure:30852: $? = 0
configure:30856: test -z
|| test ! -s conftest.err
configure:30859: $? = 0
configure:30862: test -s conftest.o
configure:30865: $? = 0
configure:30875: result: yes
configure:30879: checking mntent.h presence
configure:30889: i686-pc-linux-gnu-gcc -E conftest.c
configure:30895: $? = 0
configure:30915: result: yes
configure:30950: checking for mntent.h
configure:30957: result: yes
configure:30834: checking fstab.h usability
configure:30846: i686-pc-linux-gnu-gcc -c -std=iso9899:1990 -W -Wall -Wchar-subscripts -Wshadow -Wpointer-arith -Wmissing-prototypes -Wwrite-strings -D_XOPEN_SOURCE=500 -D_BSD_SOURCE -DNDEBUG -O2 -march=pentium4 -O2 -pipe -fomit-frame-pointer -Wformat-security -Wmissing-format-attribute conftest.c >&5
configure:30852: $? = 0
configure:30856: test -z
|| test ! -s conftest.err
configure:30859: $? = 0
configure:30862: test -s conftest.o
configure:30865: $? = 0
configure:30875: result: yes
configure:30879: checking fstab.h presence
configure:30889: i686-pc-linux-gnu-gcc -E conftest.c
configure:30895: $? = 0
configure:30915: result: yes
configure:30950: checking for fstab.h
configure:30957: result: yes
configure:31001: checking sys/soundcard.h usability
configure:31013: i686-pc-linux-gnu-g++ -c -Wno-long-long -Wundef -ansi -D_XOPEN_SOURCE=500 -D_BSD_SOURCE -Wcast-align -Wconversion -Wchar-subscripts -Wall -W -Wpointer-arith -DNDEBUG -DNO_DEBUG -O2 -march=pentium4 -O2 -pipe -fomit-frame-pointer -Wformat-security -Wmissing-format-attribute -Wno-non-virtual-dtor -fno-exceptions -fno-check-new -fno-common conftest.cc >&5
configure:31019: $? = 0
configure:31023: test -z
|| test ! -s conftest.err
configure:31026: $? = 0
configure:31029: test -s conftest.o
configure:31032: $? = 0
configure:31042: result: yes
configure:31046: checking sys/soundcard.h presence
configure:31056: i686-pc-linux-gnu-g++ -E conftest.cc
configure:31062: $? = 0
configure:31082: result: yes
configure:31117: checking for sys/soundcard.h
configure:31124: result: yes
configure:31190: checking for X
configure:31228: i686-pc-linux-gnu-gcc -E conftest.c
configure:31234: $? = 0
configure:31325: i686-pc-linux-gnu-gcc -o conftest -std=iso9899:1990 -W -Wall -Wchar-subscripts -Wshadow -Wpointer-arith -Wmissing-prototypes -Wwrite-strings -D_XOPEN_SOURCE=500 -D_BSD_SOURCE -DNDEBUG -O2 -march=pentium4 -O2 -pipe -fomit-frame-pointer -Wformat-security -Wmissing-format-attribute conftest.c -lXt >&5
configure:31331: $? = 0
configure:31335: test -z
|| test ! -s conftest.err
configure:31338: $? = 0
configure:31341: test -s conftest
configure:31344: $? = 0
configure:31490: result: libraries /usr/lib, headers .
configure:31519: checking for IceConnectionNumber in -lICE
configure:31549: i686-pc-linux-gnu-gcc -o conftest -std=iso9899:1990 -W -Wall -Wchar-subscripts -Wshadow -Wpointer-arith -Wmissing-prototypes -Wwrite-strings -D_XOPEN_SOURCE=500 -D_BSD_SOURCE -DNDEBUG -O2 -march=pentium4 -O2 -pipe -fomit-frame-pointer -Wformat-security -Wmissing-format-attribute -L/usr/lib conftest.c -lICE >&5
configure:31555: $? = 0
configure:31559: test -z
|| test ! -s conftest.err
configure:31562: $? = 0
configure:31565: test -s conftest
configure:31568: $? = 0
configure:31581: result: yes
configure:31591: checking for libXext
configure:31626: i686-pc-linux-gnu-gcc -o conftest -std=iso9899:1990 -W -Wall -Wchar-subscripts -Wshadow -Wpointer-arith -Wmissing-prototypes -Wwrite-strings -D_XOPEN_SOURCE=500 -D_BSD_SOURCE -DNDEBUG -O2 -march=pentium4 -O2 -pipe -fomit-frame-pointer -Wformat-security -Wmissing-format-attribute -L/usr/lib conftest.c -lXext -lX11 >&5
configure:31632: $? = 0
configure:31636: test -z
|| test ! -s conftest.err
configure:31639: $? = 0
configure:31642: test -s conftest
configure:31645: $? = 0
configure:31664: result: yes
configure:31815: checking for pthread_create in -lpthread
configure:31845: i686-pc-linux-gnu-gcc -o conftest -std=iso9899:1990 -W -Wall -Wchar-subscripts -Wshadow -Wpointer-arith -Wmissing-prototypes -Wwrite-strings -D_XOPEN_SOURCE=500 -D_BSD_SOURCE -DNDEBUG -O2 -march=pentium4 -O2 -pipe -fomit-frame-pointer -Wformat-security -Wmissing-format-attribute conftest.c -lpthread >&5
configure:31851: $? = 0
configure:31855: test -z
|| test ! -s conftest.err
configure:31858: $? = 0
configure:31861: test -s conftest
configure:31864: $? = 0
configure:31877: result: yes
configure:32158: checking for libz
configure:32193: i686-pc-linux-gnu-gcc -o conftest -std=iso9899:1990 -W -Wall -Wchar-subscripts -Wshadow -Wpointer-arith -Wmissing-prototypes -Wwrite-strings -D_XOPEN_SOURCE=500 -D_BSD_SOURCE -DNDEBUG -O2 -march=pentium4 -O2 -pipe -fomit-frame-pointer -Wformat-security -Wmissing-format-attribute -I. -D_REENTRANT conftest.c -L/usr/lib -lz >&5
configure:32199: $? = 0
configure:32203: test -z
|| test ! -s conftest.err
configure:32206: $? = 0
configure:32209: test -s conftest
configure:32212: $? = 0
configure:32234: result: -lz
configure:32255: checking for libpng
configure:32292: i686-pc-linux-gnu-gcc -o conftest -std=iso9899:1990 -W -Wall -Wchar-subscripts -Wshadow -Wpointer-arith -Wmissing-prototypes -Wwrite-strings -D_XOPEN_SOURCE=500 -D_BSD_SOURCE -DNDEBUG -O2 -march=pentium4 -O2 -pipe -fomit-frame-pointer -Wformat-security -Wmissing-format-attribute -I. -D_REENTRANT conftest.c -L/usr/lib -lpng -lz -lm -lX11 >&5
configure:32298: $? = 0
configure:32302: test -z
|| test ! -s conftest.err
configure:32305: $? = 0
configure:32308: test -s conftest
configure:32311: $? = 0
configure:32335: result: -lpng -lz -lm
configure:32346: checking for libjpeg6b
configure:32380: i686-pc-linux-gnu-gcc -o conftest -std=iso9899:1990 -W -Wall -Wchar-subscripts -Wshadow -Wpointer-arith -Wmissing-prototypes -Wwrite-strings -D_XOPEN_SOURCE=500 -D_BSD_SOURCE -DNDEBUG -O2 -march=pentium4 -O2 -pipe -fomit-frame-pointer -Wformat-security -Wmissing-format-attribute -I. -D_REENTRANT conftest.c -L/usr/lib -ljpeg6b -lm >&5
/usr/lib/gcc/i686-pc-linux-gnu/4.0.1/../../../../i686-pc-linux-gnu/bin/ld: cannot find -ljpeg6b
collect2: ld returned 1 exit status
configure:32386: $? = 1
configure: failed program was:
| /* confdefs.h. */
|
| #define PACKAGE_NAME ""
| #define PACKAGE_TARNAME ""
| #define PACKAGE_VERSION ""
| #define PACKAGE_STRING ""
| #define PACKAGE_BUGREPORT ""
| #define PACKAGE "arts"
| #define VERSION "1.5.0"
| #ifdef __cplusplus
| extern "C" void std::exit (int) throw (); using std::exit;
| #endif
| #define KDELIBSUFF ""
| #define STDC_HEADERS 1
| #define HAVE_SYS_TYPES_H 1
| #define HAVE_SYS_STAT_H 1
| #define HAVE_STDLIB_H 1
| #define HAVE_STRING_H 1
| #define HAVE_MEMORY_H 1
| #define HAVE_STRINGS_H 1
| #define HAVE_INTTYPES_H 1
| #define HAVE_STDINT_H 1
| #define HAVE_UNISTD_H 1
| #define HAVE_DLFCN_H 1
| #define LTDL_SHLIBPATH_VAR "LD_LIBRARY_PATH"
| #define LTDL_SYSSEARCHPATH "/lib:/usr/lib"
| #define LTDL_OBJDIR ".libs/"
| #define HAVE_PRELOADED_SYMBOLS 1
| #define HAVE_LIBDL 1
| #define HAVE_DLERROR 1
| #define HAVE_MALLOC_H 1
| #define HAVE_MEMORY_H 1
| #define HAVE_STDLIB_H 1
| #define HAVE_STDIO_H 1
| #define HAVE_CTYPE_H 1
| #define HAVE_DLFCN_H 1
| #define HAVE_STRING_H 1
| #define HAVE_STRCHR 1
| #define HAVE_STRRCHR 1
| #define HAVE_MEMCPY 1
| #define HAVE_STRCMP 1
| #define HAVE_CRYPT 1
| #define kde_socklen_t socklen_t
| #define ksize_t socklen_t
| #define HAVE_SYS_TYPES_H 1
| #define HAVE_STDINT_H 1
| #define HAVE_SYS_BITYPES_H 1
| #define HAVE_RES_INIT 1
| #define HAVE_RES_INIT 1
| #define HAVE_RES_INIT_PROTO 1
| #define SIZEOF_INT 4
| #define SIZEOF_SHORT 2
| #define SIZEOF_LONG 4
| #define SIZEOF_CHAR_P 4
| #define SIZEOF_SIZE_T 4
| #define SIZEOF_UNSIGNED_LONG 4
| #define HAVE_VSNPRINTF 1
| #define HAVE_SNPRINTF 1
| #define HAVE_SGI_STL 1
| #define HAVE_DIRENT_H 1
| #define STDC_HEADERS 1
| #define HAVE_FCNTL_H 1
| #define HAVE_SYS_TIME_H 1
| #define HAVE_UNISTD_H 1
| #define HAVE_SYS_CDEFS_H 1
| #define HAVE_FNMATCH_H 1
| #define HAVE_STRINGS_H 1
| #define HAVE_SYS_STAT_H 1
| #define HAVE_SYS_SELECT_H 1
| #define HAVE_SYS_SOCKET_H 1
| #define HAVE_LINUX_SOCKET_H 1
| #define HAVE_PATHS_H 1
| #define HAVE_MALLOC_H 1
| #define HAVE_MONETARY_H 1
| #define HAVE_SYS_PARAM_H 1
| #define HAVE_LIMITS_H 1
| #define HAVE_MNTENT_H 1
| #define HAVE_FSTAB_H 1
| #define HAVE_SYS_SOUNDCARD_H 1
| #define HAVE_LIBZ 1
| #define HAVE_LIBPNG 1
| /* end confdefs.h. */
|
| #ifdef __cplusplus
| extern "C" {
| #endif
| void jpeg_CreateDecompress();
| #ifdef __cplusplus
| }
| #endif
|
| int
| main ()
| {
| jpeg_CreateDecompress();
| ;
| return 0;
| }
configure:32421: result: no
configure:32424: checking for libjpeg
configure:32458: i686-pc-linux-gnu-gcc -o conftest -std=iso9899:1990 -W -Wall -Wchar-subscripts -Wshadow -Wpointer-arith -Wmissing-prototypes -Wwrite-strings -D_XOPEN_SOURCE=500 -D_BSD_SOURCE -DNDEBUG -O2 -march=pentium4 -O2 -pipe -fomit-frame-pointer -Wformat-security -Wmissing-format-attribute -I. -D_REENTRANT conftest.c -L/usr/lib -ljpeg -lm >&5
configure:32464: $? = 0
configure:32468: test -z
|| test ! -s conftest.err
configure:32471: $? = 0
configure:32474: test -s conftest
configure:32477: $? = 0
configure:32496: result: -ljpeg
configure: 32520: ${prefix}/include/jpeglib.h
configure: 32520: /usr/include/jpeglib.h
taking that
configure:32567: checking for perl
configure:32627: result: /usr/bin/perl
configure:32753: checking for Qt
configure: 32818: /usr/qt/3/include/qstyle.h
taking that
configure:32936: rm -rf SunWS_cache; i686-pc-linux-gnu-g++ -o conftest -Wno-long-long -Wundef -ansi -D_XOPEN_SOURCE=500 -D_BSD_SOURCE -Wcast-align -Wconversion -Wchar-subscripts -Wall -W -Wpointer-arith -DNDEBUG -DNO_DEBUG -O2 -march=pentium4 -O2 -pipe -fomit-frame-pointer -Wformat-security -Wmissing-format-attribute -Wno-non-virtual-dtor -fno-exceptions -fno-check-new -fno-common -I/usr/qt/3/include -I. -DQT_THREAD_SUPPORT -D_REENTRANT -L/usr/qt/3/lib -L/usr/lib conftest.cc -lqt-mt -lpng -lz -lm -ljpeg -ldl -lXext -lX11 -lSM -lICE -lpthread 1>&5
/usr/qt/3/lib/libqt-mt.so: undefined reference to `__pthread_register_cancel@GLIBC_2.3.3'
/usr/qt/3/lib/libqt-mt.so: undefined reference to `__pthread_unregister_cancel@GLIBC_2.3.3'
collect2: ld returned 1 exit status
configure:32939: $? = 1
configure: failed program was:
#include "confdefs.h"
#include <qglobal.h>
#include <qapplication.h>
#include <qcursor.h>
#include <qstylefactory.h>
#include <private/qucomextra_p.h>
#if ! (QT_VERSION >= 0x030300 && QT_VERSION < 0x040000)
#error 1
#endif
int main() {
(void)QStyleFactory::create(QString::null);
QCursor c(Qt::WhatsThisCursor);
return 0;
}
configure:32979: error: Qt (>= Qt 3.3 and < 4.0) (library qt-mt) not found. Please check your installation!
For more details about this problem, look at the end of config.log.
Make sure that you have compiled Qt with thread support!
## ---------------- ##
## Cache variables. ##
## ---------------- ##
ac_cv_build=i686-pc-linux-gnu
ac_cv_build_alias=i686-pc-linux-gnu
ac_cv_c_compiler_gnu=yes
ac_cv_cxx_compiler_gnu=yes
ac_cv_env_CC_set=
ac_cv_env_CC_value=
ac_cv_env_CFLAGS_set=set
ac_cv_env_CFLAGS_value='-march=pentium4 -O2 -pipe -fomit-frame-pointer'
ac_cv_env_CPPFLAGS_set=
ac_cv_env_CPPFLAGS_value=
ac_cv_env_CPP_set=
ac_cv_env_CPP_value=
ac_cv_env_CXXCPP_set=
ac_cv_env_CXXCPP_value=
ac_cv_env_CXXFLAGS_set=set
ac_cv_env_CXXFLAGS_value='-march=pentium4 -O2 -pipe -fomit-frame-pointer'
ac_cv_env_CXX_set=
ac_cv_env_CXX_value=
ac_cv_env_F77_set=
ac_cv_env_F77_value=
ac_cv_env_FFLAGS_set=
ac_cv_env_FFLAGS_value=
ac_cv_env_LDFLAGS_set=
ac_cv_env_LDFLAGS_value=
ac_cv_env_build_alias_set=set
ac_cv_env_build_alias_value=i686-pc-linux-gnu
ac_cv_env_host_alias_set=set
ac_cv_env_host_alias_value=i686-pc-linux-gnu
ac_cv_env_target_alias_set=
ac_cv_env_target_alias_value=
ac_cv_exeext=
ac_cv_f77_compiler_gnu=yes
ac_cv_func__NSGetEnviron=no
ac_cv_func_connect=yes
ac_cv_func_dlerror=yes
ac_cv_func_dlopen=no
ac_cv_func_inet_ntoa=yes
ac_cv_func_memcpy=yes
ac_cv_func_remove=yes
ac_cv_func_shl_load=no
ac_cv_func_shmat=yes
ac_cv_func_snprintf=yes
ac_cv_func_strchr=yes
ac_cv_func_strcmp=yes
ac_cv_func_strrchr=yes
ac_cv_func_vsnprintf=yes
ac_cv_have_dlfcn=yes
ac_cv_have_qt=have_qt=no
ac_cv_header_Carbon_Carbon_h=no
ac_cv_header_CoreAudio_CoreAudio_h=no
ac_cv_header_crt_externs_h=no
ac_cv_header_ctype_h=yes
ac_cv_header_dirent_dirent_h=yes
ac_cv_header_dl_h=no
ac_cv_header_dld_h=no
ac_cv_header_dlfcn_h=yes
ac_cv_header_fcntl_h=yes
ac_cv_header_fnmatch_h=yes
ac_cv_header_fstab_h=yes
ac_cv_header_inttypes_h=yes
ac_cv_header_limits_h=yes
ac_cv_header_linux_socket_h=yes
ac_cv_header_malloc_h=yes
ac_cv_header_memory_h=yes
ac_cv_header_mntent_h=yes
ac_cv_header_monetary_h=yes
ac_cv_header_paths_h=yes
ac_cv_header_sigaction_h=no
ac_cv_header_socketbits_h=no
ac_cv_header_stdc=yes
ac_cv_header_stdint_h=yes
ac_cv_header_stdio_h=yes
ac_cv_header_stdlib_h=yes
ac_cv_header_string_h=yes
ac_cv_header_strings_h=yes
ac_cv_header_sys_bitypes_h=yes
ac_cv_header_sys_cdefs_h=yes
ac_cv_header_sys_mnttab_h=no
ac_cv_header_sys_param_h=yes
ac_cv_header_sys_select_h=yes
ac_cv_header_sys_socket_h=yes
ac_cv_header_sys_soundcard_h=yes
ac_cv_header_sys_stat_h=yes
ac_cv_header_sys_time_h=yes
ac_cv_header_sys_types_h=yes
ac_cv_header_sysent_h=no
ac_cv_header_unistd_h=yes
ac_cv_host=i686-pc-linux-gnu
ac_cv_host_alias=i686-pc-linux-gnu
ac_cv_lib_ICE_IceConnectionNumber=yes
ac_cv_lib_compat_main=no
ac_cv_lib_crypt_crypt=yes
ac_cv_lib_dl_dlopen=yes
ac_cv_lib_dld_dld_link=no
ac_cv_lib_dld_shl_load=no
ac_cv_lib_dld_shl_unload=no
ac_cv_lib_dnet_dnet_ntoa=no
ac_cv_lib_dnet_stub_dnet_ntoa=no
ac_cv_lib_jpeg_6b=no
ac_cv_lib_jpeg_normal=-ljpeg
ac_cv_lib_png='-lpng -lz -lm'
ac_cv_lib_poll_poll=no
ac_cv_lib_pthread_pthread_create=yes
ac_cv_lib_ucb_killpg=no
ac_cv_lib_util_main=yes
ac_cv_lib_z=-lz
ac_cv_objext=o
ac_cv_path_install='/bin/install -c'
ac_cv_prog_AR=i686-pc-linux-gnu-ar
ac_cv_prog_AWK=gawk
ac_cv_prog_CC=i686-pc-linux-gnu-gcc
ac_cv_prog_CPP='i686-pc-linux-gnu-gcc -E'
ac_cv_prog_CXX=i686-pc-linux-gnu-g++
ac_cv_prog_CXXCPP='i686-pc-linux-gnu-g++ -E'
ac_cv_prog_F77=i686-pc-linux-gnu-gfortran
ac_cv_prog_RANLIB=i686-pc-linux-gnu-ranlib
ac_cv_prog_STRIP=i686-pc-linux-gnu-strip
ac_cv_prog_cc_g=yes
ac_cv_prog_cc_stdc=
ac_cv_prog_cxx_g=yes
ac_cv_prog_egrep='grep -E'
ac_cv_prog_f77_g=yes
ac_cv_prog_make_make_set=yes
ac_cv_search_opendir='none required'
ac_cv_sizeof_char_p=4
ac_cv_sizeof_int=4
ac_cv_sizeof_long=4
ac_cv_sizeof_short=2
ac_cv_sizeof_size_t=4
ac_cv_sizeof_unsigned_long=4
ac_cv_sys_global_symbol_pipe='sed -n -e '\''s/^.* \([ABCDGISTW]\) *\(\)\([_A-Za-z][_A-Za-z0-9]*\)$/\1 \2\3 \3/p'\'''
ac_cv_sys_symbol_underscore=no
ac_cv_target=i686-pc-linux-gnu
ac_cv_target_alias=i686-pc-linux-gnu
ac_cv_type_char_p=yes
ac_cv_type_int=yes
ac_cv_type_long=yes
ac_cv_type_short=yes
ac_cv_type_size_t=yes
ac_cv_type_unsigned_long=yes
am_cv_CC_dependencies_compiler_type=none
am_cv_CXX_dependencies_compiler_type=none
kde_cv_func_res_init=yes
kde_cv_func_strlcat=no
kde_cv_func_strlcpy=no
kde_cv_have_libXext=yes
kde_cv_have_x='have_x=yes kde_x_includes=. kde_x_libraries=/usr/lib'
kde_cv_path=/usr/bin/perl
kde_cv_path_perl=/usr/bin/perl
kde_cv_prog_cc_Wmissing_format_attribute=yes
kde_cv_prog_cxx_O0=yes
kde_cv_prog_cxx_Wl___allow_shlib_undefined=yes
kde_cv_prog_cxx_Wl___no_undefined=yes
kde_cv_prog_cxx_Wmissing_format_attribute=yes
kde_cv_prog_cxx_Wno_long_long=yes
kde_cv_prog_cxx_Wno_non_virtual_dtor=yes
kde_cv_prog_cxx_Wundef=yes
kde_cv_prog_cxx_fexceptions=yes
kde_cv_prog_cxx_fno_check_new=yes
kde_cv_prog_cxx_fno_common=yes
kde_cv_prog_cxx_fno_exceptions=yes
kde_cv_prog_cxx_fvisibility_hidden=no
kde_cv_proto_res_init=no
kde_cv_proto_strlcat='yes - in libkdefakes'
kde_cv_proto_strlcpy='yes - in libkdefakes'
kde_cv_qt_direct=no
kde_cv_socklen_t=yes
kde_cv_socklen_t_equiv=socklen_t
kde_cv_stl_works=yes
kde_cv_val_pie_support=yes
libltdl_cv_objdir=.libs
libltdl_cv_preloaded_symbols=yes
libltdl_cv_shlibext=
libltdl_cv_shlibpath_var=LD_LIBRARY_PATH
libltdl_cv_sys_dlopen_deplibs=yes
libltdl_cv_sys_search_path='/lib /usr/lib'
lt_cv_deplibs_check_method=pass_all
lt_cv_dlopen=dlopen
lt_cv_dlopen_libs=-ldl
lt_cv_dlopen_self=yes
lt_cv_dlopen_self_static=yes
lt_cv_file_magic_cmd='$MAGIC_CMD'
lt_cv_file_magic_test_file='/lib/libc.so.6 /lib/libc-2.3.4.so /lib/libc-2.3.5.so /lib/libc-2.3.6.so'
lt_cv_ld_reload_flag=-r
lt_cv_objdir=.libs
lt_cv_path_LD=/usr/i686-pc-linux-gnu/bin/ld
lt_cv_path_LDCXX=/usr/i686-pc-linux-gnu/bin/ld
lt_cv_path_NM='/usr/bin/i686-pc-linux-gnu-nm -B'
lt_cv_path_SED=/bin/sed
lt_cv_prog_compiler_c_o=yes
lt_cv_prog_compiler_c_o_CXX=yes
lt_cv_prog_compiler_c_o_F77=yes
lt_cv_prog_compiler_rtti_exceptions=no
lt_cv_prog_gnu_ld=yes
lt_cv_prog_gnu_ldcxx=yes
lt_cv_sys_global_symbol_pipe='sed -n -e '\''s/^.*[ ]\([ABCDGISTW][ABCDGISTW]*\)[ ][ ]*\(\)\([_A-Za-z][_A-Za-z0-9]*\)$/\1 \2\3 \3/p'\'''
lt_cv_sys_global_symbol_to_c_name_address='sed -n -e '\''s/^: \([^ ]*\) $/ {\"\1\", (lt_ptr) 0},/p'\'' -e '\''s/^[BCDEGRST] \([^ ]*\) \([^ ]*\)$/ {"\2", (lt_ptr) \&\2},/p'\'''
lt_cv_sys_global_symbol_to_cdecl='sed -n -e '\''s/^. .* \(.*\)$/extern int \1;/p'\'''
lt_cv_sys_max_cmd_len=32768
lt_lt_cv_prog_compiler_c_o='"yes"'
lt_lt_cv_prog_compiler_c_o_CXX='"yes"'
lt_lt_cv_prog_compiler_c_o_F77='"yes"'
lt_lt_cv_sys_global_symbol_pipe='"sed -n -e '\''s/^.*[ ]\\([ABCDGISTW][ABCDGISTW]*\\)[ ][ ]*\\(\\)\\([_A-Za-z][_A-Za-z0-9]*\\)\$/\\1 \\2\\3 \\3/p'\''"'
lt_lt_cv_sys_global_symbol_to_c_name_address='"sed -n -e '\''s/^: \\([^ ]*\\) \$/ {\\\"\\1\\\", (lt_ptr) 0},/p'\'' -e '\''s/^[BCDEGRST] \\([^ ]*\\) \\([^ ]*\\)\$/ {\"\\2\", (lt_ptr) \\&\\2},/p'\''"'
lt_lt_cv_sys_global_symbol_to_cdecl='"sed -n -e '\''s/^. .* \\(.*\\)\$/extern int \\1;/p'\''"'
## ----------------- ##
## Output variables. ##
## ----------------- ##
ACLOCAL='${SHELL} /var/tmp/portage/arts-3.5.0-r1/work/arts-1.5.0/admin/missing --run aclocal-1.9'
ALLOCA=''
AMDEPBACKSLASH=''
AMDEP_FALSE=''
AMDEP_TRUE='#'
AMTAR='${SHELL} /var/tmp/portage/arts-3.5.0-r1/work/arts-1.5.0/admin/missing --run tar'
AR='i686-pc-linux-gnu-ar'
ARTS_MAJOR_VERSION='1'
ARTS_MICRO_VERSION='0'
ARTS_MINOR_VERSION='5'
ARTS_VERSION='1.5.0'
AUTOCONF='$(SHELL) $(top_srcdir)/admin/cvs.sh configure || touch configure'
AUTODIRS=''
AUTOHEADER='${SHELL} /var/tmp/portage/arts-3.5.0-r1/work/arts-1.5.0/admin/missing --run autoheader'
AUTOMAKE='${SHELL} /var/tmp/portage/arts-3.5.0-r1/work/arts-1.5.0/admin/missing --run automake-1.9'
AWK='gawk'
CC='i686-pc-linux-gnu-gcc'
CCDEPMODE='depmode=none'
CFLAGS='-std=iso9899:1990 -W -Wall -Wchar-subscripts -Wshadow -Wpointer-arith -Wmissing-prototypes -Wwrite-strings -D_XOPEN_SOURCE=500 -D_BSD_SOURCE -DNDEBUG -O2 -march=pentium4 -O2 -pipe -fomit-frame-pointer -Wformat-security -Wmissing-format-attribute'
CONF_FILES=' $(top_srcdir)/configure.in.in $(top_srcdir)/./flow/gsl/configure.in.in $(top_srcdir)/configure.in.bot'
CONVENIENCE_LTDL_FALSE='#'
CONVENIENCE_LTDL_TRUE=''
CPP='i686-pc-linux-gnu-gcc -E'
CPPFLAGS=' -DQT_THREAD_SUPPORT -D_REENTRANT'
CXX='i686-pc-linux-gnu-g++'
CXXCPP='i686-pc-linux-gnu-g++ -E'
CXXDEPMODE='depmode=none'
CXXFLAGS='-Wno-long-long -Wundef -ansi -D_XOPEN_SOURCE=500 -D_BSD_SOURCE -Wcast-align -Wconversion -Wchar-subscripts -Wall -W -Wpointer-arith -DNDEBUG -DNO_DEBUG -O2 -march=pentium4 -O2 -pipe -fomit-frame-pointer -Wformat-security -Wmissing-format-attribute -Wno-non-virtual-dtor -fno-exceptions -fno-check-new -fno-common'
CYGPATH_W='echo'
DEFS=''
DEPDIR='.deps'
ECHO='echo'
ECHO_C=''
ECHO_N='-n'
ECHO_T=''
EGREP='grep -E'
ENABLE_PERMISSIVE_FLAG='-fpermissive'
EXEEXT=''
EXTRA_SUBDIRS=''
F77='i686-pc-linux-gnu-gfortran'
FFLAGS='-g -O2'
FRAMEWORK_COREAUDIO=''
GLIB_CFLAGS=''
GLIB_LDFLAGS=''
GLIB_LIBADD=''
GSL_CFLAGS=''
GSL_HAVE_LIBMAD=''
GSL_HAVE_MUTEXATTR_SETTYPE=''
GSL_HAVE_OGGVORBIS=''
GSL_HAVE_OGGVORBIS_RC3=''
GSL_LIBS=''
GSL_SIZEOF_PTH_COND_T=''
GSL_SIZEOF_PTH_MUTEX_T=''
GSL_SIZEOF_STD_INTMAX_T=''
GSL_USE_ARTS_THREADS=''
GSL_USE_GSL_GLIB=''
HAVE_GCC_VISIBILITY='0'
HAVE_LIBJPEG_FALSE=''
HAVE_LIBJPEG_TRUE=''
HAVE_LIBPNG_FALSE=''
HAVE_LIBPNG_TRUE=''
HAVE_LIBTIFF_FALSE=''
HAVE_LIBTIFF_TRUE=''
HAVE_WAVSUPPORT_FALSE=''
HAVE_WAVSUPPORT_TRUE=''
INSTALL_DATA='${INSTALL} -m 644'
INSTALL_LTDL_FALSE=''
INSTALL_LTDL_TRUE='#'
INSTALL_PROGRAM='${INSTALL} $(INSTALL_STRIP_FLAG)'
INSTALL_SCRIPT='${INSTALL}'
INSTALL_STRIP_PROGRAM='${SHELL} $(install_sh) -c -s'
JACK_CFLAGS=''
JACK_LDFLAGS=''
JACK_LIBADD=''
KDE_CHECK_PLUGIN='$(KDE_PLUGIN) -rpath $(libdir)'
KDE_EXTRA_RPATH=''
KDE_INCLUDES=''
KDE_LDFLAGS=''
KDE_MT_LDFLAGS=''
KDE_MT_LIBS='-lpthread'
KDE_NO_UNDEFINED='-Wl,--no-undefined -Wl,--allow-shlib-undefined'
KDE_PLUGIN='-avoid-version -module -no-undefined $(KDE_NO_UNDEFINED) $(KDE_RPATH) $(KDE_MT_LDFLAGS)'
KDE_RPATH=''
KDE_USE_CLOSURE_FALSE=''
KDE_USE_CLOSURE_TRUE='#'
KDE_USE_FINAL_FALSE=''
KDE_USE_FINAL_TRUE='#'
KDE_USE_FPIE='-fpie'
KDE_USE_NMCHECK_FALSE=''
KDE_USE_NMCHECK_TRUE='#'
KDE_USE_PIE='-pie'
LDFLAGS=''
LDFLAGS_AS_NEEDED=''
LDFLAGS_NEW_DTAGS=''
LIBADD_DL='-ldl'
LIBASOUND=''
LIBAUDIOFILE=''
LIBAUDIOFILE_LDFLAGS=''
LIBAUDIOIO=''
LIBAUDIONAS=''
LIBAUDIONAS_LDFLAGS=''
LIBCOMPAT=''
LIBCRYPT='-lcrypt'
LIBCSL=''
LIBDL='-ldl'
LIBESD=''
LIBESD_LDFLAGS=''
LIBICE=''
LIBJPEG='-ljpeg'
LIBMAS=''
LIBOBJS=''
LIBOSSAUDIO=''
LIBPNG='-lpng -lz -lm'
LIBPOSIX4=''
LIBPTHREAD='-lpthread'
LIBRESOLV='-lresolv'
LIBS=''
LIBSEM=''
LIBSM='-lSM -lICE'
LIBSOCKET=''
LIBTOOL='$(SHELL) $(top_builddir)/libtool --silent'
LIBUCB=''
LIBUTIL='-lutil'
LIBZ='-lz'
LIB_POLL=''
LIB_QPE=''
LIB_QT=''
LIB_X11='-lX11 $(LIBSOCKET)'
LIB_XEXT='-lXext'
LIB_XRENDER=''
LN_S='ln -s'
LTLIBOBJS=''
MAKEINFO='${SHELL} /var/tmp/portage/arts-3.5.0-r1/work/arts-1.5.0/admin/missing --run makeinfo'
MAS_CFLAGS=''
MAS_CONFIG=''
MAS_LDFLAGS=''
MCOPIDL=''
MOC=''
NOOPT_CFLAGS='-O0'
NOOPT_CXXFLAGS='-O0'
OBJEXT='o'
PACKAGE='arts'
PACKAGE_BUGREPORT=''
PACKAGE_NAME=''
PACKAGE_STRING=''
PACKAGE_TARNAME=''
PACKAGE_VERSION=''
PATH_SEPARATOR=':'
PERL='/usr/bin/perl'
PKG_CONFIG=''
QTE_NORTTI=''
QT_INCLUDES=''
QT_LDFLAGS=''
RANLIB='i686-pc-linux-gnu-ranlib'
SET_MAKE=''
SGILIBAUDIO=''
SHELL='/bin/sh'
STRIP='i686-pc-linux-gnu-strip'
TOPSUBDIRS=''
UIC=''
UIC_TR=''
USER_INCLUDES=''
USER_LDFLAGS=''
USE_EXCEPTIONS='-fexceptions'
USE_RTTI=''
USE_THREADS=''
VERSION='1.5.0'
WOVERLOADED_VIRTUAL=''
X_EXTRA_LIBS=''
X_INCLUDES='-I.'
X_LDFLAGS='-L/usr/lib'
X_PRE_LIBS=''
X_RPATH=''
ac_ct_AR=''
ac_ct_CC=''
ac_ct_CXX=''
ac_ct_F77=''
ac_ct_RANLIB=''
ac_ct_STRIP=''
all_includes='-I.'
all_libraries='-L/usr/lib '
am__fastdepCC_FALSE=''
am__fastdepCC_TRUE='#'
am__fastdepCXX_FALSE=''
am__fastdepCXX_TRUE='#'
am__include='include'
am__leading_dot='.'
am__quote=''
am__tar='${AMTAR} chof - "$$tardir"'
am__untar='${AMTAR} xf -'
artsc_SUBDIR_included_FALSE=''
artsc_SUBDIR_included_TRUE=''
bindir='${exec_prefix}/bin'
build='i686-pc-linux-gnu'
build_alias='i686-pc-linux-gnu'
build_cpu='i686'
build_os='linux-gnu'
build_vendor='pc'
datadir='/usr/kde/3.5/share'
doc_SUBDIR_included_FALSE=''
doc_SUBDIR_included_TRUE=''
examples_SUBDIR_included_FALSE=''
examples_SUBDIR_included_TRUE=''
exec_prefix='NONE'
flow_SUBDIR_included_FALSE=''
flow_SUBDIR_included_TRUE=''
gmcop_SUBDIR_included_FALSE=''
gmcop_SUBDIR_included_TRUE=''
host='i686-pc-linux-gnu'
host_alias='i686-pc-linux-gnu'
host_cpu='i686'
host_os='linux-gnu'
host_vendor='pc'
include_x11_FALSE='#'
include_x11_TRUE=''
includedir='${prefix}/include'
infodir='/usr/kde/3.5/share/info'
install_sh='/var/tmp/portage/arts-3.5.0-r1/work/arts-1.5.0/admin/install-sh'
kde_includes=''
kde_libraries=''
kde_libs_htmldir='$(kde_htmldir)'
kde_libs_prefix='$(prefix)'
kde_qtver='3'
libdir='${exec_prefix}/lib'
libexecdir='${exec_prefix}/libexec'
libltdl_SUBDIR_included_FALSE=''
libltdl_SUBDIR_included_TRUE=''
localstatedir='/var/lib'
mandir='/usr/kde/3.5/share/man'
mcop_SUBDIR_included_FALSE=''
mcop_SUBDIR_included_TRUE=''
mcop_mt_SUBDIR_included_FALSE=''
mcop_mt_SUBDIR_included_TRUE=''
mcopidl_SUBDIR_included_FALSE=''
mcopidl_SUBDIR_included_TRUE=''
mkdir_p='mkdir -p --'
oldincludedir='/usr/include'
prefix='/usr/kde/3.5'
program_transform_name='s,x,x,'
qt_includes=''
qt_libraries=''
qtmcop_SUBDIR_included_FALSE=''
qtmcop_SUBDIR_included_TRUE=''
sbindir='${exec_prefix}/sbin'
sharedstatedir='${prefix}/com'
soundserver_SUBDIR_included_FALSE=''
soundserver_SUBDIR_included_TRUE=''
sysconfdir='/usr/kde/3.5/etc'
target='i686-pc-linux-gnu'
target_alias=''
target_cpu='i686'
target_os='linux-gnu'
target_vendor='pc'
tests_SUBDIR_included_FALSE=''
tests_SUBDIR_included_TRUE=''
unsermake_enable_pch_FALSE=''
unsermake_enable_pch_TRUE='#'
x11_SUBDIR_included_FALSE=''
x11_SUBDIR_included_TRUE=''
x_includes='.'
x_libraries='/usr/lib'
## ----------- ##
## confdefs.h. ##
## ----------- ##
#define HAVE_CRYPT 1
#define HAVE_CTYPE_H 1
#define HAVE_DIRENT_H 1
#define HAVE_DLERROR 1
#define HAVE_DLFCN_H 1
#define HAVE_DLFCN_H 1
#define HAVE_FCNTL_H 1
#define HAVE_FNMATCH_H 1
#define HAVE_FSTAB_H 1
#define HAVE_INTTYPES_H 1
#define HAVE_LIBDL 1
#define HAVE_LIBJPEG 1
#define HAVE_LIBPNG 1
#define HAVE_LIBPTHREAD 1
#define HAVE_LIBZ 1
#define HAVE_LIMITS_H 1
#define HAVE_LINUX_SOCKET_H 1
#define HAVE_MALLOC_H 1
#define HAVE_MALLOC_H 1
#define HAVE_MEMCPY 1
#define HAVE_MEMORY_H 1
#define HAVE_MEMORY_H 1
#define HAVE_MNTENT_H 1
#define HAVE_MONETARY_H 1
#define HAVE_PATHS_H 1
#define HAVE_PRELOADED_SYMBOLS 1
#define HAVE_RES_INIT 1
#define HAVE_RES_INIT 1
#define HAVE_RES_INIT_PROTO 1
#define HAVE_SGI_STL 1
#define HAVE_SNPRINTF 1
#define HAVE_STDINT_H 1
#define HAVE_STDINT_H 1
#define HAVE_STDIO_H 1
#define HAVE_STDLIB_H 1
#define HAVE_STDLIB_H 1
#define HAVE_STRCHR 1
#define HAVE_STRCMP 1
#define HAVE_STRINGS_H 1
#define HAVE_STRINGS_H 1
#define HAVE_STRING_H 1
#define HAVE_STRING_H 1
#define HAVE_STRRCHR 1
#define HAVE_SYS_BITYPES_H 1
#define HAVE_SYS_CDEFS_H 1
#define HAVE_SYS_PARAM_H 1
#define HAVE_SYS_SELECT_H 1
#define HAVE_SYS_SOCKET_H 1
#define HAVE_SYS_SOUNDCARD_H 1
#define HAVE_SYS_STAT_H 1
#define HAVE_SYS_STAT_H 1
#define HAVE_SYS_TIME_H 1
#define HAVE_SYS_TYPES_H 1
#define HAVE_SYS_TYPES_H 1
#define HAVE_UNISTD_H 1
#define HAVE_UNISTD_H 1
#define HAVE_VSNPRINTF 1
#define KDELIBSUFF ""
#define LTDL_OBJDIR ".libs/"
#define LTDL_SHLIBPATH_VAR "LD_LIBRARY_PATH"
#define LTDL_SYSSEARCHPATH "/lib:/usr/lib"
#define PACKAGE "arts"
#define PACKAGE_BUGREPORT ""
#define PACKAGE_NAME ""
#define PACKAGE_STRING ""
#define PACKAGE_TARNAME ""
#define PACKAGE_VERSION ""
#define SIZEOF_CHAR_P 4
#define SIZEOF_INT 4
#define SIZEOF_LONG 4
#define SIZEOF_SHORT 2
#define SIZEOF_SIZE_T 4
#define SIZEOF_UNSIGNED_LONG 4
#define STDC_HEADERS 1
#define STDC_HEADERS 1
#define VERSION "1.5.0"
#define kde_socklen_t socklen_t
#define ksize_t socklen_t
#endif
#ifdef __cplusplus
extern "C" void std::exit (int) throw (); using std::exit;
configure: exit 1