All pastes #38111 Raw Edit

Stuff

public text v1 · immutable
#38111 ·published 2006-01-23 00:28 UTC
rendered paste body
include/linux/elf.h:438: warning: array '_DYNAMIC' assumed to have one element
include/linux/sched.h:227: error: storage size of `mmap_sem' isn't known
include/linux/sched.h:261: error: storage size of `default_kioctx' isn't known
include/linux/sched.h:268: error: storage size of `action' isn't known
include/linux/sched.h:286: error: storage size of `shared_pending' isn't known
include/linux/sched.h:406: error: storage size of `wall_to_prev' isn't known
include/linux/sched.h:552: error: storage size of `start_time' isn't known
include/linux/sched.h:563: error: storage size of `rlim' isn't known
include/linux/sched.h:571: error: storage size of `thread' isn't known
include/linux/sched.h:583: error: storage size of `pending' isn't known
include/linux/stat.h:68: error: storage size of `atime' isn't known
include/linux/stat.h:69: error: storage size of `mtime' isn't known
include/linux/stat.h:70: error: storage size of `ctime' isn't known
include/linux/fs.h:278: error: storage size of `ia_atime' isn't known
include/linux/fs.h:279: error: storage size of `ia_mtime' isn't known
include/linux/fs.h:280: error: storage size of `ia_ctime' isn't known
include/linux/quota.h:223: error: storage size of `dq_dqb' isn't known
include/linux/fs.h:358: error: storage size of `bd_sem' isn't known
include/linux/fs.h:359: error: storage size of `bd_mount_sem' isn't known
include/linux/fs.h:433: error: storage size of `i_atime' isn't known
include/linux/fs.h:434: error: storage size of `i_mtime' isn't known
include/linux/fs.h:435: error: storage size of `i_ctime' isn't known
include/linux/fs.h:443: error: storage size of `i_sem' isn't known
include/linux/fs.h:444: error: storage size of `i_alloc_sem' isn't known
include/linux/fs.h:450: error: storage size of `i_data' isn't known
include/linux/fs.h:577: error: storage size of `f_owner' isn't known
include/linux/fs.h:755: error: storage size of `s_umount' isn't known
include/linux/fs.h:756: error: storage size of `s_lock' isn't known
include/linux/fs.h:784: error: storage size of `s_vfs_rename_sem' isn't known
include/linux/pci.h:515: error: storage size of `dev' isn't known
{standard input}: Assembler messages:
{standard input}:670: Error: symbol `rv' is already defined
{standard input}:684: Error: symbol `rv' is already defined
{standard input}:691: Error: symbol `c' is already defined
{standard input}:697: Error: symbol `rv' is already defined
{standard input}:1108: Error: symbol `seq' is already defined
{standard input}:1156: Error: symbol `sem_nsems' is already defined
{standard input}:1178: Error: symbol `lock' is already defined
/usr/src/zaptel-1.2.2/zaptel.c:6438: error: storage size of `zt_fops' isn't known
/usr/src/zaptel-1.2.2/zaptel.c:620: warning: 'recalc_maxlinks' defined but not used
/usr/src/zaptel-1.2.2/zaptel.c:632: warning: 'zt_first_empty_conference' defined but not used
/usr/src/zaptel-1.2.2/zaptel.c:643: warning: 'zt_get_conf_alias' defined but not used
/usr/src/zaptel-1.2.2/zaptel.c:1030: warning: 'free_tone_zone' defined but not used
/usr/src/zaptel-1.2.2/zaptel.c:2405: warning: 'ioctl_load_zone' defined but not used
/usr/src/zaptel-1.2.2/zaptel.c:2759: warning: 'zt_common_ioctl' defined but not used
/usr/src/zaptel-1.2.2/zaptel.c:3036: warning: 'recalc_slaves' defined but not used
{standard input}:2322: Error: symbol `files' is already defined
{standard input}:2505: Error: symbol `blocks' is already defined
{standard input}:3180: Error: symbol `d_flags' is already defined
{standard input}:3818: Error: symbol `flags' is already defined
{standard input}:3893: Error: symbol `s_type' is already defined
{standard input}:4133: Error: symbol `lock' is already defined
{standard input}:4204: Error: symbol `nlink' is already defined
{standard input}:4210: Error: symbol `size' is already defined
{standard input}:4234: Error: symbol `owner' is already defined
{standard input}:4240: Error: symbol `next' is already defined
{standard input}:4246: Error: symbol `parent' is already defined
{standard input}:4258: Error: symbol `data' is already defined
{standard input}:4486: Error: symbol `release' is already defined
{standard input}:4516: Error: symbol `dma_mask' is already defined
{standard input}:4552: Error: symbol `resource' is already defined
{standard input}:4900: Error: symbol `private' is already defined
{standard input}:5198: Error: symbol `default_zone' is already defined
{standard input}:5210: Error: symbol `rv' is already defined
{standard input}:5216: Error: symbol `rv' is already defined
{standard input}:5222: Error: symbol `rv' is already defined
{standard input}:5228: Error: symbol `i' is already defined
{standard input}:5234: Error: symbol `rv' is already defined
{standard input}:5240: Error: symbol `rv' is already defined
{standard input}:5252: Error: symbol `rv' is already defined
{standard input}:5258: Error: symbol `rv' is already defined
{standard input}:5264: Error: symbol `i' is already defined
{standard input}:5270: Error: symbol `i' is already defined
{standard input}:5276: Error: symbol `j' is already defined
make[2]: *** [/usr/src/zaptel-1.2.2/zaptel.o] Error 1
make[1]: *** [_module_/usr/src/zaptel-1.2.2] Error 2
make[1]: Leaving directory `/usr/src/linux-2.6.9-22.EL'
make: *** [linux26] Error 2