Stuff
public text v1 · immutablecollect2: ld terminated with signal 11 [Segmentation fault]
make[1]: *** [libkdevfilelist.la] Error 1
make[1]: Leaving directory `/home/per/Sources/KDevelop34/3.4/parts/filelist'
make: *** [all-recursive] Error 1collect2: ld terminated with signal 11 [Segmentation fault]
make[1]: *** [libkdevfilelist.la] Error 1
make[1]: Leaving directory `/home/per/Sources/KDevelop34/3.4/parts/filelist'
make: *** [all-recursive] Error 1