rendered paste body*** Building gtkhtml *** [1/1]
make
make all-recursive
make[1]: Entering directory `/home/venkat/cvs/gnome/gtkhtml'
Making all in a11y
make[2]: Entering directory `/home/venkat/cvs/gnome/gtkhtml/a11y'
make[2]: Nothing to be done for `all'.
make[2]: Leaving directory `/home/venkat/cvs/gnome/gtkhtml/a11y'
Making all in src
make[2]: Entering directory `/home/venkat/cvs/gnome/gtkhtml/src'
/bin/sh ../libtool --tag=CC --mode=link gcc -DGDK_DISABLE_DEPRECATED=1 -DG_DISABLE_DEPRECATED=1 -DGNOME_DISABLE_DEPRECATED=1 -DPREFIX=\""/opt/evo"\" -DLIBDIR=\""/opt/evo/share"\" -DDATADIR=\""/opt/evo/share"\" -DSYSCONFDIR=\""/opt/evo/etc"\" -DICONDIR=\"/opt/evo/share/gtkhtml-3.8/icons\" -DGTKHTML_DATADIR=\""/opt/evo/share/gtkhtml-3.8"\" -DGLADE_DATADIR=\"/opt/evo/share/gtkhtml-3.8\" -DGNOMELOCALEDIR=\""/opt/evo/share/locale"\" -g -O2 -Wall -Wmissing-prototypes -o testgtkhtml testgtkhtml.o htmlurl.o libgtkhtml-3.8.la -L/opt/evo//lib -L/opt/evo/lib -lsoup-2.2 -lgnutls -lgcrypt -lgpg-error -llzo2 -lxml2 -lz -lm -lglib-2.0
gcc -DGDK_DISABLE_DEPRECATED=1 -DG_DISABLE_DEPRECATED=1 -DGNOME_DISABLE_DEPRECATED=1 -DPREFIX=\"/opt/evo\" -DLIBDIR=\"/opt/evo/share\" -DDATADIR=\"/opt/evo/share\" -DSYSCONFDIR=\"/opt/evo/etc\" -DICONDIR=\"/opt/evo/share/gtkhtml-3.8/icons\" -DGTKHTML_DATADIR=\"/opt/evo/share/gtkhtml-3.8\" -DGLADE_DATADIR=\"/opt/evo/share/gtkhtml-3.8\" -DGNOMELOCALEDIR=\"/opt/evo/share/locale\" -g -O2 -Wall -Wmissing-prototypes -o .libs/testgtkhtml testgtkhtml.o htmlurl.o ./.libs/libgtkhtml-3.8.so -L/opt/evo/lib -L/opt/gnome/lib -L/usr/X11R6/lib /opt/gnome/lib/libgnomeui-2.so -L/usr/lib /usr/lib/libjpeg.so /opt/gnome/lib/libbonoboui-2.so -lSM -lICE /opt/gnome/lib/libgnome-keyring.so /opt/gnome/lib/libgnome-2.so /usr/lib/libesd.so /usr/lib/libasound.so -lresmgr /usr/lib/libaudiofile.so /opt/gnome/lib/libgnomevfs-2.so -lssl -lcrypto -ldns_sd -lresolv -lrt /opt/gnome/lib/libbonobo-2.so /opt/gnome/lib/libgconf-2.so /opt/gnome/lib/libbonobo-activation.so /opt/gnome/lib/libORBitCosNaming-2.so /opt/gnome/lib/libORBit-2.so /usr/lib/libpopt.so /opt/evo/lib/libgthread-2.0.so /opt/gnome/lib/libgnomeprintui-2-2.so /opt/gnome/lib/libgnomeprint-2-2.so /opt/gnome/lib/libglade-2.0.so /opt/gnome/lib/libgailutil.so /opt/gnome/lib/libgnomecanvas-2.so /opt/gnome/lib/libgtk-x11-2.0.so /opt/gnome/lib/libgdk-x11-2.0.so /opt/gnome/lib/libatk-1.0.so /opt/gnome/lib/libgdk_pixbuf-2.0.so /opt/gnome/lib/libpangocairo-1.0.so /usr/lib/libcairo.so /usr/lib/libfontconfig.so -lXext /usr/lib/libglitz.so /usr/lib/libart_lgpl_2.so /opt/gnome/lib/libpangoft2-1.0.so /opt/gnome/lib/libpango-1.0.so /opt/gnome/lib/libgmodule-2.0.so /opt/evo/lib/libart_lgpl_2.so /opt/evo/lib/libgtk-x11-2.0.so /opt/evo/lib/libgdk-x11-2.0.so /opt/evo/lib/libatk-1.0.so /opt/evo/lib/libgdk_pixbuf-2.0.so /opt/evo/lib/libpangocairo-1.0.so /opt/evo/lib/libpangoft2-1.0.so /opt/evo/lib/libpango-1.0.so /opt/evo/lib/libcairo.so /opt/evo/lib/libXrender.so -lX11 -lpng12 /opt/evo/lib/libfontconfig.so /usr/lib/libexpat.so /usr/lib/libfreetype.so /usr/lib/libstdc++.so /opt/evo/lib/libgobject-2.0.so /opt/evo/lib/libgmodule-2.0.so -L/opt/evo//lib /lib/libsoup-2.2.so /opt/gnome/lib/libgobject-2.0.so /opt/gnome/lib/libgthread-2.0.so -lpthread /opt/gnome/lib/libglib-2.0.so /usr/lib/libxml2.so /usr/lib/libgnutls.so /usr/lib/libgcrypt.so /usr/lib/libgpg-error.so /opt/evo/lib/libgnutls.so /opt/evo/lib/libtasn1.so /opt/evo/lib/libgcrypt.so -lnsl /opt/evo/lib/libgpg-error.so /usr/lib/liblzo2.so /opt/evo/lib/libxml2.so -ldl -lz -lm /opt/evo/lib/libglib-2.0.so -Wl,--rpath -Wl,/opt/evo/lib
/opt/evo/lib/libgobject-2.0.so: undefined reference to `g_intern_static_string'
/opt/evo/lib/libgobject-2.0.so: undefined reference to `g_intern_string'
/opt/evo/lib/libgobject-2.0.so: undefined reference to `g_slice_alloc'
/opt/evo/lib/libgobject-2.0.so: undefined reference to `g_hash_table_ref'
/opt/evo/lib/libgobject-2.0.so: undefined reference to `g_slice_alloc0'
/opt/evo/lib/libgobject-2.0.so: undefined reference to `g_hash_table_unref'
/opt/evo/lib/libgobject-2.0.so: undefined reference to `g_slice_free1'
collect2: ld returned 1 exit status
make[2]: *** [testgtkhtml] Error 1
make[2]: Leaving directory `/home/venkat/cvs/gnome/gtkhtml/src'
make[1]: *** [all-recursive] Error 1
make[1]: Leaving directory `/home/venkat/cvs/gnome/gtkhtml'
make: *** [all] Error 2