rendered paste bodyg++ -DHAVE_CONFIG_H -I. -I.. -I../dcop -I../kio/kssl -I../kjs -I../kdefx -I../kdecore/network -I../dcop -I../libltdl -I../kdefx -I../kdecore -I../kdecore -I../kdecore/network -I../kdeui -I../kio -I../kio/kio -I../kio/kfile -I.. -I/usr/include -I. -I/usr/include -I/usr/include/libart-2.0 -DQT_THREAD_SUPPORT -D_REENTRANT -Wno-long-long -Wundef -ansi -D_XOPEN_SOURCE=500 -D_BSD_SOURCE -Wcast-align -Wconversion -Wchar-subscripts -Wall -W -Wpointer-arith -DNDEBUG -DNO_DEBUG -O2 -march=i686 -O2 -pipe -Wformat-security -Wmissing-format-attribute -Wno-non-virtual-dtor -fno-exceptions -fno-check-new -fno-common -fvisibility=hidden -fvisibility-inlines-hidden -DQT_CLEAN_NAMESPACE -DQT_NO_ASCII_CAST -DQT_NO_STL -DQT_NO_COMPAT -DQT_NO_TRANSLATION -c -o kde-config.o kde-config.cpp
/bin/sh ../libtool --silent --tag=CXX --mode=link g++ -Wno-long-long -Wundef -ansi -D_XOPEN_SOURCE=500 -D_BSD_SOURCE -Wcast-align -Wconversion -Wchar-subscripts -Wall -W -Wpointer-arith -DNDEBUG -DNO_DEBUG -O2 -march=i686 -O2 -pipe -Wformat-security -Wmissing-format-attribute -Wno-non-virtual-dtor -fno-exceptions -fno-check-new -fno-common -fvisibility=hidden -fvisibility-inlines-hidden -DQT_CLEAN_NAMESPACE -DQT_NO_ASCII_CAST -DQT_NO_STL -DQT_NO_COMPAT -DQT_NO_TRANSLATION -R /usr/lib -R /usr/lib -R /usr/lib -R /usr/share -o kde-config kde-config.o ./libkdecore.la
./.libs/libkdecore.so: undefined reference to `art_alloc(unsigned int)'
./.libs/libkdecore.so: undefined reference to `art_free(void*)'
./.libs/libkdecore.so: undefined reference to `art_realloc(void*, unsigned int)'
collect2: ld returned 1 exit status
make[4]: *** [kde-config] Error 1
make[4]: Leaving directory `/home/hussam/packages/kde3/kdelibs/src/kdelibs-3.5.6/kdecore'
make[3]: *** [all-recursive] Error 1
make[3]: Leaving directory `/home/hussam/packages/kde3/kdelibs/src/kdelibs-3.5.6/kdecore'
make[2]: *** [all] Error 2
make[2]: Leaving directory `/home/hussam/packages/kde3/kdelibs/src/kdelibs-3.5.6/kdecore'
make[1]: *** [all-recursive] Error 1
make[1]: Leaving directory `/home/hussam/packages/kde3/kdelibs/src/kdelibs-3.5.6'
make: *** [all] Error 2