[vikky@localhost desktop]$ make paranoid-install
make[1]: Entering directory `/home/vikky/build/garnome-2.17.91/desktop/alacarte'
[===== NOW BUILDING: alacarte-0.11.3 =====]
[fetch] complete for alacarte.
[checksum] complete for alacarte.
[extract] complete for alacarte.
[patch] complete for alacarte.
[fixup] complete for alacarte.
==> Building bindings/pygtk as a dependency
make[2]: Entering directory `/home/vikky/build/garnome-2.17.91/bindings/pygtk'
[===== NOW BUILDING: pygtk-2.10.4 =====]
[fetch] complete for pygtk.
[checksum] complete for pygtk.
[extract] complete for pygtk.
[patch] complete for pygtk.
[fixup] complete for pygtk.
==> Building platform/gtk+ as a dependency
make[3]: Entering directory `/home/vikky/build/garnome-2.17.91/platform/gtk+'
[===== NOW BUILDING: gtk+-2.10.9 =====]
[fetch] complete for gtk+.
[checksum] complete for gtk+.
[extract] complete for gtk+.
[patch] complete for gtk+.
[fixup] complete for gtk+.
==> Building freedesktop/shared-mime-info as a dependency
make[4]: Entering directory `/home/vikky/build/garnome-2.17.91/freedesktop/shared-mime-info'
[===== NOW BUILDING: shared-mime-info-0.19 =====]
[fetch] complete for shared-mime-info.
[checksum] complete for shared-mime-info.
[extract] complete for shared-mime-info.
[patch] complete for shared-mime-info.
[fixup] complete for shared-mime-info.
==> Building platform/glib as a dependency
make[5]: Entering directory `/home/vikky/build/garnome-2.17.91/platform/glib'
[===== NOW BUILDING: glib-2.12.9 =====]
[fetch] complete for glib.
[checksum] complete for glib.
[extract] complete for glib.
[patch] complete for glib.
[fixup] complete for glib.
==> Building platform/gtk-doc as a dependency
make[6]: Entering directory `/home/vikky/build/garnome-2.17.91/platform/gtk-doc'
[===== NOW BUILDING: gtk-doc-1.7 =====]
[fetch] complete for gtk-doc.
[checksum] complete for gtk-doc.
[extract] complete for gtk-doc.
[patch] complete for gtk-doc.
[fixup] complete for gtk-doc.
==> Building platform/libxslt as a dependency
make[7]: Entering directory `/home/vikky/build/garnome-2.17.91/platform/libxslt'
[===== NOW BUILDING: libxslt-1.1.20 =====]
[fetch] complete for libxslt.
[checksum] complete for libxslt.
[extract] complete for libxslt.
[patch] complete for libxslt.
[fixup] complete for libxslt.
==> Building platform/libxml2 as a dependency
make[8]: Entering directory `/home/vikky/build/garnome-2.17.91/platform/libxml2'
[===== NOW BUILDING: libxml2-2.6.27 =====]
[fetch] complete for libxml2.
[checksum] complete for libxml2.
[extract] complete for libxml2.
[patch] complete for libxml2.
[fixup] complete for libxml2.
[configure] complete for libxml2.
==> Running make in work/main.d/libxml2-2.6.27
make[9]: Entering directory `/home/vikky/build/garnome-2.17.91/platform/libxml2/work/main.d/libxml2-2.6.27'
make all-recursive
make[10]: Entering directory `/home/vikky/build/garnome-2.17.91/platform/libxml2/work/main.d/libxml2-2.6.27'
Making all in include
make[11]: Entering directory `/home/vikky/build/garnome-2.17.91/platform/libxml2/work/main.d/libxml2-2.6.27/include'
Making all in libxml
make[12]: Entering directory `/home/vikky/build/garnome-2.17.91/platform/libxml2/work/main.d/libxml2-2.6.27/include/libxml'
make[12]: Nothing to be done for `all'.
make[12]: Leaving directory `/home/vikky/build/garnome-2.17.91/platform/libxml2/work/main.d/libxml2-2.6.27/include/libxml'
make[12]: Entering directory `/home/vikky/build/garnome-2.17.91/platform/libxml2/work/main.d/libxml2-2.6.27/include'
make[12]: Nothing to be done for `all-am'.
make[12]: Leaving directory `/home/vikky/build/garnome-2.17.91/platform/libxml2/work/main.d/libxml2-2.6.27/include'
make[11]: Leaving directory `/home/vikky/build/garnome-2.17.91/platform/libxml2/work/main.d/libxml2-2.6.27/include'
Making all in .
make[11]: Entering directory `/home/vikky/build/garnome-2.17.91/platform/libxml2/work/main.d/libxml2-2.6.27'
make[11]: Nothing to be done for `all-am'.
make[11]: Leaving directory `/home/vikky/build/garnome-2.17.91/platform/libxml2/work/main.d/libxml2-2.6.27'
Making all in doc
make[11]: Entering directory `/home/vikky/build/garnome-2.17.91/platform/libxml2/work/main.d/libxml2-2.6.27/doc'
Making all in devhelp
make[12]: Entering directory `/home/vikky/build/garnome-2.17.91/platform/libxml2/work/main.d/libxml2-2.6.27/doc/devhelp'
make[12]: Nothing to be done for `all'.
make[12]: Leaving directory `/home/vikky/build/garnome-2.17.91/platform/libxml2/work/main.d/libxml2-2.6.27/doc/devhelp'
Making all in examples
make[12]: Entering directory `/home/vikky/build/garnome-2.17.91/platform/libxml2/work/main.d/libxml2-2.6.27/doc/examples'
make[12]: Nothing to be done for `all'.
make[12]: Leaving directory `/home/vikky/build/garnome-2.17.91/platform/libxml2/work/main.d/libxml2-2.6.27/doc/examples'
make[12]: Entering directory `/home/vikky/build/garnome-2.17.91/platform/libxml2/work/main.d/libxml2-2.6.27/doc'
make[12]: Nothing to be done for `all-am'.
make[12]: Leaving directory `/home/vikky/build/garnome-2.17.91/platform/libxml2/work/main.d/libxml2-2.6.27/doc'
make[11]: Leaving directory `/home/vikky/build/garnome-2.17.91/platform/libxml2/work/main.d/libxml2-2.6.27/doc'
Making all in example
make[11]: Entering directory `/home/vikky/build/garnome-2.17.91/platform/libxml2/work/main.d/libxml2-2.6.27/example'
make[11]: Nothing to be done for `all'.
make[11]: Leaving directory `/home/vikky/build/garnome-2.17.91/platform/libxml2/work/main.d/libxml2-2.6.27/example'
Making all in xstc
make[11]: Entering directory `/home/vikky/build/garnome-2.17.91/platform/libxml2/work/main.d/libxml2-2.6.27/xstc'
make[11]: Nothing to be done for `all'.
make[11]: Leaving directory `/home/vikky/build/garnome-2.17.91/platform/libxml2/work/main.d/libxml2-2.6.27/xstc'
Making all in python
make[11]: Entering directory `/home/vikky/build/garnome-2.17.91/platform/libxml2/work/main.d/libxml2-2.6.27/python'
Making all in .
make[12]: Entering directory `/home/vikky/build/garnome-2.17.91/platform/libxml2/work/main.d/libxml2-2.6.27/python'
if /bin/sh ../libtool --tag=CC --mode=compile cc -DHAVE_CONFIG_H -I. -I. -I.. -I/usr/include/python2.2 -I../include -I../include -I../python -I/opt/garnome/include -g -I/opt/garnome/include -L/opt/garnome/lib -O2 -pipe -pedantic -W -Wformat -Wunused -Wimplicit -Wreturn-type -Wswitch -Wcomment -Wtrigraphs -Wformat -Wchar-subscripts -Wuninitialized -Wparentheses -Wshadow -Wpointer-arith -Wcast-align -Wwrite-strings -Waggregate-return -Wstrict-prototypes -Wmissing-prototypes -Wnested-externs -Winline -Wredundant-decls -MT types.lo -MD -MP -MF ".deps/types.Tpo" -c -o types.lo types.c; \
then mv -f ".deps/types.Tpo" ".deps/types.Plo"; else rm -f ".deps/types.Tpo"; exit 1; fi
cc -DHAVE_CONFIG_H -I. -I. -I.. -I/usr/include/python2.2 -I../include -I../include -I../python -I/opt/garnome/include -g -I/opt/garnome/include -L/opt/garnome/lib -O2 -pipe -pedantic -W -Wformat -Wunused -Wimplicit -Wreturn-type -Wswitch -Wcomment -Wtrigraphs -Wformat -Wchar-subscripts -Wuninitialized -Wparentheses -Wshadow -Wpointer-arith -Wcast-align -Wwrite-strings -Waggregate-return -Wstrict-prototypes -Wmissing-prototypes -Wnested-externs -Winline -Wredundant-decls -MT types.lo -MD -MP -MF .deps/types.Tpo -c types.c -fPIC -DPIC -o .libs/types.o
In file included from /usr/include/python2.2/Python.h:73,
from libxml_wrap.h:1,
from types.c:9:
/usr/include/python2.2/longobject.h:48: warning: ISO C89 does not support `long long'
/usr/include/python2.2/longobject.h:49: warning: ISO C89 does not support `long long'
/usr/include/python2.2/longobject.h:50: warning: ISO C89 does not support `long long'
/usr/include/python2.2/longobject.h:51: warning: ISO C89 does not support `long long'
In file included from /usr/include/python2.2/Python.h:109,
from libxml_wrap.h:1,
from types.c:9:
/usr/include/python2.2/abstract.h:286: warning: redundant redeclaration of `PyCallable_Check' in same scope
/usr/include/python2.2/object.h:347: warning: previous declaration of `PyCallable_Check'
types.c: In function `libxml_xmlXPathObjectPtrConvert':
types.c:528: parse error before "PyBool_Check"
types.c:528: warning: implicit declaration of function `PyBool_Check'
types.c:528: parse error before '{' token
types.c: At top level:
types.c:541: warning: type defaults to `int' in declaration of `str'
types.c:541: `obj' undeclared here (not in a function)
types.c:542: `obj' undeclared here (not in a function)
types.c:542: warning: initialization makes integer from pointer without a cast
types.c:542: initializer element is not constant
types.c:542: ISO C forbids data definition with no type or storage class
types.c:543: warning: type defaults to `int' in declaration of `ret'
types.c:543: warning: passing arg 1 of `xmlXPathWrapString' makes pointer from integer without a cast
types.c:543: warning: initialization makes integer from pointer without a cast
types.c:543: initializer element is not constant
types.c:543: ISO C forbids data definition with no type or storage class
types.c:544: parse error before '}' token
types.c:551: warning: type defaults to `int' in declaration of `set'
types.c:551: conflicting types for `set'
types.c:549: previous declaration of `set'
types.c:551: warning: redundant redeclaration of `set' in same scope
types.c:549: warning: previous declaration of `set'
types.c:551: ISO C forbids data definition with no type or storage class
types.c:553: parse error before "for"
types.c:558: warning: type defaults to `int' in declaration of `cur'
types.c:558: conflicting types for `cur'
types.c:548: previous declaration of `cur'
types.c:558: warning: redundant redeclaration of `cur' in same scope
types.c:548: warning: previous declaration of `cur'
types.c:558: ISO C forbids data definition with no type or storage class
types.c:559: parse error before "if"
types.c:566: `inst' undeclared here (not in a function)
types.c:568: parse error before "if"
types.c:573: parse error before "if"
types.c:573: parse error before '&&' token
types.c:573: warning: type defaults to `int' in declaration of `__result'
types.c:573: ISO C forbids data definition with no type or storage class
types.c:573: parse error before '}' token
types.c:573: conflicting declarations of `__result'
types.c:573: `__result' previously declared here
types.c:573: warning: `__result' was declared `extern' and later `static'
types.c:573: `type' undeclared here (not in a function)
types.c:573: `__s2' undeclared here (not in a function)
types.c:573: parse error before "if"
types.c:573: warning: type defaults to `int' in declaration of `__result'
types.c:573: conflicting declarations of `__result'
types.c:573: `__result' previously defined here
types.c:573: ISO C forbids data definition with no type or storage class
types.c:573: parse error before '}' token
types.c:573: warning: type defaults to `int' in declaration of `__result'
types.c:573: warning: redundant redeclaration of `__result' in same scope
types.c:573: warning: previous declaration of `__result'
types.c:573: ISO C forbids data definition with no type or storage class
types.c:573: parse error before '}' token
types.c:573: conflicting declarations of `__result'
types.c:573: `__result' previously declared here
types.c:573: warning: `__result' was declared `extern' and later `static'
types.c:573: `__s1' undeclared here (not in a function)
types.c:573: parse error before "if"
types.c:573: warning: type defaults to `int' in declaration of `__result'
types.c:573: conflicting declarations of `__result'
types.c:573: `__result' previously defined here
types.c:573: ISO C forbids data definition with no type or storage class
types.c:573: parse error before '}' token
types.c:590: warning: type defaults to `int' in declaration of `ret'
types.c:590: redefinition of `ret'
types.c:543: `ret' previously defined here
types.c:590: warning: passing arg 1 of `xmlXPathWrapNodeSet' makes pointer from integer without a cast
types.c:590: warning: initialization makes integer from pointer without a cast
types.c:590: initializer element is not constant
types.c:590: ISO C forbids data definition with no type or storage class
types.c:591: parse error before '}' token
types.c: In function `libxml_xmlValidCtxtPtrWrap':
types.c:603: warning: declaration of `ret' shadows a global declaration
types.c:590: warning: shadowed declaration is here
types.c: In function `libxml_xmlCatalogPtrWrap':
types.c:623: warning: declaration of `ret' shadows a global declaration
types.c:590: warning: shadowed declaration is here
types.c: In function `libxml_xmlOutputBufferPtrWrap':
types.c:641: warning: declaration of `ret' shadows a global declaration
types.c:590: warning: shadowed declaration is here
types.c: In function `libxml_xmlParserInputBufferPtrWrap':
types.c:659: warning: declaration of `ret' shadows a global declaration
types.c:590: warning: shadowed declaration is here
types.c: In function `libxml_xmlRegexpPtrWrap':
types.c:678: warning: declaration of `ret' shadows a global declaration
types.c:590: warning: shadowed declaration is here
types.c: In function `libxml_xmlTextReaderPtrWrap':
types.c:697: warning: declaration of `ret' shadows a global declaration
types.c:590: warning: shadowed declaration is here
types.c: In function `libxml_xmlTextReaderLocatorPtrWrap':
types.c:715: warning: declaration of `ret' shadows a global declaration
types.c:590: warning: shadowed declaration is here
types.c: In function `libxml_xmlRelaxNGPtrWrap':
types.c:734: warning: declaration of `ret' shadows a global declaration
types.c:590: warning: shadowed declaration is here
types.c: In function `libxml_xmlRelaxNGParserCtxtPtrWrap':
types.c:752: warning: declaration of `ret' shadows a global declaration
types.c:590: warning: shadowed declaration is here
types.c: In function `libxml_xmlRelaxNGValidCtxtPtrWrap':
types.c:769: warning: declaration of `ret' shadows a global declaration
types.c:590: warning: shadowed declaration is here
types.c: In function `libxml_xmlSchemaPtrWrap':
types.c:787: warning: declaration of `ret' shadows a global declaration
types.c:590: warning: shadowed declaration is here
types.c: In function `libxml_xmlSchemaParserCtxtPtrWrap':
types.c:805: warning: declaration of `ret' shadows a global declaration
types.c:590: warning: shadowed declaration is here
types.c: In function `libxml_xmlSchemaValidCtxtPtrWrap':
types.c:824: warning: declaration of `ret' shadows a global declaration
types.c:590: warning: shadowed declaration is here
types.c: In function `libxml_xmlErrorPtrWrap':
types.c:845: warning: declaration of `ret' shadows a global declaration
types.c:590: warning: shadowed declaration is here
/usr/include/wchar.h: At top level:
types.c:573: register name not specified for `__result'
types.c:573: register name not specified for `__result'
{standard input}: Assembler messages:
{standard input}:1551: Error: symbol `__result' is already defined
{standard input}:1551: Warning: rest of line ignored; first ignored character is `,'
{standard input}:1553: Error: symbol `__result' is already defined
{standard input}:1553: Warning: rest of line ignored; first ignored character is `,'
{standard input}:1554: Error: symbol `__result' is already defined
{standard input}:1554: Warning: rest of line ignored; first ignored character is `,'
{standard input}:1559: Error: symbol `ret' is already defined
make[12]: *** [types.lo] Error 1
make[12]: Leaving directory `/home/vikky/build/garnome-2.17.91/platform/libxml2/work/main.d/libxml2-2.6.27/python'
make[11]: *** [all-recursive] Error 1
make[11]: Leaving directory `/home/vikky/build/garnome-2.17.91/platform/libxml2/work/main.d/libxml2-2.6.27/python'
make[10]: *** [all-recursive] Error 1
make[10]: Leaving directory `/home/vikky/build/garnome-2.17.91/platform/libxml2/work/main.d/libxml2-2.6.27'
make[9]: *** [all] Error 2
make[9]: Leaving directory `/home/vikky/build/garnome-2.17.91/platform/libxml2/work/main.d/libxml2-2.6.27'
make[8]: *** [build-work/main.d/libxml2-2.6.27/Makefile] Error 2
make[8]: Leaving directory `/home/vikky/build/garnome-2.17.91/platform/libxml2'
make[7]: *** [../../platform/libxml2/cookies/main.d/install] Error 2
make[7]: Leaving directory `/home/vikky/build/garnome-2.17.91/platform/libxslt'
make[6]: *** [../../platform/libxslt/cookies/main.d/install] Error 2
make[6]: Leaving directory `/home/vikky/build/garnome-2.17.91/platform/gtk-doc'
make[5]: *** [../../platform/gtk-doc/cookies/main.d/install] Error 2
make[5]: Leaving directory `/home/vikky/build/garnome-2.17.91/platform/glib'
make[4]: *** [../../platform/glib/cookies/main.d/install] Error 2
make[4]: Leaving directory `/home/vikky/build/garnome-2.17.91/freedesktop/shared-mime-info'
make[3]: *** [../../freedesktop/shared-mime-info/cookies/main.d/install] Error 2
make[3]: Leaving directory `/home/vikky/build/garnome-2.17.91/platform/gtk+'
make[2]: *** [../../platform/gtk+/cookies/main.d/install] Error 2
make[2]: Leaving directory `/home/vikky/build/garnome-2.17.91/bindings/pygtk'
make[1]: *** [../../bindings/pygtk/cookies/main.d/install] Error 2
make[1]: Leaving directory `/home/vikky/build/garnome-2.17.91/desktop/alacarte'
make: *** [paranoid-install] Error 2