All pastes #37480 Raw Edit

Unnamed

public text v1 · immutable
#37480 ·published 2006-01-19 22:19 UTC
rendered paste body
In file included from ORB.cpp:30:
../include/ossie/ossieSupport.h:33:22: ossie/cf.h: No such file or directory
../include/ossie/ossieSupport.h:34:33: ossie/StandardEvent.h: No such file or directory
In file included from ORB.cpp:30:
../include/ossie/ossieSupport.h:96: error: type specifier omitted for parameter
   `StandardEvent'
../include/ossie/ossieSupport.h:96: error: syntax error before `::' token
../include/ossie/ossieSupport.h:117: error: `CF' was not declared in this scope
../include/ossie/ossieSupport.h:117: error: syntax error before `::' token
../include/ossie/ossieSupport.h:127: error: `CF' was not declared in this scope
../include/ossie/ossieSupport.h:127: error: syntax error before `::' token
../include/ossie/ossieSupport.h:128: error: `CF' was not declared in this scope
../include/ossie/ossieSupport.h:128: error: syntax error before `::' token
../include/ossie/ossieSupport.h:129: error: `CF' was not declared in this scope
../include/ossie/ossieSupport.h:129: error: syntax error before `::' token
../include/ossie/ossieSupport.h:130: error: `CF' was not declared in this scope
../include/ossie/ossieSupport.h:130: error: syntax error before `::' token
../include/ossie/ossieSupport.h:132: error: `CF' was not declared in this scope
../include/ossie/ossieSupport.h:132: error: syntax error before `::' token
../include/ossie/ossieSupport.h:138: error: syntax error before `::' token
../include/ossie/ossieSupport.h:148: error: syntax error before `::' token
../include/ossie/ossieSupport.h:149: error: syntax error before `::' token
../include/ossie/ossieSupport.h:150: error: syntax error before `::' token
../include/ossie/ossieSupport.h:151: error: syntax error before `::' token
../include/ossie/ossieSupport.h:153: error: syntax error before `::' token
../include/ossie/ossieSupport.h:171: error: syntax error before `::' token
../include/ossie/ossieSupport.h:181: error: `CF' was not declared in this scope
../include/ossie/ossieSupport.h:181: error: syntax error before `::' token
../include/ossie/ossieSupport.h:183: error: syntax error before `::' token
../include/ossie/ossieSupport.h:184: error: syntax error before `::' token
../include/ossie/ossieSupport.h:185: error: syntax error before `::' token
../include/ossie/ossieSupport.h:186: error: syntax error before `::' token
../include/ossie/ossieSupport.h:187: error: syntax error before `::' token
../include/ossie/ossieSupport.h:189: error: syntax error before `::' token
../include/ossie/ossieSupport.h:195: error: syntax error before `::' token
../include/ossie/ossieSupport.h:197: error: syntax error before `::' token
../include/ossie/ossieSupport.h:204: error: syntax error before `::' token
../include/ossie/ossieSupport.h:193: warning: `class
   ossieSupport::ConnectionInfo' only defines private constructors and has no
   friends
make[1]: *** [ORB.lo] Error 1
make[1]: Leaving directory `/home/jasuris/ossie/ossie-0.0.4-13JAN2006/parser'
make: *** [all-recursive] Error 1