All pastes #374698 Raw Edit

shane

public text v1 · immutable
#374698 ·published 2007-02-27 19:39 UTC
rendered paste body
This file contains any messages produced by compilers whilerunning configure, to aid debugging if configure makes a mistake.It was created by mpd configure 0.12.1, which wasgenerated by GNU Autoconf 2.59.  Invocation command line was  $ ./configure --prefix=/usr## --------- #### Platform. #### --------- ##hostname = zenwalkuname -m = i686uname -r = 2.6.20uname -s = Linuxuname -v = #1 SMP PREEMPT Mon Feb 5 22:21:23 CET 2007/usr/bin/uname -p = i686/bin/uname -X     = unknown/bin/arch              = i686/usr/bin/arch -k       = unknown/usr/convex/getsysinfo = unknownhostinfo               = unknown/bin/machine           = unknown/usr/bin/oslevel       = unknown/bin/universe          = unknownPATH: /usr/local/binPATH: /usr/binPATH: /binPATH: /usr/games/binPATH: .## ----------- #### Core tests. #### ----------- ##configure:1628: checking for a BSD-compatible installconfigure:1683: result: /usr/bin/ginstall -cconfigure:1694: checking whether build environment is saneconfigure:1737: result: yesconfigure:1770: checking for gawkconfigure:1786: found /usr/bin/gawkconfigure:1796: result: gawkconfigure:1806: checking whether make sets $(MAKE)configure:1826: result: yesconfigure:2023: checking for gccconfigure:2039: found /usr/bin/gccconfigure:2049: result: gccconfigure:2293: checking for C compiler versionconfigure:2296: gcc --version </dev/null >&5gcc (GCC) 3.4.6Copyright (C) 2006 Free Software Foundation, Inc.This is free software; see the source for copying conditions.  There is NOwarranty; not even for MERCHANTABILITY or FITNESS FOR A PARTICULAR PURPOSE.configure:2299: $? = 0configure:2301: gcc -v </dev/null >&5Reading specs from /usr/lib/gcc/i486-slackware-linux/3.4.6/specsConfigured with: ../gcc-3.4.6/configure --prefix=/usr --enable-shared --enable-threads=posix --enable-__cxa_atexit --disable-checking --with-gnu-ld --verbose --target=i486-slackware-linux --host=i486-slackware-linuxThread model: posixgcc version 3.4.6configure:2304: $? = 0configure:2306: gcc -V </dev/null >&5gcc: `-V' option must have argumentconfigure:2309: $? = 1configure:2332: checking for C compiler default output file nameconfigure:2335: gcc    conftest.c  >&5configure:2338: $? = 0configure:2384: result: a.outconfigure:2389: checking whether the C compiler worksconfigure:2395: ./a.outconfigure:2398: $? = 0configure:2415: result: yesconfigure:2422: checking whether we are cross compilingconfigure:2424: result: noconfigure:2427: checking for suffix of executablesconfigure:2429: gcc -o conftest    conftest.c  >&5configure:2432: $? = 0configure:2457: result: configure:2463: checking for suffix of object filesconfigure:2484: gcc -c   conftest.c >&5configure:2487: $? = 0configure:2509: result: oconfigure:2513: checking whether we are using the GNU C compilerconfigure:2537: gcc -c   conftest.c >&5configure:2543: $? = 0configure:2547: test -z 			 || test ! -s conftest.errconfigure:2550: $? = 0configure:2553: test -s conftest.oconfigure:2556: $? = 0configure:2569: result: yesconfigure:2575: checking whether gcc accepts -gconfigure:2596: gcc -c -g  conftest.c >&5configure:2602: $? = 0configure:2606: test -z 			 || test ! -s conftest.errconfigure:2609: $? = 0configure:2612: test -s conftest.oconfigure:2615: $? = 0configure:2626: result: yesconfigure:2643: checking for gcc option to accept ANSI Cconfigure:2713: gcc  -c -g -O2  conftest.c >&5configure:2719: $? = 0configure:2723: test -z 			 || test ! -s conftest.errconfigure:2726: $? = 0configure:2729: test -s conftest.oconfigure:2732: $? = 0configure:2750: result: none neededconfigure:2768: gcc -c -g -O2  conftest.c >&5conftest.c:2: error: syntax error before "me"configure:2774: $? = 1configure: failed program was:| #ifndef __cplusplus|   choke me| #endifconfigure:2926: checking for style of include used by makeconfigure:2954: result: GNUconfigure:2982: checking dependency style of gccconfigure:3044: result: gcc3configure:3062: checking for a BSD-compatible installconfigure:3117: result: /usr/bin/ginstall -cconfigure:3206: checking build system typeconfigure:3224: result: i686-pc-linux-gnuconfigure:3232: checking host system typeconfigure:3246: result: i686-pc-linux-gnuconfigure:3254: checking for a sed that does not truncate outputconfigure:3308: result: /usr/bin/sedconfigure:3311: checking for egrepconfigure:3321: result: grep -Econfigure:3337: checking for ld used by gccconfigure:3404: result: /usr/i486-slackware-linux/bin/ldconfigure:3413: checking if the linker (/usr/i486-slackware-linux/bin/ld) is GNU ldconfigure:3428: result: yesconfigure:3433: checking for /usr/i486-slackware-linux/bin/ld option to reload object filesconfigure:3440: result: -rconfigure:3458: checking for BSD-compatible nmconfigure:3507: result: /usr/bin/nm -Bconfigure:3511: checking whether ln -s worksconfigure:3515: result: yesconfigure:3522: checking how to recognise dependent librariesconfigure:3698: result: pass_allconfigure:3935: checking how to run the C preprocessorconfigure:3970: gcc -E  conftest.cconfigure:3976: $? = 0configure:4008: gcc -E  conftest.cconftest.c:11:28: ac_nonexistent.h: No such file or directoryconfigure:4014: $? = 1configure: failed program was:| /* confdefs.h.  */| | #define PACKAGE_NAME "mpd"| #define PACKAGE_TARNAME "mpd"| #define PACKAGE_VERSION "0.12.1"| #define PACKAGE_STRING "mpd 0.12.1"| #define PACKAGE_BUGREPORT "warren.dukes@gmail.com"| #define PACKAGE "mpd"| #define VERSION "0.12.1"| /* end confdefs.h.  */| #include <ac_nonexistent.h>configure:4053: result: gcc -Econfigure:4077: gcc -E  conftest.cconfigure:4083: $? = 0configure:4115: gcc -E  conftest.cconftest.c:11:28: ac_nonexistent.h: No such file or directoryconfigure:4121: $? = 1configure: failed program was:| /* confdefs.h.  */| | #define PACKAGE_NAME "mpd"| #define PACKAGE_TARNAME "mpd"| #define PACKAGE_VERSION "0.12.1"| #define PACKAGE_STRING "mpd 0.12.1"| #define PACKAGE_BUGREPORT "warren.dukes@gmail.com"| #define PACKAGE "mpd"| #define VERSION "0.12.1"| /* end confdefs.h.  */| #include <ac_nonexistent.h>configure:4165: checking for ANSI C header filesconfigure:4190: gcc -c -g -O2  conftest.c >&5configure:4196: $? = 0configure:4200: test -z 			 || test ! -s conftest.errconfigure:4203: $? = 0configure:4206: test -s conftest.oconfigure:4209: $? = 0configure:4298: gcc -o conftest -g -O2   conftest.c  >&5configure:4301: $? = 0configure:4303: ./conftestconfigure:4306: $? = 0configure:4321: result: yesconfigure:4345: checking for sys/types.hconfigure:4361: gcc -c -g -O2  conftest.c >&5configure:4367: $? = 0configure:4371: test -z 			 || test ! -s conftest.errconfigure:4374: $? = 0configure:4377: test -s conftest.oconfigure:4380: $? = 0configure:4391: result: yesconfigure:4345: checking for sys/stat.hconfigure:4361: gcc -c -g -O2  conftest.c >&5configure:4367: $? = 0configure:4371: test -z 			 || test ! -s conftest.errconfigure:4374: $? = 0configure:4377: test -s conftest.oconfigure:4380: $? = 0configure:4391: result: yesconfigure:4345: checking for stdlib.hconfigure:4361: gcc -c -g -O2  conftest.c >&5configure:4367: $? = 0configure:4371: test -z 			 || test ! -s conftest.errconfigure:4374: $? = 0configure:4377: test -s conftest.oconfigure:4380: $? = 0configure:4391: result: yesconfigure:4345: checking for string.hconfigure:4361: gcc -c -g -O2  conftest.c >&5configure:4367: $? = 0configure:4371: test -z 			 || test ! -s conftest.errconfigure:4374: $? = 0configure:4377: test -s conftest.oconfigure:4380: $? = 0configure:4391: result: yesconfigure:4345: checking for memory.hconfigure:4361: gcc -c -g -O2  conftest.c >&5configure:4367: $? = 0configure:4371: test -z 			 || test ! -s conftest.errconfigure:4374: $? = 0configure:4377: test -s conftest.oconfigure:4380: $? = 0configure:4391: result: yesconfigure:4345: checking for strings.hconfigure:4361: gcc -c -g -O2  conftest.c >&5configure:4367: $? = 0configure:4371: test -z 			 || test ! -s conftest.errconfigure:4374: $? = 0configure:4377: test -s conftest.oconfigure:4380: $? = 0configure:4391: result: yesconfigure:4345: checking for inttypes.hconfigure:4361: gcc -c -g -O2  conftest.c >&5configure:4367: $? = 0configure:4371: test -z 			 || test ! -s conftest.errconfigure:4374: $? = 0configure:4377: test -s conftest.oconfigure:4380: $? = 0configure:4391: result: yesconfigure:4345: checking for stdint.hconfigure:4361: gcc -c -g -O2  conftest.c >&5configure:4367: $? = 0configure:4371: test -z 			 || test ! -s conftest.errconfigure:4374: $? = 0configure:4377: test -s conftest.oconfigure:4380: $? = 0configure:4391: result: yesconfigure:4345: checking for unistd.hconfigure:4361: gcc -c -g -O2  conftest.c >&5configure:4367: $? = 0configure:4371: test -z 			 || test ! -s conftest.errconfigure:4374: $? = 0configure:4377: test -s conftest.oconfigure:4380: $? = 0configure:4391: result: yesconfigure:4417: checking dlfcn.h usabilityconfigure:4429: gcc -c -g -O2  conftest.c >&5configure:4435: $? = 0configure:4439: test -z 			 || test ! -s conftest.errconfigure:4442: $? = 0configure:4445: test -s conftest.oconfigure:4448: $? = 0configure:4458: result: yesconfigure:4462: checking dlfcn.h presenceconfigure:4472: gcc -E  conftest.cconfigure:4478: $? = 0configure:4498: result: yesconfigure:4533: checking for dlfcn.hconfigure:4540: result: yesconfigure:4605: checking for g++configure:4621: found /usr/bin/g++configure:4631: result: g++configure:4647: checking for C++ compiler versionconfigure:4650: g++ --version </dev/null >&5g++ (GCC) 3.4.6Copyright (C) 2006 Free Software Foundation, Inc.This is free software; see the source for copying conditions.  There is NOwarranty; not even for MERCHANTABILITY or FITNESS FOR A PARTICULAR PURPOSE.configure:4653: $? = 0configure:4655: g++ -v </dev/null >&5Reading specs from /usr/lib/gcc/i486-slackware-linux/3.4.6/specsConfigured with: ../gcc-3.4.6/configure --prefix=/usr --enable-shared --enable-threads=posix --enable-__cxa_atexit --disable-checking --with-gnu-ld --verbose --target=i486-slackware-linux --host=i486-slackware-linuxThread model: posixgcc version 3.4.6configure:4658: $? = 0configure:4660: g++ -V </dev/null >&5g++: `-V' option must have argumentconfigure:4663: $? = 1configure:4666: checking whether we are using the GNU C++ compilerconfigure:4690: g++ -c   conftest.cc >&5configure:4696: $? = 0configure:4700: test -z 			 || test ! -s conftest.errconfigure:4703: $? = 0configure:4706: test -s conftest.oconfigure:4709: $? = 0configure:4722: result: yesconfigure:4728: checking whether g++ accepts -gconfigure:4749: g++ -c -g  conftest.cc >&5configure:4755: $? = 0configure:4759: test -z 			 || test ! -s conftest.errconfigure:4762: $? = 0configure:4765: test -s conftest.oconfigure:4768: $? = 0configure:4779: result: yesconfigure:4821: g++ -c -g -O2  conftest.cc >&5configure:4827: $? = 0configure:4831: test -z 			 || test ! -s conftest.errconfigure:4834: $? = 0configure:4837: test -s conftest.oconfigure:4840: $? = 0configure:4866: g++ -c -g -O2  conftest.cc >&5conftest.cc: In function `int main()':conftest.cc:26: error: `exit' was not declared in this scopeconfigure:4872: $? = 1configure: failed program was:| /* confdefs.h.  */| | #define PACKAGE_NAME "mpd"| #define PACKAGE_TARNAME "mpd"| #define PACKAGE_VERSION "0.12.1"| #define PACKAGE_STRING "mpd 0.12.1"| #define PACKAGE_BUGREPORT "warren.dukes@gmail.com"| #define PACKAGE "mpd"| #define VERSION "0.12.1"| #define STDC_HEADERS 1| #define HAVE_SYS_TYPES_H 1| #define HAVE_SYS_STAT_H 1| #define HAVE_STDLIB_H 1| #define HAVE_STRING_H 1| #define HAVE_MEMORY_H 1| #define HAVE_STRINGS_H 1| #define HAVE_INTTYPES_H 1| #define HAVE_STDINT_H 1| #define HAVE_UNISTD_H 1| #define HAVE_DLFCN_H 1| /* end confdefs.h.  */| | int| main ()| {| exit (42);|   ;|   return 0;| }configure:4821: g++ -c -g -O2  conftest.cc >&5configure:4827: $? = 0configure:4831: test -z 			 || test ! -s conftest.errconfigure:4834: $? = 0configure:4837: test -s conftest.oconfigure:4840: $? = 0configure:4866: g++ -c -g -O2  conftest.cc >&5configure:4872: $? = 0configure:4876: test -z 			 || test ! -s conftest.errconfigure:4879: $? = 0configure:4882: test -s conftest.oconfigure:4885: $? = 0configure:4910: checking dependency style of g++configure:4972: result: gcc3configure:4987: checking how to run the C++ preprocessorconfigure:5018: g++ -E  conftest.ccconfigure:5024: $? = 0configure:5056: g++ -E  conftest.ccconftest.cc:25:28: ac_nonexistent.h: No such file or directoryconfigure:5062: $? = 1configure: failed program was:| /* confdefs.h.  */| | #define PACKAGE_NAME "mpd"| #define PACKAGE_TARNAME "mpd"| #define PACKAGE_VERSION "0.12.1"| #define PACKAGE_STRING "mpd 0.12.1"| #define PACKAGE_BUGREPORT "warren.dukes@gmail.com"| #define PACKAGE "mpd"| #define VERSION "0.12.1"| #define STDC_HEADERS 1| #define HAVE_SYS_TYPES_H 1| #define HAVE_SYS_STAT_H 1| #define HAVE_STDLIB_H 1| #define HAVE_STRING_H 1| #define HAVE_MEMORY_H 1| #define HAVE_STRINGS_H 1| #define HAVE_INTTYPES_H 1| #define HAVE_STDINT_H 1| #define HAVE_UNISTD_H 1| #define HAVE_DLFCN_H 1| #ifdef __cplusplus| extern "C" void std::exit (int) throw (); using std::exit;| #endif| /* end confdefs.h.  */| #include <ac_nonexistent.h>configure:5101: result: g++ -Econfigure:5125: g++ -E  conftest.ccconfigure:5131: $? = 0configure:5163: g++ -E  conftest.ccconftest.cc:25:28: ac_nonexistent.h: No such file or directoryconfigure:5169: $? = 1configure: failed program was:| /* confdefs.h.  */| | #define PACKAGE_NAME "mpd"| #define PACKAGE_TARNAME "mpd"| #define PACKAGE_VERSION "0.12.1"| #define PACKAGE_STRING "mpd 0.12.1"| #define PACKAGE_BUGREPORT "warren.dukes@gmail.com"| #define PACKAGE "mpd"| #define VERSION "0.12.1"| #define STDC_HEADERS 1| #define HAVE_SYS_TYPES_H 1| #define HAVE_SYS_STAT_H 1| #define HAVE_STDLIB_H 1| #define HAVE_STRING_H 1| #define HAVE_MEMORY_H 1| #define HAVE_STRINGS_H 1| #define HAVE_INTTYPES_H 1| #define HAVE_STDINT_H 1| #define HAVE_UNISTD_H 1| #define HAVE_DLFCN_H 1| #ifdef __cplusplus| extern "C" void std::exit (int) throw (); using std::exit;| #endif| /* end confdefs.h.  */| #include <ac_nonexistent.h>configure:5266: checking for g77configure:5295: result: noconfigure:5266: checking for f77configure:5295: result: noconfigure:5266: checking for xlfconfigure:5295: result: noconfigure:5266: checking for frtconfigure:5295: result: noconfigure:5266: checking for pgf77configure:5295: result: noconfigure:5266: checking for fort77configure:5295: result: noconfigure:5266: checking for fl32configure:5295: result: noconfigure:5266: checking for af77configure:5295: result: noconfigure:5266: checking for f90configure:5295: result: noconfigure:5266: checking for xlf90configure:5295: result: noconfigure:5266: checking for pgf90configure:5295: result: noconfigure:5266: checking for epcf90configure:5295: result: noconfigure:5266: checking for f95configure:5295: result: noconfigure:5266: checking for fortconfigure:5295: result: noconfigure:5266: checking for xlf95configure:5295: result: noconfigure:5266: checking for ifcconfigure:5295: result: noconfigure:5266: checking for efcconfigure:5295: result: noconfigure:5266: checking for pgf95configure:5295: result: noconfigure:5266: checking for lf95configure:5295: result: noconfigure:5266: checking for gfortranconfigure:5295: result: noconfigure:5307: checking for Fortran 77 compiler versionconfigure:5310:  --version </dev/null >&5./configure: line 5311: --version: command not foundconfigure:5313: $? = 127configure:5315:  -v </dev/null >&5./configure: line 5316: -v: command not foundconfigure:5318: $? = 127configure:5320:  -V </dev/null >&5./configure: line 5321: -V: command not foundconfigure:5323: $? = 127configure:5331: checking whether we are using the GNU Fortran 77 compilerconfigure:5345:  -c  conftest.F >&5./configure: line 5346: -c: command not foundconfigure:5351: $? = 127configure: failed program was:|       program main| #ifndef __GNUC__|        choke me| #endif| |       endconfigure:5377: result: noconfigure:5383: checking whether  accepts -gconfigure:5395:  -c -g conftest.f >&5./configure: line 5396: -c: command not foundconfigure:5401: $? = 127configure: failed program was:|       program main| |       endconfigure:5426: result: noconfigure:5456: checking the maximum length of command line argumentsconfigure:5565: result: 32768configure:5576: checking command to parse /usr/bin/nm -B output from gcc objectconfigure:5681: gcc -c -g -O2  conftest.c >&5configure:5684: $? = 0configure:5688: /usr/bin/nm -B conftest.o \| sed -n -e 's/^.*[ 	]\([ABCDGIRSTW][ABCDGIRSTW]*\)[ 	][ 	]*\([_A-Za-z][_A-Za-z0-9]*\)$/\1 \2 \2/p' \> conftest.nmconfigure:5691: $? = 0configure:5743: gcc -o conftest -g -O2   conftest.c conftstm.o >&5configure:5746: $? = 0configure:5784: result: okconfigure:5788: checking for objdirconfigure:5803: result: .libsconfigure:5893: checking for arconfigure:5909: found /usr/bin/arconfigure:5920: result: arconfigure:5973: checking for ranlibconfigure:5989: found /usr/bin/ranlibconfigure:6000: result: ranlibconfigure:6053: checking for stripconfigure:6069: found /usr/bin/stripconfigure:6080: result: stripconfigure:6303: checking for correct ltmain.sh versionconfigure:6353: result: yesconfigure:6413: checking if gcc supports -fno-rtti -fno-exceptionsconfigure:6431: gcc -c -g -O2  -fno-rtti -fno-exceptions conftest.c >&5cc1: warning: command line option "-fno-rtti" is valid for C++/ObjC++ but not for Cconfigure:6435: $? = 0configure:6448: result: noconfigure:6463: checking for gcc option to produce PICconfigure:6673: result: -fPICconfigure:6681: checking if gcc PIC flag -fPIC worksconfigure:6699: gcc -c -g -O2  -fPIC -DPIC conftest.c >&5configure:6703: $? = 0configure:6716: result: yesconfigure:6744: checking if gcc static flag -static worksconfigure:6772: result: yesconfigure:6782: checking if gcc supports -c -o file.oconfigure:6803: gcc -c -g -O2  -o out/conftest2.o conftest.c >&5configure:6807: $? = 0configure:6829: result: yesconfigure:6855: checking whether the gcc linker (/usr/i486-slackware-linux/bin/ld) supports shared librariesconfigure:7813: result: yesconfigure:7834: checking whether -lc should be explicitly linked inconfigure:7839: gcc -c -g -O2  conftest.c >&5configure:7842: $? = 0configure:7857: gcc -shared conftest.o  -v -Wl,-soname -Wl,conftest -o conftest 2\>\&1 \| grep  -lc  \>/dev/null 2\>\&1configure:7860: $? = 0configure:7872: result: noconfigure:7880: checking dynamic linker characteristicsconfigure:8505: result: GNU/Linux ld.soconfigure:8514: checking how to hardcode library paths into programsconfigure:8539: result: immediateconfigure:8553: checking whether stripping libraries is possibleconfigure:8558: result: yesconfigure:9392: checking if libtool supports shared librariesconfigure:9394: result: yesconfigure:9397: checking whether to build shared librariesconfigure:9418: result: yesconfigure:9421: checking whether to build static librariesconfigure:9425: result: yesconfigure:9517: creating libtoolconfigure:10105: checking for ld used by g++configure:10172: result: /usr/i486-slackware-linux/bin/ldconfigure:10181: checking if the linker (/usr/i486-slackware-linux/bin/ld) is GNU ldconfigure:10196: result: yesconfigure:10247: checking whether the g++ linker (/usr/i486-slackware-linux/bin/ld) supports shared librariesconfigure:11185: result: yesconfigure:11203: g++ -c -g -O2  conftest.cpp >&5configure:11206: $? = 0configure:11325: checking for g++ option to produce PICconfigure:11599: result: -fPICconfigure:11607: checking if g++ PIC flag -fPIC worksconfigure:11625: g++ -c -g -O2  -fPIC -DPIC conftest.cpp >&5configure:11629: $? = 0configure:11642: result: yesconfigure:11670: checking if g++ static flag -static worksconfigure:11698: result: yesconfigure:11708: checking if g++ supports -c -o file.oconfigure:11729: g++ -c -g -O2  -o out/conftest2.o conftest.cpp >&5configure:11733: $? = 0configure:11755: result: yesconfigure:11781: checking whether the g++ linker (/usr/i486-slackware-linux/bin/ld) supports shared librariesconfigure:11806: result: yesconfigure:11873: checking dynamic linker characteristicsconfigure:12498: result: GNU/Linux ld.soconfigure:12507: checking how to hardcode library paths into programsconfigure:12532: result: immediateconfigure:18756: checking whether make sets $(MAKE)configure:18776: result: yesconfigure:19092: checking whether byte ordering is bigendianconfigure:19119: gcc -c -g -O2  conftest.c >&5configure:19125: $? = 0configure:19129: test -z 			 || test ! -s conftest.errconfigure:19132: $? = 0configure:19135: test -s conftest.oconfigure:19138: $? = 0configure:19162: gcc -c -g -O2  conftest.c >&5conftest.c: In function `main':conftest.c:33: error: `not' undeclared (first use in this function)conftest.c:33: error: (Each undeclared identifier is reported only onceconftest.c:33: error: for each function it appears in.)conftest.c:33: error: syntax error before "big"configure:19168: $? = 1configure: failed program was:| /* confdefs.h.  */| | #define PACKAGE_NAME "mpd"| #define PACKAGE_TARNAME "mpd"| #define PACKAGE_VERSION "0.12.1"| #define PACKAGE_STRING "mpd 0.12.1"| #define PACKAGE_BUGREPORT "warren.dukes@gmail.com"| #define PACKAGE "mpd"| #define VERSION "0.12.1"| #define STDC_HEADERS 1| #define HAVE_SYS_TYPES_H 1| #define HAVE_SYS_STAT_H 1| #define HAVE_STDLIB_H 1| #define HAVE_STRING_H 1| #define HAVE_MEMORY_H 1| #define HAVE_STRINGS_H 1| #define HAVE_INTTYPES_H 1| #define HAVE_STDINT_H 1| #define HAVE_UNISTD_H 1| #define HAVE_DLFCN_H 1| #ifdef __cplusplus| extern "C" void std::exit (int) throw (); using std::exit;| #endif| #define PROTOCOL_VERSION "0.12.1"| /* end confdefs.h.  */| #include <sys/types.h>| #include <sys/param.h>| | int| main ()| {| #if BYTE_ORDER != BIG_ENDIAN|  not big endian| #endif| |   ;|   return 0;| }configure:19303: result: noconfigure:19323: checking for shortconfigure:19347: gcc -c -g -O2  conftest.c >&5configure:19353: $? = 0configure:19357: test -z 			 || test ! -s conftest.errconfigure:19360: $? = 0configure:19363: test -s conftest.oconfigure:19366: $? = 0configure:19377: result: yesconfigure:19380: checking size of shortconfigure:19699: gcc -o conftest -g -O2   conftest.c  >&5configure:19702: $? = 0configure:19704: ./conftestconfigure:19707: $? = 0configure:19730: result: 2configure:19737: checking for intconfigure:19761: gcc -c -g -O2  conftest.c >&5configure:19767: $? = 0configure:19771: test -z 			 || test ! -s conftest.errconfigure:19774: $? = 0configure:19777: test -s conftest.oconfigure:19780: $? = 0configure:19791: result: yesconfigure:19794: checking size of intconfigure:20113: gcc -o conftest -g -O2   conftest.c  >&5configure:20116: $? = 0configure:20118: ./conftestconfigure:20121: $? = 0configure:20144: result: 4configure:20151: checking for longconfigure:20175: gcc -c -g -O2  conftest.c >&5configure:20181: $? = 0configure:20185: test -z 			 || test ! -s conftest.errconfigure:20188: $? = 0configure:20191: test -s conftest.oconfigure:20194: $? = 0configure:20205: result: yesconfigure:20208: checking size of longconfigure:20527: gcc -o conftest -g -O2   conftest.c  >&5configure:20530: $? = 0configure:20532: ./conftestconfigure:20535: $? = 0configure:20558: result: 4configure:20565: checking for long longconfigure:20589: gcc -c -g -O2  conftest.c >&5configure:20595: $? = 0configure:20599: test -z 			 || test ! -s conftest.errconfigure:20602: $? = 0configure:20605: test -s conftest.oconfigure:20608: $? = 0configure:20619: result: yesconfigure:20622: checking size of long longconfigure:20941: gcc -o conftest -g -O2   conftest.c  >&5configure:20944: $? = 0configure:20946: ./conftestconfigure:20949: $? = 0configure:20972: result: 8configure:20990: checking sys/inttypes.h usabilityconfigure:21002: gcc -c -g -O2  conftest.c >&5conftest.c:64:26: sys/inttypes.h: No such file or directoryconfigure:21008: $? = 1configure: failed program was:| /* confdefs.h.  */| | #define PACKAGE_NAME "mpd"| #define PACKAGE_TARNAME "mpd"| #define PACKAGE_VERSION "0.12.1"| #define PACKAGE_STRING "mpd 0.12.1"| #define PACKAGE_BUGREPORT "warren.dukes@gmail.com"| #define PACKAGE "mpd"| #define VERSION "0.12.1"| #define STDC_HEADERS 1| #define HAVE_SYS_TYPES_H 1| #define HAVE_SYS_STAT_H 1| #define HAVE_STDLIB_H 1| #define HAVE_STRING_H 1| #define HAVE_MEMORY_H 1| #define HAVE_STRINGS_H 1| #define HAVE_INTTYPES_H 1| #define HAVE_STDINT_H 1| #define HAVE_UNISTD_H 1| #define HAVE_DLFCN_H 1| #ifdef __cplusplus| extern "C" void std::exit (int) throw (); using std::exit;| #endif| #define PROTOCOL_VERSION "0.12.1"| #define SIZEOF_SHORT 2| #define SIZEOF_INT 4| #define SIZEOF_LONG 4| #define SIZEOF_LONG_LONG 8| /* end confdefs.h.  */| #include <stdio.h>| #if HAVE_SYS_TYPES_H| # include <sys/types.h>| #endif| #if HAVE_SYS_STAT_H| # include <sys/stat.h>| #endif| #if STDC_HEADERS| # include <stdlib.h>| # include <stddef.h>| #else| # if HAVE_STDLIB_H| #  include <stdlib.h>| # endif| #endif| #if HAVE_STRING_H| # if !STDC_HEADERS && HAVE_MEMORY_H| #  include <memory.h>| # endif| # include <string.h>| #endif| #if HAVE_STRINGS_H| # include <strings.h>| #endif| #if HAVE_INTTYPES_H| # include <inttypes.h>| #else| # if HAVE_STDINT_H| #  include <stdint.h>| # endif| #endif| #if HAVE_UNISTD_H| # include <unistd.h>| #endif| #include <sys/inttypes.h>configure:21031: result: noconfigure:21035: checking sys/inttypes.h presenceconfigure:21045: gcc -E  conftest.cconftest.c:30:26: sys/inttypes.h: No such file or directoryconfigure:21051: $? = 1configure: failed program was:| /* confdefs.h.  */| | #define PACKAGE_NAME "mpd"| #define PACKAGE_TARNAME "mpd"| #define PACKAGE_VERSION "0.12.1"| #define PACKAGE_STRING "mpd 0.12.1"| #define PACKAGE_BUGREPORT "warren.dukes@gmail.com"| #define PACKAGE "mpd"| #define VERSION "0.12.1"| #define STDC_HEADERS 1| #define HAVE_SYS_TYPES_H 1| #define HAVE_SYS_STAT_H 1| #define HAVE_STDLIB_H 1| #define HAVE_STRING_H 1| #define HAVE_MEMORY_H 1| #define HAVE_STRINGS_H 1| #define HAVE_INTTYPES_H 1| #define HAVE_STDINT_H 1| #define HAVE_UNISTD_H 1| #define HAVE_DLFCN_H 1| #ifdef __cplusplus| extern "C" void std::exit (int) throw (); using std::exit;| #endif| #define PROTOCOL_VERSION "0.12.1"| #define SIZEOF_SHORT 2| #define SIZEOF_INT 4| #define SIZEOF_LONG 4| #define SIZEOF_LONG_LONG 8| /* end confdefs.h.  */| #include <sys/inttypes.h>configure:21071: result: noconfigure:21106: checking for sys/inttypes.hconfigure:21113: result: noconfigure:21127: checking for socket in -lsocketconfigure:21157: gcc -o conftest -g -O2   conftest.c -lsocket   >&5/usr/lib/gcc/i486-slackware-linux/3.4.6/../../../../i486-slackware-linux/bin/ld: cannot find -lsocketcollect2: ld returned 1 exit statusconfigure:21163: $? = 1configure: failed program was:| /* confdefs.h.  */| | #define PACKAGE_NAME "mpd"| #define PACKAGE_TARNAME "mpd"| #define PACKAGE_VERSION "0.12.1"| #define PACKAGE_STRING "mpd 0.12.1"| #define PACKAGE_BUGREPORT "warren.dukes@gmail.com"| #define PACKAGE "mpd"| #define VERSION "0.12.1"| #define STDC_HEADERS 1| #define HAVE_SYS_TYPES_H 1| #define HAVE_SYS_STAT_H 1| #define HAVE_STDLIB_H 1| #define HAVE_STRING_H 1| #define HAVE_MEMORY_H 1| #define HAVE_STRINGS_H 1| #define HAVE_INTTYPES_H 1| #define HAVE_STDINT_H 1| #define HAVE_UNISTD_H 1| #define HAVE_DLFCN_H 1| #ifdef __cplusplus| extern "C" void std::exit (int) throw (); using std::exit;| #endif| #define PROTOCOL_VERSION "0.12.1"| #define SIZEOF_SHORT 2| #define SIZEOF_INT 4| #define SIZEOF_LONG 4| #define SIZEOF_LONG_LONG 8| /* end confdefs.h.  */| | /* Override any gcc2 internal prototype to avoid an error.  */| #ifdef __cplusplus| extern "C"| #endif| /* We use char because int might match the return type of a gcc2|    builtin and then its argument prototype would still apply.  */| char socket ();| int| main ()| {| socket ();|   ;|   return 0;| }configure:21189: result: noconfigure:21195: checking for gethostbyname in -lnslconfigure:21225: gcc -o conftest -g -O2   conftest.c -lnsl   >&5configure:21231: $? = 0configure:21235: test -z 			 || test ! -s conftest.errconfigure:21238: $? = 0configure:21241: test -s conftestconfigure:21244: $? = 0configure:21257: result: yesconfigure:21264: checking for exp in -lmconfigure:21294: gcc -o conftest -g -O2   conftest.c -lm   >&5conftest.c:37: warning: conflicting types for built-in function 'exp'configure:21300: $? = 0configure:21304: test -z 			 || test ! -s conftest.errconfigure:21307: $? = 0configure:21310: test -s conftestconfigure:21313: $? = 0configure:21326: result: yesconfigure:21336: checking for setenvconfigure:21393: gcc -o conftest -g -O2   conftest.c  >&5configure:21399: $? = 0configure:21403: test -z 			 || test ! -s conftest.errconfigure:21406: $? = 0configure:21409: test -s conftestconfigure:21412: $? = 0configure:21424: result: yesconfigure:21437: checking for nl_langinfo and CODESETconfigure:21458: gcc -o conftest -g -O2   conftest.c  >&5configure:21464: $? = 0configure:21468: test -z 			 || test ! -s conftest.errconfigure:21471: $? = 0configure:21474: test -s conftestconfigure:21477: $? = 0configure:21490: result: yesconfigure:21510: checking locale.h usabilityconfigure:21522: gcc -c -g -O2  conftest.c >&5configure:21528: $? = 0configure:21532: test -z 			 || test ! -s conftest.errconfigure:21535: $? = 0configure:21538: test -s conftest.oconfigure:21541: $? = 0configure:21551: result: yesconfigure:21555: checking locale.h presenceconfigure:21565: gcc -E  conftest.cconfigure:21571: $? = 0configure:21591: result: yesconfigure:21626: checking for locale.hconfigure:21633: result: yesconfigure:21650: checking for ipv6configure:21676: result: yesconfigure:22112: checking for pkg-configconfigure:22130: found /usr/bin/pkg-configconfigure:22143: result: /usr/bin/pkg-configconfigure:22159: /usr/bin/pkg-config couldn't find libshout. Try adjusting PKG_CONFIG_PATH.configure:22165: checking for shout-configconfigure:22196: result: noconfigure:22525: checking sys/audioio.h usabilityconfigure:22537: gcc -c -g -O2  conftest.c >&5conftest.c:68:25: sys/audioio.h: No such file or directoryconfigure:22543: $? = 1configure: failed program was:| /* confdefs.h.  */| | #define PACKAGE_NAME "mpd"| #define PACKAGE_TARNAME "mpd"| #define PACKAGE_VERSION "0.12.1"| #define PACKAGE_STRING "mpd 0.12.1"| #define PACKAGE_BUGREPORT "warren.dukes@gmail.com"| #define PACKAGE "mpd"| #define VERSION "0.12.1"| #define STDC_HEADERS 1| #define HAVE_SYS_TYPES_H 1| #define HAVE_SYS_STAT_H 1| #define HAVE_STDLIB_H 1| #define HAVE_STRING_H 1| #define HAVE_MEMORY_H 1| #define HAVE_STRINGS_H 1| #define HAVE_INTTYPES_H 1| #define HAVE_STDINT_H 1| #define HAVE_UNISTD_H 1| #define HAVE_DLFCN_H 1| #ifdef __cplusplus| extern "C" void std::exit (int) throw (); using std::exit;| #endif| #define PROTOCOL_VERSION "0.12.1"| #define SIZEOF_SHORT 2| #define SIZEOF_INT 4| #define SIZEOF_LONG 4| #define SIZEOF_LONG_LONG 8| #define HAVE_SETENV 1| #define HAVE_LANGINFO_CODESET 1| #define HAVE_LOCALE 1| #define HAVE_IPV6 1| /* end confdefs.h.  */| #include <stdio.h>| #if HAVE_SYS_TYPES_H| # include <sys/types.h>| #endif| #if HAVE_SYS_STAT_H| # include <sys/stat.h>| #endif| #if STDC_HEADERS| # include <stdlib.h>| # include <stddef.h>| #else| # if HAVE_STDLIB_H| #  include <stdlib.h>| # endif| #endif| #if HAVE_STRING_H| # if !STDC_HEADERS && HAVE_MEMORY_H| #  include <memory.h>| # endif| # include <string.h>| #endif| #if HAVE_STRINGS_H| # include <strings.h>| #endif| #if HAVE_INTTYPES_H| # include <inttypes.h>| #else| # if HAVE_STDINT_H| #  include <stdint.h>| # endif| #endif| #if HAVE_UNISTD_H| # include <unistd.h>| #endif| #include <sys/audioio.h>configure:22566: result: noconfigure:22570: checking sys/audioio.h presenceconfigure:22580: gcc -E  conftest.cconftest.c:34:25: sys/audioio.h: No such file or directoryconfigure:22586: $? = 1configure: failed program was:| /* confdefs.h.  */| | #define PACKAGE_NAME "mpd"| #define PACKAGE_TARNAME "mpd"| #define PACKAGE_VERSION "0.12.1"| #define PACKAGE_STRING "mpd 0.12.1"| #define PACKAGE_BUGREPORT "warren.dukes@gmail.com"| #define PACKAGE "mpd"| #define VERSION "0.12.1"| #define STDC_HEADERS 1| #define HAVE_SYS_TYPES_H 1| #define HAVE_SYS_STAT_H 1| #define HAVE_STDLIB_H 1| #define HAVE_STRING_H 1| #define HAVE_MEMORY_H 1| #define HAVE_STRINGS_H 1| #define HAVE_INTTYPES_H 1| #define HAVE_STDINT_H 1| #define HAVE_UNISTD_H 1| #define HAVE_DLFCN_H 1| #ifdef __cplusplus| extern "C" void std::exit (int) throw (); using std::exit;| #endif| #define PROTOCOL_VERSION "0.12.1"| #define SIZEOF_SHORT 2| #define SIZEOF_INT 4| #define SIZEOF_LONG 4| #define SIZEOF_LONG_LONG 8| #define HAVE_SETENV 1| #define HAVE_LANGINFO_CODESET 1| #define HAVE_LOCALE 1| #define HAVE_IPV6 1| /* end confdefs.h.  */| #include <sys/audioio.h>configure:22606: result: noconfigure:22641: checking for sys/audioio.hconfigure:22648: result: noconfigure:22659: WARNING: Sun audioio headers not found -- disabling SUN supportconfigure:22677: checking sys/soundcard.h usabilityconfigure:22689: gcc -c -g -O2  conftest.c >&5configure:22695: $? = 0configure:22699: test -z 			 || test ! -s conftest.errconfigure:22702: $? = 0configure:22705: test -s conftest.oconfigure:22708: $? = 0configure:22718: result: yesconfigure:22722: checking sys/soundcard.h presenceconfigure:22732: gcc -E  conftest.cconfigure:22738: $? = 0configure:22758: result: yesconfigure:22793: checking for sys/soundcard.hconfigure:22800: result: yesconfigure:22867: checking for pkg-configconfigure:22885: found /usr/bin/pkg-configconfigure:22897: result: /usr/bin/pkg-configconfigure:22912: checking pkg-config is at least version 0.9.0configure:22915: result: yesconfigure:22926: checking for PULSEconfigure:22934: $PKG_CONFIG --exists --print-errors "libpulse-simple"Package libpulse-simple was not found in the pkg-config search path.Perhaps you should add the directory containing `libpulse-simple.pc'to the PKG_CONFIG_PATH environment variableNo package 'libpulse-simple' foundconfigure:22937: $? = 1configure:22952: $PKG_CONFIG --exists --print-errors "libpulse-simple"Package libpulse-simple was not found in the pkg-config search path.Perhaps you should add the directory containing `libpulse-simple.pc'to the PKG_CONFIG_PATH environment variableNo package 'libpulse-simple' foundconfigure:22955: $? = 1No package 'libpulse-simple' foundconfigure:22983: result: noconfigure:22985: WARNING: PulseAudio not found -- disablingconfigure:23043: checking for ALSA CFLAGSconfigure:23049: result: configure:23053: checking for ALSA LDFLAGSconfigure:23066: result:  -lasound -lm -ldl -lpthreadconfigure:23070: checking for libasound headers version >= 0.9.0configure:23138: gcc -c -g -O2  conftest.c >&5configure:23144: $? = 0configure:23148: test -z 			 || test ! -s conftest.errconfigure:23151: $? = 0configure:23154: test -s conftest.oconfigure:23157: $? = 0configure:23159: result: found.configure:23181: checking for snd_ctl_open in -lasoundconfigure:23211: gcc -o conftest -g -O2   conftest.c -lasound   -lasound -lm -ldl -lpthread  >&5configure:23217: $? = 0configure:23221: test -z 			 || test ! -s conftest.errconfigure:23224: $? = 0configure:23227: test -s conftestconfigure:23230: $? = 0configure:23243: result: yesconfigure:23315: checking iconv.h usabilityconfigure:23327: gcc -c -g -O2 -Wall -Wmissing-prototypes  -I${prefix}/include -g -O2 -Wall -Wmissing-prototypes  -I${prefix}/include conftest.c >&5configure:23333: $? = 0configure:23337: test -z 			 || test ! -s conftest.errconfigure:23340: $? = 0configure:23343: test -s conftest.oconfigure:23346: $? = 0configure:23356: result: yesconfigure:23360: checking iconv.h presenceconfigure:23370: gcc -E -g -O2 -Wall -Wmissing-prototypes  -I${prefix}/include conftest.cconfigure:23376: $? = 0configure:23396: result: yesconfigure:23431: checking for iconv.hconfigure:23438: result: yesconfigure:23450: checking for main in -liconvconfigure:23474: gcc -o conftest -g -O2 -Wall -Wmissing-prototypes  -I${prefix}/include -g -O2 -Wall -Wmissing-prototypes  -I${prefix}/include  conftest.c -liconv    -lnsl -lm  -lasound -lm -ldl -lpthread -L${exec_prefix}/lib -liconv >&5/usr/lib/gcc/i486-slackware-linux/3.4.6/../../../../i486-slackware-linux/bin/ld: cannot find -liconvcollect2: ld returned 1 exit statusconfigure:23480: $? = 1configure: failed program was:| /* confdefs.h.  */| | #define PACKAGE_NAME "mpd"| #define PACKAGE_TARNAME "mpd"| #define PACKAGE_VERSION "0.12.1"| #define PACKAGE_STRING "mpd 0.12.1"| #define PACKAGE_BUGREPORT "warren.dukes@gmail.com"| #define PACKAGE "mpd"| #define VERSION "0.12.1"| #define STDC_HEADERS 1| #define HAVE_SYS_TYPES_H 1| #define HAVE_SYS_STAT_H 1| #define HAVE_STDLIB_H 1| #define HAVE_STRING_H 1| #define HAVE_MEMORY_H 1| #define HAVE_STRINGS_H 1| #define HAVE_INTTYPES_H 1| #define HAVE_STDINT_H 1| #define HAVE_UNISTD_H 1| #define HAVE_DLFCN_H 1| #ifdef __cplusplus| extern "C" void std::exit (int) throw (); using std::exit;| #endif| #define PROTOCOL_VERSION "0.12.1"| #define SIZEOF_SHORT 2| #define SIZEOF_INT 4| #define SIZEOF_LONG 4| #define SIZEOF_LONG_LONG 8| #define HAVE_SETENV 1| #define HAVE_LANGINFO_CODESET 1| #define HAVE_LOCALE 1| #define HAVE_IPV6 1| #define HAVE_OSS 1| #define HAVE_LIBASOUND 1| #define HAVE_ALSA 1| /* end confdefs.h.  */| | | int| main ()| {| main ();|   ;|   return 0;| }configure:23506: result: noconfigure:23566: checking id3tag.h usabilityconfigure:23578: gcc -c -g -O2 -Wall -Wmissing-prototypes  -I${prefix}/include -I${prefix}/include -g -O2 -Wall -Wmissing-prototypes  -I${prefix}/include -I${prefix}/include conftest.c >&5configure:23584: $? = 0configure:23588: test -z 			 || test ! -s conftest.errconfigure:23591: $? = 0configure:23594: test -s conftest.oconfigure:23597: $? = 0configure:23607: result: yesconfigure:23611: checking id3tag.h presenceconfigure:23621: gcc -E -g -O2 -Wall -Wmissing-prototypes  -I${prefix}/include -I${prefix}/include conftest.cconfigure:23627: $? = 0configure:23647: result: yesconfigure:23682: checking for id3tag.hconfigure:23689: result: yesconfigure:23705: checking for id3_file_open in -lid3tagconfigure:23735: gcc -o conftest -g -O2 -Wall -Wmissing-prototypes  -I${prefix}/include -I${prefix}/include -g -O2 -Wall -Wmissing-prototypes  -I${prefix}/include -I${prefix}/include  conftest.c -lid3tag    -lnsl -lm  -lasound -lm -ldl -lpthread -L${exec_prefix}/lib -lid3tag -lz >&5configure:23741: $? = 0configure:23745: test -z 			 || test ! -s conftest.errconfigure:23748: $? = 0configure:23751: test -s conftestconfigure:23754: $? = 0configure:23767: result: yesconfigure:23833: checking mad.h usabilityconfigure:23845: gcc -c -g -O2 -Wall -Wmissing-prototypes  -I${prefix}/include -I${prefix}/include -I${prefix}/include -g -O2 -Wall -Wmissing-prototypes  -I${prefix}/include -I${prefix}/include -I${prefix}/include conftest.c >&5configure:23851: $? = 0configure:23855: test -z 			 || test ! -s conftest.errconfigure:23858: $? = 0configure:23861: test -s conftest.oconfigure:23864: $? = 0configure:23874: result: yesconfigure:23878: checking mad.h presenceconfigure:23888: gcc -E -g -O2 -Wall -Wmissing-prototypes  -I${prefix}/include -I${prefix}/include -I${prefix}/include conftest.cconfigure:23894: $? = 0configure:23914: result: yesconfigure:23949: checking for mad.hconfigure:23956: result: yesconfigure:23972: checking for mad_stream_init in -lmadconfigure:24002: gcc -o conftest -g -O2 -Wall -Wmissing-prototypes  -I${prefix}/include -I${prefix}/include -I${prefix}/include -g -O2 -Wall -Wmissing-prototypes  -I${prefix}/include -I${prefix}/include -I${prefix}/include  conftest.c -lmad    -lnsl -lm  -lasound -lm -ldl -lpthread -L${exec_prefix}/lib -lid3tag -lz -L${exec_prefix}/lib -lmad >&5configure:24008: $? = 0configure:24012: test -z 			 || test ! -s conftest.errconfigure:24015: $? = 0configure:24018: test -s conftestconfigure:24021: $? = 0configure:24034: result: yesconfigure:24094: checking mpcdec/mpcdec.h usabilityconfigure:24106: gcc -c -g -O2 -Wall -Wmissing-prototypes  -I${prefix}/include -I${prefix}/include -I${prefix}/include -I${prefix}/include -I. -g -O2 -Wall -Wmissing-prototypes  -I${prefix}/include -I${prefix}/include -I${prefix}/include -I${prefix}/include -I. conftest.c >&5configure:24112: $? = 0configure:24116: test -z 			 || test ! -s conftest.errconfigure:24119: $? = 0configure:24122: test -s conftest.oconfigure:24125: $? = 0configure:24135: result: yesconfigure:24139: checking mpcdec/mpcdec.h presenceconfigure:24149: gcc -E -g -O2 -Wall -Wmissing-prototypes  -I${prefix}/include -I${prefix}/include -I${prefix}/include -I${prefix}/include -I. conftest.cconfigure:24155: $? = 0configure:24175: result: yesconfigure:24210: checking for mpcdec/mpcdec.hconfigure:24217: result: yesconfigure:24229: checking for main in -lmpcdecconfigure:24253: gcc -o conftest -g -O2 -Wall -Wmissing-prototypes  -I${prefix}/include -I${prefix}/include -I${prefix}/include -I${prefix}/include -I. -g -O2 -Wall -Wmissing-prototypes  -I${prefix}/include -I${prefix}/include -I${prefix}/include -I${prefix}/include -I.  conftest.c -lmpcdec    -lnsl -lm  -lasound -lm -ldl -lpthread -L${exec_prefix}/lib -lid3tag -lz -L${exec_prefix}/lib -lmad -L${exec_prefix}/lib -lmpcdec >&5configure:24259: $? = 0configure:24263: test -z 			 || test ! -s conftest.errconfigure:24266: $? = 0configure:24269: test -s conftestconfigure:24272: $? = 0configure:24285: result: yesconfigure:24346: checking faad.h usabilityconfigure:24358: gcc -c -g -O2 -Wall -Wmissing-prototypes  -I${prefix}/include -I${prefix}/include -I${prefix}/include -I${prefix}/include -I${prefix}/include -I. -g -O2 -Wall -Wmissing-prototypes  -I${prefix}/include -I${prefix}/include -I${prefix}/include -I${prefix}/include -I${prefix}/include -I. conftest.c >&5configure:24364: $? = 0configure:24368: test -z 			 || test ! -s conftest.errconfigure:24371: $? = 0configure:24374: test -s conftest.oconfigure:24377: $? = 0configure:24387: result: yesconfigure:24391: checking faad.h presenceconfigure:24401: gcc -E -g -O2 -Wall -Wmissing-prototypes  -I${prefix}/include -I${prefix}/include -I${prefix}/include -I${prefix}/include -I${prefix}/include -I. conftest.cconfigure:24407: $? = 0configure:24427: result: yesconfigure:24462: checking for faad.hconfigure:24469: result: yesconfigure:24481: checking whether FAAD2_VERSION is declaredconfigure:24506: gcc -c -g -O2 -Wall -Wmissing-prototypes  -I${prefix}/include -I${prefix}/include -I${prefix}/include -I${prefix}/include -I${prefix}/include -I. -g -O2 -Wall -Wmissing-prototypes  -I${prefix}/include -I${prefix}/include -I${prefix}/include -I${prefix}/include -I${prefix}/include -I. conftest.c >&5configure:24512: $? = 0configure:24516: test -z 			 || test ! -s conftest.errconfigure:24519: $? = 0configure:24522: test -s conftest.oconfigure:24525: $? = 0configure:24536: result: yesconfigure:24546: checking whether faacDecInit2 is declaredconfigure:24571: gcc -c -g -O2 -Wall -Wmissing-prototypes  -I${prefix}/include -I${prefix}/include -I${prefix}/include -I${prefix}/include -I${prefix}/include -I. -g -O2 -Wall -Wmissing-prototypes  -I${prefix}/include -I${prefix}/include -I${prefix}/include -I${prefix}/include -I${prefix}/include -I. conftest.c >&5configure:24577: $? = 0configure:24581: test -z 			 || test ! -s conftest.errconfigure:24584: $? = 0configure:24587: test -s conftest.oconfigure:24590: $? = 0configure:24601: result: yesconfigure:24611: checking for faacDecInit2 in -lfaadconfigure:24641: gcc -o conftest -g -O2 -Wall -Wmissing-prototypes  -I${prefix}/include -I${prefix}/include -I${prefix}/include -I${prefix}/include -I${prefix}/include -I. -g -O2 -Wall -Wmissing-prototypes  -I${prefix}/include -I${prefix}/include -I${prefix}/include -I${prefix}/include -I${prefix}/include -I.  conftest.c -lfaad    -lnsl -lm  -lasound -lm -ldl -lpthread -L${exec_prefix}/lib -lid3tag -lz -L${exec_prefix}/lib -lmad -L${exec_prefix}/lib -lmpcdec -L${exec_prefix}/lib -lfaad >&5/tmp/ccQZh7ln.o(.text+0xd): In function `main':/home/shane/NEWPACKAGES/CreatedZenpackages/mpd-0.12.1/mpd-0.12.1/conftest.c:54: undefined reference to `faacDecInit2'collect2: ld returned 1 exit statusconfigure:24647: $? = 1configure: failed program was:| /* confdefs.h.  */| | #define PACKAGE_NAME "mpd"| #define PACKAGE_TARNAME "mpd"| #define PACKAGE_VERSION "0.12.1"| #define PACKAGE_STRING "mpd 0.12.1"| #define PACKAGE_BUGREPORT "warren.dukes@gmail.com"| #define PACKAGE "mpd"| #define VERSION "0.12.1"| #define STDC_HEADERS 1| #define HAVE_SYS_TYPES_H 1| #define HAVE_SYS_STAT_H 1| #define HAVE_STDLIB_H 1| #define HAVE_STRING_H 1| #define HAVE_MEMORY_H 1| #define HAVE_STRINGS_H 1| #define HAVE_INTTYPES_H 1| #define HAVE_STDINT_H 1| #define HAVE_UNISTD_H 1| #define HAVE_DLFCN_H 1| #ifdef __cplusplus| extern "C" void std::exit (int) throw (); using std::exit;| #endif| #define PROTOCOL_VERSION "0.12.1"| #define SIZEOF_SHORT 2| #define SIZEOF_INT 4| #define SIZEOF_LONG 4| #define SIZEOF_LONG_LONG 8| #define HAVE_SETENV 1| #define HAVE_LANGINFO_CODESET 1| #define HAVE_LOCALE 1| #define HAVE_IPV6 1| #define HAVE_OSS 1| #define HAVE_LIBASOUND 1| #define HAVE_ALSA 1| #define HAVE_ICONV 1| #define HAVE_ID3TAG_H 1| #define HAVE_ID3TAG 1| #define HAVE_MAD_H 1| #define HAVE_MAD 1| #define HAVE_MPCDEC 1| /* end confdefs.h.  */| | /* Override any gcc2 internal prototype to avoid an error.  */| #ifdef __cplusplus| extern "C"| #endif| /* We use char because int might match the return type of a gcc2|    builtin and then its argument prototype would still apply.  */| char faacDecInit2 ();| int| main ()| {| faacDecInit2 ();|   ;|   return 0;| }configure:24673: result: noconfigure:24683: checking for NeAACDecInit2 in -lfaadconfigure:24713: gcc -o conftest -g -O2 -Wall -Wmissing-prototypes  -I${prefix}/include -I${prefix}/include -I${prefix}/include -I${prefix}/include -I${prefix}/include -I. -g -O2 -Wall -Wmissing-prototypes  -I${prefix}/include -I${prefix}/include -I${prefix}/include -I${prefix}/include -I${prefix}/include -I.  conftest.c -lfaad    -lnsl -lm  -lasound -lm -ldl -lpthread -L${exec_prefix}/lib -lid3tag -lz -L${exec_prefix}/lib -lmad -L${exec_prefix}/lib -lmpcdec -L${exec_prefix}/lib -lfaad >&5configure:24719: $? = 0configure:24723: test -z 			 || test ! -s conftest.errconfigure:24726: $? = 0configure:24729: test -s conftestconfigure:24732: $? = 0configure:24745: result: yesconfigure:24756: checking that FAAD2 uses buffer and bufferlenconfigure:24786: gcc -c -g -O2 -Wall -Wmissing-prototypes  -I${prefix}/include -I${prefix}/include -I${prefix}/include -I${prefix}/include -I${prefix}/include -I. -g -O2 -Wall -Wmissing-prototypes  -I${prefix}/include -I${prefix}/include -I${prefix}/include -I${prefix}/include -I${prefix}/include -I. conftest.c >&5configure:24792: $? = 0configure:24796: test -z 			 || test ! -s conftest.errconfigure:24799: $? = 0configure:24802: test -s conftest.oconfigure:24805: $? = 0configure:24807: result: yesconfigure:24890: checking for mp4AudioSpecificConfigconfigure:24915: gcc -c -g -O2 -Wall -Wmissing-prototypes  -I${prefix}/include -I${prefix}/include -I${prefix}/include -I${prefix}/include -I${prefix}/include -I. -g -O2 -Wall -Wmissing-prototypes  -I${prefix}/include -I${prefix}/include -I${prefix}/include -I${prefix}/include -I${prefix}/include -I. conftest.c >&5configure:24921: $? = 0configure:24925: test -z 			 || test ! -s conftest.errconfigure:24928: $? = 0configure:24931: test -s conftest.oconfigure:24934: $? = 0configure:24945: result: yesconfigure:24956: checking for faacDecConfiguration.downMatrixconfigure:24980: gcc -c -g -O2 -Wall -Wmissing-prototypes  -I${prefix}/include -I${prefix}/include -I${prefix}/include -I${prefix}/include -I${prefix}/include -I. -g -O2 -Wall -Wmissing-prototypes  -I${prefix}/include -I${prefix}/include -I${prefix}/include -I${prefix}/include -I${prefix}/include -I. conftest.c >&5configure:24986: $? = 0configure:24990: test -z 			 || test ! -s conftest.errconfigure:24993: $? = 0configure:24996: test -s conftest.oconfigure:24999: $? = 0configure:25057: result: yesconfigure:25067: checking for faacDecConfiguration.dontUpSampleImplicitSBRconfigure:25091: gcc -c -g -O2 -Wall -Wmissing-prototypes  -I${prefix}/include -I${prefix}/include -I${prefix}/include -I${prefix}/include -I${prefix}/include -I. -g -O2 -Wall -Wmissing-prototypes  -I${prefix}/include -I${prefix}/include -I${prefix}/include -I${prefix}/include -I${prefix}/include -I. conftest.c >&5configure:25097: $? = 0configure:25101: test -z 			 || test ! -s conftest.errconfigure:25104: $? = 0configure:25107: test -s conftest.oconfigure:25110: $? = 0configure:25168: result: yesconfigure:25178: checking for faacDecFrameInfo.samplerateconfigure:25202: gcc -c -g -O2 -Wall -Wmissing-prototypes  -I${prefix}/include -I${prefix}/include -I${prefix}/include -I${prefix}/include -I${prefix}/include -I. -g -O2 -Wall -Wmissing-prototypes  -I${prefix}/include -I${prefix}/include -I${prefix}/include -I${prefix}/include -I${prefix}/include -I. conftest.c >&5configure:25208: $? = 0configure:25212: test -z 			 || test ! -s conftest.errconfigure:25215: $? = 0configure:25218: test -s conftest.oconfigure:25221: $? = 0configure:25279: result: yesconfigure:25450: checking for Oggconfigure:25485: gcc -o conftest -g -O2 -I/usr/include   conftest.c  -L/usr/lib -logg >&5configure:25488: $? = 0configure:25490: ./conftestconfigure:25493: $? = 0configure:25511: result: yesconfigure:25646: checking for Vorbisconfigure:25693: gcc -o conftest -g -O2 -I/usr/include -I/usr/include   conftest.c  -L/usr/lib -lvorbis -lm -lvorbisenc -L/usr/lib -logg >&5configure:25696: $? = 0configure:25698: ./conftestconfigure:25701: $? = 0configure:25719: result: yesconfigure:25890: checking for libFLACconfigure:25927: gcc -o conftest -g -O2 -I/usr/include   conftest.c  -L/usr/lib -lFLAC -lm >&5/usr/lib/libFLAC.so: undefined reference to `ogg_stream_pagein'/usr/lib/libFLAC.so: undefined reference to `ogg_sync_wrote'/usr/lib/libFLAC.so: undefined reference to `ogg_sync_reset'/usr/lib/libFLAC.so: undefined reference to `ogg_stream_reset'/usr/lib/libFLAC.so: undefined reference to `ogg_stream_clear'/usr/lib/libFLAC.so: undefined reference to `ogg_stream_packetin'/usr/lib/libFLAC.so: undefined reference to `ogg_stream_packetout'/usr/lib/libFLAC.so: undefined reference to `ogg_sync_init'/usr/lib/libFLAC.so: undefined reference to `ogg_stream_init'/usr/lib/libFLAC.so: undefined reference to `ogg_page_checksum_set'/usr/lib/libFLAC.so: undefined reference to `ogg_stream_pageout'/usr/lib/libFLAC.so: undefined reference to `ogg_sync_clear'/usr/lib/libFLAC.so: undefined reference to `ogg_page_serialno'/usr/lib/libFLAC.so: undefined reference to `ogg_sync_buffer'/usr/lib/libFLAC.so: undefined reference to `ogg_stream_flush'/usr/lib/libFLAC.so: undefined reference to `ogg_sync_pageout'collect2: ld returned 1 exit statusconfigure:25930: $? = 1configure: program exited with status 1configure: failed program was:| /* confdefs.h.  */| | #define PACKAGE_NAME "mpd"| #define PACKAGE_TARNAME "mpd"| #define PACKAGE_VERSION "0.12.1"| #define PACKAGE_STRING "mpd 0.12.1"| #define PACKAGE_BUGREPORT "warren.dukes@gmail.com"| #define PACKAGE "mpd"| #define VERSION "0.12.1"| #define STDC_HEADERS 1| #define HAVE_SYS_TYPES_H 1| #define HAVE_SYS_STAT_H 1| #define HAVE_STDLIB_H 1| #define HAVE_STRING_H 1| #define HAVE_MEMORY_H 1| #define HAVE_STRINGS_H 1| #define HAVE_INTTYPES_H 1| #define HAVE_STDINT_H 1| #define HAVE_UNISTD_H 1| #define HAVE_DLFCN_H 1| #ifdef __cplusplus| extern "C" void std::exit (int) throw (); using std::exit;| #endif| #define PROTOCOL_VERSION "0.12.1"| #define SIZEOF_SHORT 2| #define SIZEOF_INT 4| #define SIZEOF_LONG 4| #define SIZEOF_LONG_LONG 8| #define HAVE_SETENV 1| #define HAVE_LANGINFO_CODESET 1| #define HAVE_LOCALE 1| #define HAVE_IPV6 1| #define HAVE_OSS 1| #define HAVE_LIBASOUND 1| #define HAVE_ALSA 1| #define HAVE_ICONV 1| #define HAVE_ID3TAG_H 1| #define HAVE_ID3TAG 1| #define HAVE_MAD_H 1| #define HAVE_MAD 1| #define HAVE_MPCDEC 1| #define HAVE_FAAD_BUFLEN_FUNCS 1| #define HAVE_MP4AUDIOSPECIFICCONFIG 1| #define HAVE_FAACDECCONFIGURATION_DOWNMATRIX 1| #define HAVE_FAACDECCONFIGURATION_DONTUPSAMPLEIMPLICITSBR 1| #define HAVE_FAACDECFRAMEINFO_SAMPLERATE 1| #define HAVE_FAAD 1| #define HAVE_OGGVORBIS 1| /* end confdefs.h.  */| | #include <stdio.h>| #include <stdlib.h>| #include <string.h>| #include <FLAC/format.h>| | int main ()| {|   system("touch conf.libFLACtest");|   return 0;| }| | configure:25957: result: noconfigure:25984: gcc -o conftest -g -O2 -I/usr/include   conftest.c  -L/usr/lib -lFLAC -lm >&5/usr/lib/libFLAC.so: undefined reference to `ogg_stream_pagein'/usr/lib/libFLAC.so: undefined reference to `ogg_sync_wrote'/usr/lib/libFLAC.so: undefined reference to `ogg_sync_reset'/usr/lib/libFLAC.so: undefined reference to `ogg_stream_reset'/usr/lib/libFLAC.so: undefined reference to `ogg_stream_clear'/usr/lib/libFLAC.so: undefined reference to `ogg_stream_packetin'/usr/lib/libFLAC.so: undefined reference to `ogg_stream_packetout'/usr/lib/libFLAC.so: undefined reference to `ogg_sync_init'/usr/lib/libFLAC.so: undefined reference to `ogg_stream_init'/usr/lib/libFLAC.so: undefined reference to `ogg_page_checksum_set'/usr/lib/libFLAC.so: undefined reference to `ogg_stream_pageout'/usr/lib/libFLAC.so: undefined reference to `ogg_sync_clear'/usr/lib/libFLAC.so: undefined reference to `ogg_page_serialno'/usr/lib/libFLAC.so: undefined reference to `ogg_sync_buffer'/usr/lib/libFLAC.so: undefined reference to `ogg_stream_flush'/usr/lib/libFLAC.so: undefined reference to `ogg_sync_pageout'collect2: ld returned 1 exit statusconfigure:25990: $? = 1configure: failed program was:| /* confdefs.h.  */| | #define PACKAGE_NAME "mpd"| #define PACKAGE_TARNAME "mpd"| #define PACKAGE_VERSION "0.12.1"| #define PACKAGE_STRING "mpd 0.12.1"| #define PACKAGE_BUGREPORT "warren.dukes@gmail.com"| #define PACKAGE "mpd"| #define VERSION "0.12.1"| #define STDC_HEADERS 1| #define HAVE_SYS_TYPES_H 1| #define HAVE_SYS_STAT_H 1| #define HAVE_STDLIB_H 1| #define HAVE_STRING_H 1| #define HAVE_MEMORY_H 1| #define HAVE_STRINGS_H 1| #define HAVE_INTTYPES_H 1| #define HAVE_STDINT_H 1| #define HAVE_UNISTD_H 1| #define HAVE_DLFCN_H 1| #ifdef __cplusplus| extern "C" void std::exit (int) throw (); using std::exit;| #endif| #define PROTOCOL_VERSION "0.12.1"| #define SIZEOF_SHORT 2| #define SIZEOF_INT 4| #define SIZEOF_LONG 4| #define SIZEOF_LONG_LONG 8| #define HAVE_SETENV 1| #define HAVE_LANGINFO_CODESET 1| #define HAVE_LOCALE 1| #define HAVE_IPV6 1| #define HAVE_OSS 1| #define HAVE_LIBASOUND 1| #define HAVE_ALSA 1| #define HAVE_ICONV 1| #define HAVE_ID3TAG_H 1| #define HAVE_ID3TAG 1| #define HAVE_MAD_H 1| #define HAVE_MAD 1| #define HAVE_MPCDEC 1| #define HAVE_FAAD_BUFLEN_FUNCS 1| #define HAVE_MP4AUDIOSPECIFICCONFIG 1| #define HAVE_FAACDECCONFIGURATION_DOWNMATRIX 1| #define HAVE_FAACDECCONFIGURATION_DONTUPSAMPLEIMPLICITSBR 1| #define HAVE_FAACDECFRAMEINFO_SAMPLERATE 1| #define HAVE_FAAD 1| #define HAVE_OGGVORBIS 1| /* end confdefs.h.  */| | #include <stdio.h>| #include <FLAC/format.h>| | int| main ()| {|  return 0;|   ;|   return 0;| }configure:26192: checking for libOggFLACconfigure:26229: gcc -o conftest -g -O2 -I/usr/include   conftest.c  -L${exec_prefix}/lib -lOggFLAC -lFLAC -lm >&5conftest.c:54:36: OggFLAC/stream_decoder.h: No such file or directoryconfigure:26232: $? = 1configure: program exited with status 1configure: failed program was:| /* confdefs.h.  */| | #define PACKAGE_NAME "mpd"| #define PACKAGE_TARNAME "mpd"| #define PACKAGE_VERSION "0.12.1"| #define PACKAGE_STRING "mpd 0.12.1"| #define PACKAGE_BUGREPORT "warren.dukes@gmail.com"| #define PACKAGE "mpd"| #define VERSION "0.12.1"| #define STDC_HEADERS 1| #define HAVE_SYS_TYPES_H 1| #define HAVE_SYS_STAT_H 1| #define HAVE_STDLIB_H 1| #define HAVE_STRING_H 1| #define HAVE_MEMORY_H 1| #define HAVE_STRINGS_H 1| #define HAVE_INTTYPES_H 1| #define HAVE_STDINT_H 1| #define HAVE_UNISTD_H 1| #define HAVE_DLFCN_H 1| #ifdef __cplusplus| extern "C" void std::exit (int) throw (); using std::exit;| #endif| #define PROTOCOL_VERSION "0.12.1"| #define SIZEOF_SHORT 2| #define SIZEOF_INT 4| #define SIZEOF_LONG 4| #define SIZEOF_LONG_LONG 8| #define HAVE_SETENV 1| #define HAVE_LANGINFO_CODESET 1| #define HAVE_LOCALE 1| #define HAVE_IPV6 1| #define HAVE_OSS 1| #define HAVE_LIBASOUND 1| #define HAVE_ALSA 1| #define HAVE_ICONV 1| #define HAVE_ID3TAG_H 1| #define HAVE_ID3TAG 1| #define HAVE_MAD_H 1| #define HAVE_MAD 1| #define HAVE_MPCDEC 1| #define HAVE_FAAD_BUFLEN_FUNCS 1| #define HAVE_MP4AUDIOSPECIFICCONFIG 1| #define HAVE_FAACDECCONFIGURATION_DOWNMATRIX 1| #define HAVE_FAACDECCONFIGURATION_DONTUPSAMPLEIMPLICITSBR 1| #define HAVE_FAACDECFRAMEINFO_SAMPLERATE 1| #define HAVE_FAAD 1| #define HAVE_OGGVORBIS 1| /* end confdefs.h.  */| | #include <stdio.h>| #include <stdlib.h>| #include <string.h>| #include <OggFLAC/stream_decoder.h>| | int main ()| {|   system("touch conf.libOggFLACtest");|   return 0;| }| | configure:26259: result: noconfigure:26286: gcc -o conftest -g -O2 -I/usr/include   conftest.c  -L${exec_prefix}/lib -lOggFLAC -lFLAC -lm >&5conftest.c:52:36: OggFLAC/stream_decoder.h: No such file or directoryconfigure:26292: $? = 1configure: failed program was:| /* confdefs.h.  */| | #define PACKAGE_NAME "mpd"| #define PACKAGE_TARNAME "mpd"| #define PACKAGE_VERSION "0.12.1"| #define PACKAGE_STRING "mpd 0.12.1"| #define PACKAGE_BUGREPORT "warren.dukes@gmail.com"| #define PACKAGE "mpd"| #define VERSION "0.12.1"| #define STDC_HEADERS 1| #define HAVE_SYS_TYPES_H 1| #define HAVE_SYS_STAT_H 1| #define HAVE_STDLIB_H 1| #define HAVE_STRING_H 1| #define HAVE_MEMORY_H 1| #define HAVE_STRINGS_H 1| #define HAVE_INTTYPES_H 1| #define HAVE_STDINT_H 1| #define HAVE_UNISTD_H 1| #define HAVE_DLFCN_H 1| #ifdef __cplusplus| extern "C" void std::exit (int) throw (); using std::exit;| #endif| #define PROTOCOL_VERSION "0.12.1"| #define SIZEOF_SHORT 2| #define SIZEOF_INT 4| #define SIZEOF_LONG 4| #define SIZEOF_LONG_LONG 8| #define HAVE_SETENV 1| #define HAVE_LANGINFO_CODESET 1| #define HAVE_LOCALE 1| #define HAVE_IPV6 1| #define HAVE_OSS 1| #define HAVE_LIBASOUND 1| #define HAVE_ALSA 1| #define HAVE_ICONV 1| #define HAVE_ID3TAG_H 1| #define HAVE_ID3TAG 1| #define HAVE_MAD_H 1| #define HAVE_MAD 1| #define HAVE_MPCDEC 1| #define HAVE_FAAD_BUFLEN_FUNCS 1| #define HAVE_MP4AUDIOSPECIFICCONFIG 1| #define HAVE_FAACDECCONFIGURATION_DOWNMATRIX 1| #define HAVE_FAACDECCONFIGURATION_DONTUPSAMPLEIMPLICITSBR 1| #define HAVE_FAACDECFRAMEINFO_SAMPLERATE 1| #define HAVE_FAAD 1| #define HAVE_OGGVORBIS 1| /* end confdefs.h.  */| | #include <stdio.h>| #include <OggFLAC/stream_decoder.h>| | int| main ()| {|  return 0;|   ;|   return 0;| }configure:26389: checking for audiofile-configconfigure:26407: found /usr/bin/audiofile-configconfigure:26420: result: /usr/bin/audiofile-configconfigure:26428: checking for Audio File Library - version >= 0.1.7configure:26522: gcc -o conftest -g -O2    conftest.c  -L/usr/lib -laudiofile -lm >&5configure:26525: $? = 0configure:26527: ./conftestconfigure:26530: $? = 0configure:26554: result: yesconfigure:26718: checking for libmikmod-configconfigure:26736: found /usr/bin/libmikmod-configconfigure:26749: result: /usr/bin/libmikmod-configconfigure:26757: checking for libmikmod - version >= 3.1.7configure:26886: gcc -o conftest -g -O2 -pthread -D_REENTRANT -pthread   conftest.c -L/usr/lib -lmikmod -ldl -L/usr/lib -lm  >&5configure:26889: $? = 0configure:26891: ./conftestconfigure:26894: $? = 0configure:26918: result: yes, `/usr/bin/libmikmod-config --version`configure:27137: creating ./config.status## ---------------------- #### Running config.status. #### ---------------------- ##This file was extended by mpd config.status 0.12.1, which wasgenerated by GNU Autoconf 2.59.  Invocation command line was  CONFIG_FILES    =   CONFIG_HEADERS  =   CONFIG_LINKS    =   CONFIG_COMMANDS =   $ ./config.status on zenwalkconfig.status:739: creating src/mp4ff/Makefileconfig.status:739: creating doc/Makefileconfig.status:739: creating src/Makefileconfig.status:739: creating Makefileconfig.status:843: creating config.hconfig.status:1023: config.h is unchangedconfig.status:1187: executing depfiles commands## ---------------- #### Cache variables. #### ---------------- ##ac_cv_build=i686-pc-linux-gnuac_cv_build_alias=i686-pc-linux-gnuac_cv_c_bigendian=noac_cv_c_compiler_gnu=yesac_cv_cxx_compiler_gnu=yesac_cv_env_CC_set=ac_cv_env_CC_value=ac_cv_env_CFLAGS_set=ac_cv_env_CFLAGS_value=ac_cv_env_CPPFLAGS_set=ac_cv_env_CPPFLAGS_value=ac_cv_env_CPP_set=ac_cv_env_CPP_value=ac_cv_env_CXXCPP_set=ac_cv_env_CXXCPP_value=ac_cv_env_CXXFLAGS_set=ac_cv_env_CXXFLAGS_value=ac_cv_env_CXX_set=ac_cv_env_CXX_value=ac_cv_env_F77_set=ac_cv_env_F77_value=ac_cv_env_FFLAGS_set=ac_cv_env_FFLAGS_value=ac_cv_env_LDFLAGS_set=ac_cv_env_LDFLAGS_value=ac_cv_env_PKG_CONFIG_set=ac_cv_env_PKG_CONFIG_value=ac_cv_env_PULSE_CFLAGS_set=ac_cv_env_PULSE_CFLAGS_value=ac_cv_env_PULSE_LIBS_set=ac_cv_env_PULSE_LIBS_value=ac_cv_env_build_alias_set=ac_cv_env_build_alias_value=ac_cv_env_host_alias_set=ac_cv_env_host_alias_value=ac_cv_env_target_alias_set=ac_cv_env_target_alias_value=ac_cv_exeext=ac_cv_f77_compiler_gnu=noac_cv_func_setenv=yesac_cv_have_decl_FAAD2_VERSION=yesac_cv_have_decl_faacDecInit2=yesac_cv_header_dlfcn_h=yesac_cv_header_faad_h=yesac_cv_header_iconv_h=yesac_cv_header_id3tag_h=yesac_cv_header_inttypes_h=yesac_cv_header_locale_h=yesac_cv_header_mad_h=yesac_cv_header_memory_h=yesac_cv_header_mpcdec_mpcdec_h=yesac_cv_header_stdc=yesac_cv_header_stdint_h=yesac_cv_header_stdlib_h=yesac_cv_header_string_h=yesac_cv_header_strings_h=yesac_cv_header_sys_audioio_h=noac_cv_header_sys_inttypes_h=noac_cv_header_sys_soundcard_h=yesac_cv_header_sys_stat_h=yesac_cv_header_sys_types_h=yesac_cv_header_unistd_h=yesac_cv_host=i686-pc-linux-gnuac_cv_host_alias=i686-pc-linux-gnuac_cv_lib_asound_snd_ctl_open=yesac_cv_lib_faad_NeAACDecInit2=yesac_cv_lib_faad_faacDecInit2=noac_cv_lib_iconv_main=noac_cv_lib_id3tag_id3_file_open=yesac_cv_lib_m_exp=yesac_cv_lib_mad_mad_stream_init=yesac_cv_lib_mpcdec_main=yesac_cv_lib_nsl_gethostbyname=yesac_cv_lib_socket_socket=noac_cv_member_faacDecConfiguration_dontUpSampleImplicitSBR=yesac_cv_member_faacDecConfiguration_downMatrix=yesac_cv_member_faacDecFrameInfo_samplerate=yesac_cv_objext=oac_cv_path_AUDIOFILE_CONFIG=/usr/bin/audiofile-configac_cv_path_LIBMIKMOD_CONFIG=/usr/bin/libmikmod-configac_cv_path_PKGCONFIG=/usr/bin/pkg-configac_cv_path_SHOUTCONFIG=noac_cv_path_ac_pt_PKG_CONFIG=/usr/bin/pkg-configac_cv_path_install='/usr/bin/ginstall -c'ac_cv_prog_AWK=gawkac_cv_prog_CPP='gcc -E'ac_cv_prog_CXXCPP='g++ -E'ac_cv_prog_ac_ct_AR=arac_cv_prog_ac_ct_CC=gccac_cv_prog_ac_ct_CXX=g++ac_cv_prog_ac_ct_RANLIB=ranlibac_cv_prog_ac_ct_STRIP=stripac_cv_prog_cc_g=yesac_cv_prog_cc_stdc=ac_cv_prog_cxx_g=yesac_cv_prog_egrep='grep -E'ac_cv_prog_f77_g=noac_cv_prog_make_make_set=yesac_cv_sizeof_int=4ac_cv_sizeof_long=4ac_cv_sizeof_long_long=8ac_cv_sizeof_short=2ac_cv_type_int=yesac_cv_type_long=yesac_cv_type_long_long=yesac_cv_type_mp4AudioSpecificConfig=yesac_cv_type_short=yesam_cv_CC_dependencies_compiler_type=gcc3am_cv_CXX_dependencies_compiler_type=gcc3am_cv_langinfo_codeset=yeslt_cv_deplibs_check_method=pass_alllt_cv_file_magic_cmd='$MAGIC_CMD'lt_cv_file_magic_test_file=lt_cv_ld_reload_flag=-rlt_cv_objdir=.libslt_cv_path_LD=/usr/i486-slackware-linux/bin/ldlt_cv_path_LDCXX=/usr/i486-slackware-linux/bin/ldlt_cv_path_NM='/usr/bin/nm -B'lt_cv_path_SED=/usr/bin/sedlt_cv_prog_compiler_c_o=yeslt_cv_prog_compiler_c_o_CXX=yeslt_cv_prog_compiler_rtti_exceptions=nolt_cv_prog_gnu_ld=yeslt_cv_prog_gnu_ldcxx=yeslt_cv_sys_global_symbol_pipe='sed -n -e '\''s/^.*[ 	]\([ABCDGIRSTW][ABCDGIRSTW]*\)[ 	][ 	]*\([_A-Za-z][_A-Za-z0-9]*\)$/\1 \2 \2/p'\'''lt_cv_sys_global_symbol_to_c_name_address='sed -n -e '\''s/^: \([^ ]*\) $/  {\"\1\", (lt_ptr) 0},/p'\'' -e '\''s/^[BCDEGRST] \([^ ]*\) \([^ ]*\)$/  {"\2", (lt_ptr) \&\2},/p'\'''lt_cv_sys_global_symbol_to_cdecl='sed -n -e '\''s/^. .* \(.*\)$/extern int \1;/p'\'''lt_cv_sys_max_cmd_len=32768lt_lt_cv_prog_compiler_c_o='"yes"'lt_lt_cv_prog_compiler_c_o_CXX='"yes"'lt_lt_cv_sys_global_symbol_pipe='"sed -n -e '\''s/^.*[ 	]\\([ABCDGIRSTW][ABCDGIRSTW]*\\)[ 	][ 	]*\\([_A-Za-z][_A-Za-z0-9]*\\)\$/\\1 \\2 \\2/p'\''"'lt_lt_cv_sys_global_symbol_to_c_name_address='"sed -n -e '\''s/^: \\([^ ]*\\) \$/  {\\\"\\1\\\", (lt_ptr) 0},/p'\'' -e '\''s/^[BCDEGRST] \\([^ ]*\\) \\([^ ]*\\)\$/  {\"\\2\", (lt_ptr) \\&\\2},/p'\''"'lt_lt_cv_sys_global_symbol_to_cdecl='"sed -n -e '\''s/^. .* \\(.*\\)\$/extern int \\1;/p'\''"'## ----------------- #### Output variables. #### ----------------- ##ACLOCAL='${SHELL} /home/shane/NEWPACKAGES/CreatedZenpackages/mpd-0.12.1/mpd-0.12.1/missing --run aclocal-1.6'ALSA_CFLAGS=''ALSA_LIBS=' -lasound -lm -ldl -lpthread'AMDEPBACKSLASH='\'AMDEP_FALSE='#'AMDEP_TRUE=''AMTAR='${SHELL} /home/shane/NEWPACKAGES/CreatedZenpackages/mpd-0.12.1/mpd-0.12.1/missing --run tar'AO_CFLAGS=''AO_LIBS=''AR='ar'AUDIOFILE_CFLAGS=''AUDIOFILE_CONFIG='/usr/bin/audiofile-config'AUDIOFILE_LIBS='-L/usr/lib -laudiofile -lm'AUTOCONF='${SHELL} /home/shane/NEWPACKAGES/CreatedZenpackages/mpd-0.12.1/mpd-0.12.1/missing --run autoconf'AUTOHEADER='${SHELL} /home/shane/NEWPACKAGES/CreatedZenpackages/mpd-0.12.1/mpd-0.12.1/missing --run autoheader'AUTOMAKE='${SHELL} /home/shane/NEWPACKAGES/CreatedZenpackages/mpd-0.12.1/mpd-0.12.1/missing --run automake-1.6'AWK='gawk'CC='gcc'CCDEPMODE='depmode=gcc3'CFLAGS='-g -O2'CPP='gcc -E'CPPFLAGS=''CXX='g++'CXXCPP='g++ -E'CXXDEPMODE='depmode=gcc3'CXXFLAGS='-g -O2 -I/usr/include -I/usr/include'DEFS='-DHAVE_CONFIG_H'DEPDIR='.deps'ECHO='echo'ECHO_C=''ECHO_N='-n'ECHO_T=''EGREP='grep -E'EXEEXT=''F77=''FFLAGS=''INSTALL_DATA='${INSTALL} -m 644'INSTALL_PROGRAM='${INSTALL}'INSTALL_SCRIPT='${INSTALL}'INSTALL_STRIP_PROGRAM='${SHELL} $(install_sh) -c -s'LDFLAGS=''LIBFLAC_CFLAGS=''LIBFLAC_LIBS=''LIBMIKMOD_CFLAGS='-pthread -D_REENTRANT'LIBMIKMOD_CONFIG='/usr/bin/libmikmod-config'LIBMIKMOD_LDADD='-pthread'LIBMIKMOD_LIBS='-L/usr/lib -lmikmod -ldl -L/usr/lib -lm'LIBOBJS=''LIBOGGFLAC_CFLAGS=''LIBOGGFLAC_LIBS=''LIBS=''LIBTOOL='$(SHELL) $(top_builddir)/libtool'LN_S='ln -s'LTLIBOBJS=''MAKEINFO='${SHELL} /home/shane/NEWPACKAGES/CreatedZenpackages/mpd-0.12.1/mpd-0.12.1/missing --run makeinfo'MP4FF_LIB='mp4ff/libmp4ff.la'MP4FF_SUBDIR='mp4ff'MPD_CFLAGS='-Wall -Wmissing-prototypes  -I${prefix}/include -I${prefix}/include -I${prefix}/include -I${prefix}/include -I${prefix}/include -I/usr/include -I/usr/include  -pthread -D_REENTRANT'MPD_LIBS=' -lnsl -lm  -lasound -lm -ldl -lpthread -L${exec_prefix}/lib -lid3tag -lz -L${exec_prefix}/lib -lmad -L${exec_prefix}/lib -lmpcdec -L${exec_prefix}/lib -lfaad -L/usr/lib -logg -L/usr/lib -lvorbis -lm -lvorbisfile -L/usr/lib -laudiofile -lm -L/usr/lib -lmikmod -ldl -L/usr/lib -lm -pthread'OBJEXT='o'OGG_CFLAGS='-I/usr/include'OGG_LIBS='-L/usr/lib -logg'PACKAGE='mpd'PACKAGE_BUGREPORT='warren.dukes@gmail.com'PACKAGE_NAME='mpd'PACKAGE_STRING='mpd 0.12.1'PACKAGE_TARNAME='mpd'PACKAGE_VERSION='0.12.1'PATH_SEPARATOR=':'PKGCONFIG='/usr/bin/pkg-config'PKG_CONFIG='/usr/bin/pkg-config'PULSE_CFLAGS=''PULSE_LIBS=''RANLIB='ranlib'SET_MAKE=''SHELL='/bin/sh'SHOUTCONFIG='no'STRIP='strip'VERSION='0.12.1'VORBISENC_LIBS='-lvorbisenc'VORBISFILE_LIBS='-lvorbisfile'VORBIS_CFLAGS='-I/usr/include'VORBIS_LIBS='-L/usr/lib -lvorbis -lm'ac_ct_AR='ar'ac_ct_CC='gcc'ac_ct_CXX='g++'ac_ct_F77=''ac_ct_RANLIB='ranlib'ac_ct_STRIP='strip'ac_pt_PKG_CONFIG='/usr/bin/pkg-config'am__include='include'am__quote=''bindir='${exec_prefix}/bin'build='i686-pc-linux-gnu'build_alias=''build_cpu='i686'build_os='linux-gnu'build_vendor='pc'datadir='${prefix}/share'exec_prefix='${prefix}'host='i686-pc-linux-gnu'host_alias=''host_cpu='i686'host_os='linux-gnu'host_vendor='pc'includedir='${prefix}/include'infodir='${prefix}/info'install_sh='/home/shane/NEWPACKAGES/CreatedZenpackages/mpd-0.12.1/mpd-0.12.1/install-sh'libdir='${exec_prefix}/lib'libexecdir='${exec_prefix}/libexec'localstatedir='${prefix}/var'mandir='${prefix}/man'oldincludedir='/usr/include'prefix='/usr'program_transform_name='s,x,x,'sbindir='${exec_prefix}/sbin'sharedstatedir='${prefix}/com'sysconfdir='${prefix}/etc'target_alias=''## ----------- #### confdefs.h. #### ----------- ###define HAVE_ALSA 1#define HAVE_AUDIOFILE 1#define HAVE_DLFCN_H 1#define HAVE_FAACDECCONFIGURATION_DONTUPSAMPLEIMPLICITSBR 1#define HAVE_FAACDECCONFIGURATION_DOWNMATRIX 1#define HAVE_FAACDECFRAMEINFO_SAMPLERATE 1#define HAVE_FAAD 1#define HAVE_FAAD_BUFLEN_FUNCS 1#define HAVE_ICONV 1#define HAVE_ID3TAG 1#define HAVE_ID3TAG_H 1#define HAVE_INTTYPES_H 1#define HAVE_IPV6 1#define HAVE_LANGINFO_CODESET 1#define HAVE_LIBASOUND 1#define HAVE_LOCALE 1#define HAVE_MAD 1#define HAVE_MAD_H 1#define HAVE_MEMORY_H 1#define HAVE_MIKMOD 1#define HAVE_MP4AUDIOSPECIFICCONFIG 1#define HAVE_MPCDEC 1#define HAVE_OGGVORBIS 1#define HAVE_OSS 1#define HAVE_SETENV 1#define HAVE_STDINT_H 1#define HAVE_STDLIB_H 1#define HAVE_STRINGS_H 1#define HAVE_STRING_H 1#define HAVE_SYS_STAT_H 1#define HAVE_SYS_TYPES_H 1#define HAVE_UNISTD_H 1#define PACKAGE "mpd"#define PACKAGE_BUGREPORT "warren.dukes@gmail.com"#define PACKAGE_NAME "mpd"#define PACKAGE_STRING "mpd 0.12.1"#define PACKAGE_TARNAME "mpd"#define PACKAGE_VERSION "0.12.1"#define PROTOCOL_VERSION "0.12.1"#define SIZEOF_INT 4#define SIZEOF_LONG 4#define SIZEOF_LONG_LONG 8#define SIZEOF_SHORT 2#define STDC_HEADERS 1#define VERSION "0.12.1"#endif#ifdef __cplusplusextern "C" void std::exit (int) throw (); using std::exit;configure: exit 0