All pastes #374394 Raw Edit

Unnamed

public text v1 · immutable
#374394 ·published 2007-02-27 15:34 UTC
rendered paste body
chan_zap.c:62:2: #error "You need newer libpri"
chan_zap.c: In function `zt_call':
chan_zap.c:2090: warning: implicit declaration of function `pri_facility_enable'
chan_zap.c:2124: warning: implicit declaration of function `pri_sr_set_redirecting'
chan_zap.c:7831:2: #error "Upgrade your libpri"
chan_zap.c: In function `pri_dchannel':
chan_zap.c:8183: warning: implicit declaration of function `pri_restart'
chan_zap.c:8292: error: `PRI_EVENT_KEYPAD_DIGIT' undeclared (first use in this function)
chan_zap.c:8292: error: (Each undeclared identifier is reported only once
chan_zap.c:8292: error: for each function it appears in.)
chan_zap.c:8293: error: union has no member named `digit'
chan_zap.c:8296: error: union has no member named `digit'
chan_zap.c:8296: error: union has no member named `digit'
chan_zap.c:8298: error: union has no member named `digit'
chan_zap.c:8302: error: union has no member named `digit'
chan_zap.c:8304: error: union has no member named `digit'
chan_zap.c:8308: error: union has no member named `digit'
chan_zap.c:8420: error: structure has no member named `cid_ani'
chan_zap.c:8425: error: structure has no member named `callingplanrdnis'
chan_zap.c:8511: error: structure has no member named `redirectingreason'
chan_zap.c:8512: error: structure has no member named `redirectingreason'
chan_zap.c:8548: error: structure has no member named `redirectingreason'
chan_zap.c:8549: error: structure has no member named `redirectingreason'
chan_zap.c:8604: error: structure has no member named `progress'
chan_zap.c:8631: error: structure has no member named `progress'
chan_zap.c:8635: error: structure has no member named `cause'
chan_zap.c:8637: error: structure has no member named `cause'
chan_zap.c:8640: error: structure has no member named `cause'
chan_zap.c:8645: error: structure has no member named `cause'
chan_zap.c:8658: error: structure has no member named `progress'
chan_zap.c:8684: error: structure has no member named `progress'
chan_zap.c:8834: error: structure has no member named `aoc_units'
chan_zap.c:8837: error: structure has no member named `aoc_units'
chan_zap.c:8837: error: structure has no member named `aoc_units'
chan_zap.c:8887: error: structure has no member named `aoc_units'
chan_zap.c:8890: error: structure has no member named `aoc_units'
chan_zap.c:8890: error: structure has no member named `aoc_units'
chan_zap.c:8023: warning: unused variable `plancallingani'
chan_zap.c: In function `handle_pri_show_debug':
chan_zap.c:9355: warning: implicit declaration of function `pri_get_debug'
chan_zap.c: In function `setup_zap':
chan_zap.c:10639: error: `PRI_SWITCH_QSIG' undeclared (first use in this function)
chan_zap.c: In function `load_module':
chan_zap.c:10909: warning: passing arg 1 of `pri_set_error' from incompatible pointer type
chan_zap.c:10910: warning: passing arg 1 of `pri_set_message' from incompatible pointer type
make[1]: *** [chan_zap.o] Error 1