All pastes #374044 Raw Edit

Untitled

public text v1 · immutable
#374044 ·published 2007-02-27 05:14 UTC
rendered paste body
checking for x86_64-pc-linux-gnu-gcc... /var/tmp/portage/sys-devel/gcc-4.1.1-r3/work/build/./gcc/xgcc -B/var/tmp/portage/sys-devel/gcc-4.1.1-r3/work/build/./gcc/ -B/usr/x86_64-pc-linux-gnu/bin/ -B/usr/x86_64-pc-linux-gnu/lib/ -isystem /usr/x86_64-pc-linux-gnu/include -isystem /usr/x86_64-pc-linux-gnu/sys-include  -m32
checking for C compiler default output file name... a.out
checking whether the C compiler works... configure: error: cannot run C compiled programs.
If you meant to cross compile, use `--host'.
See `config.log' for more details.
make[2]: *** [configure-target-libstdc++-v3] Error 1
make[2]: Leaving directory `/var/tmp/portage/sys-devel/gcc-4.1.1-r3/work/build'
make[1]: *** [all] Error 2
make[1]: Leaving directory `/var/tmp/portage/sys-devel/gcc-4.1.1-r3/work/build'
make: *** [profiledbootstrap] Error 2

!!! ERROR: sys-devel/gcc-4.1.1-r3 failed.
Call stack:
  ebuild.sh, line 1614:   Called dyn_compile
  ebuild.sh, line 971:   Called qa_call 'src_compile'
  environment, line 5362:   Called src_compile
  ebuild.sh, line 1304:   Called toolchain_src_compile
  toolchain.eclass, line 24:   Called gcc_src_compile
  toolchain.eclass, line 1548:   Called gcc_do_make
  toolchain.eclass, line 1422:   Called die

!!! emake failed with profiledbootstrap
!!! If you need support, post the topmost build error, and the call stack if relevant.
!!! A complete build log is located at '/var/tmp/portage/sys-devel/gcc-4.1.1-r3/temp/build.log'.