rendered paste body then mv -f ".deps/qa_environment.Tpo" ".deps/qa_environment.Plo"; else rm -f ".deps/qa_environment.Tpo"; exit 1; fi
if /bin/sh ../../libtool --tag=CXX --mode=compile i686-pc-linux-gnu-g++ -DSYSCONFDIR=\"/etc\" -DLIBEXECDIR=\"/usr/libexec\" -DBIGTEMPDIR=\"/var/tmp\" -DDATADIR=\"/usr/share\" -I. -I. -I../.. -I/usr/include/libxml2 -I../.. -Wall -Wextra -Wold-style-cast -Wredundant-decls -Wmissing-noreturn -Woverloaded-virtual -Winit-self -Wunused-function -Wshadow -pedantic -O2 -march=prescott -msse3 -fomit-frame-pointer -pipe -mfpmath=sse -MT repo_name_check.lo -MD -MP -MF ".deps/repo_name_check.Tpo" -c -o repo_name_check.lo repo_name_check.cc; \
then mv -f ".deps/repo_name_check.Tpo" ".deps/repo_name_check.Plo"; else rm -f ".deps/repo_name_check.Tpo"; exit 1; fi
make[5]: *** [repo_name_check.lo] Segmentation fault
make[5]: *** Waiting for unfinished jobs....
i686-pc-linux-gnu-g++ -DSYSCONFDIR=\"/etc\" -DLIBEXECDIR=\"/usr/libexec\" -DBIGTEMPDIR=\"/var/tmp\" -DDATADIR=\"/usr/share\" -I. -I. -I../.. -I/usr/include/libxml2 -I../.. -Wall -Wextra -Wold-style-cast -Wredundant-decls -Wmissing-noreturn -Woverloaded-virtual -Winit-self -Wunused-function -Wshadow -pedantic -O2 -march=prescott -msse3 -fomit-frame-pointer -pipe -mfpmath=sse -MT qa_environment.lo -MD -MP -MF .deps/qa_environment.Tpo -c qa_environment.cc -fPIC -DPIC -o .libs/qa_environment.o
make[5]: Leaving directory `/var/tmp/paludis/sys-apps/paludis-0.20.0/work/paludis-0.20.0/paludis/qa'
make[4]: *** [all] Error 2
make[4]: Leaving directory `/var/tmp/paludis/sys-apps/paludis-0.20.0/work/paludis-0.20.0/paludis/qa'
make[3]: *** [all-recursive] Error 1
make[3]: Leaving directory `/var/tmp/paludis/sys-apps/paludis-0.20.0/work/paludis-0.20.0/paludis'
make[2]: *** [all] Error 2
make[2]: Leaving directory `/var/tmp/paludis/sys-apps/paludis-0.20.0/work/paludis-0.20.0/paludis'
make[1]: *** [all-recursive] Error 1
make[1]: Leaving directory `/var/tmp/paludis/sys-apps/paludis-0.20.0/work/paludis-0.20.0'
make: *** [all] Error 2
!!! ERROR in sys-apps/paludis-0.20.0:
!!! In src_compile at line 67
!!! emake failed
!!! Call stack:
!!! * src_compile (/usr/portage/sys-apps/paludis/paludis-0.20.0.ebuild:67)
!!! * ebuild_f_compile (/usr/libexec/paludis/src_compile.bash:49)
!!! * ebuild_main (/usr/libexec/paludis/ebuild.bash:343)
!!! * main (/usr/libexec/paludis/ebuild.bash:361)
die trap: exiting with error.
Install error:
* In program paludis -i paludis:
* When performing install action from command line:
* When executing install task:
* Install error: Install failed for 'sys-apps/paludis-0.20.0::gentoo'
Resume command: paludis --log-level qa --dl-deps-default discard --install '=sys-apps/paludis-0.20.0::gentoo' --add-to-world-spec '( sys-apps/paludis )'
----------------------------------------------------
Feb 27 03:54:24 jupiter BUG: unable to handle kernel paging request at virtual address fffa1d00
Feb 27 03:54:24 jupiter printing eip:
Feb 27 03:54:24 jupiter c01b3780
Feb 27 03:54:24 jupiter *pgd = 3063
Feb 27 03:54:24 jupiter *pmd = 3063
Feb 27 03:54:24 jupiter Oops: 0002 [#4]
Feb 27 03:54:24 jupiter PREEMPT SMP
Feb 27 03:54:24 jupiter Modules linked in: wlan_scan_sta nvidia(P) ipw3945 ath_pci ath_rate_amrr wlan ath_hal(P)
Feb 27 03:54:24 jupiter CPU: 1
Feb 27 03:54:24 jupiter EIP: 0060:[<c01b3780>] Tainted: P VLI
Feb 27 03:54:24 jupiter EFLAGS: 00210206 (2.6.19-hardened-r5 #3)
Feb 27 03:54:24 jupiter eax: 00000000 ebx: c1743f60 ecx: 000000c0 edx: c0003e84
Feb 27 03:54:24 jupiter esi: 00000000 edi: fffa1d00 ebp: c1743f60 esp: c3547ddc
Feb 27 03:54:24 jupiter ds: 0068 es: 0068 ss: 0068
Feb 27 03:54:24 jupiter Process sh (pid: 28862, ti=c3546000 task=eff34000 task.ti=c3546000)
Feb 27 03:54:24 jupiter Stack: fffa1000 00000000 00000001 00000000 000280d2 00000000 00000001 00200246
Feb 27 03:54:24 jupiter c1743f60 c062c180 c01b3d07 c01e6c1c 00000002 00000000 00000000 c062c180
Feb 27 03:54:24 jupiter c062c520 00000044 00000000 c01b3f3d 000280d2 00000044 00000002 c062c520
Feb 27 03:54:24 jupiter Call Trace:
Feb 27 03:54:24 jupiter [<c01b3d07>] <0> [<c01e6c1c>] <0> [<c01b3f3d>] <0> [<c01b3fb4>] <0> [<c01bd8a5>] <0> [<c01bdfa1>] <0> [<c01772e9>] <0> [<c0176e6a>] <0> [<c0572d79>] <0> [<c016007b>] <0> [<c057007b>] <0> =======================
Feb 27 03:54:24 jupiter Code: 00 00 00 00 d3 e0 83 f8 00 7e 41 31 f6 89 44 24 08 89 eb ba 0d 00 00 00 89 d8 e8 ad 4b fc ff b9 00 04 00 00 89 04 24 89 c7 89 f0 <f3> ab ba 0d 00 00 00 8b 04 24 e8 1b 4c fc ff 83 c3 20 83 44 24
Feb 27 03:54:24 jupiter EIP: [<c01b3780>] SS:ESP 0068:c3547ddc
Feb 27 03:54:24 jupiter <6>note: sh[28862] exited with preempt_count 1