All pastes #373867 Raw Edit

skrishi

public text v1 · immutable
#373867 ·published 2007-02-27 01:50 UTC
rendered paste body
This file contains any messages produced by compilers while
running configure, to aid debugging if configure makes a mistake.

configure:1609: checking for egrep
configure:1624: checking for a sed that does not truncate output
configure:1789: checking host system type
configure:1889: checking for gcc
configure:2002: checking whether the C compiler (gcc  ) works
configure:2018: gcc -o conftest    conftest.c  1>&5
configure:2044: checking whether the C compiler (gcc  ) is a cross-compiler
configure:2049: checking whether we are using GNU C
configure:2058: gcc -E conftest.c
configure:2077: checking whether gcc accepts -g
configure:2110: checking whether gcc and cc understand -c and -o together
configure:2125: gcc -c conftest.c -o conftest.o 1>&5
configure:2126: gcc -c conftest.c -o conftest.o 1>&5
configure:2131: cc -c conftest.c 1>&5
configure:2133: cc -c conftest.c -o conftest.o 1>&5
configure:2134: cc -c conftest.c -o conftest.o 1>&5
configure:2161: checking how to run the C preprocessor
configure:2182: gcc -E  conftest.c >/dev/null 2>conftest.out
configure:2242: checking for AIX
configure:2269: checking if compiler supports -R
configure:2284: gcc -o conftest -g -O2   conftest.c -R /usr/lib  1>&5
gcc: unrecognized option `-R'
/usr/lib: file not recognized: Is a directory
collect2: ld returned 1 exit status
configure: failed program was:
#line 2277 "configure"
#include "confdefs.h"

int main() {

; return 0; }
configure:2302: checking if compiler supports -Wl,-rpath,
configure:2317: gcc -o conftest -g -O2   conftest.c -Wl,-rpath,/usr/lib  1>&5
configure:2343: checking for re2c
configure:2372: checking whether ln -s works
configure:2397: checking for gawk
configure:2431: checking for bison
configure:2465: checking bison version
configure:2475: checking for flex
configure:2509: checking for yywrap in -lfl
configure:2528: gcc -o conftest -g -O2   conftest.c -lfl   1>&5
configure:2552: checking lex output file root
configure:2573: checking whether yytext is a pointer
configure:2592: gcc -o conftest -g -O2   conftest.c  -lfl 1>&5
configure:2616: checking for working const
configure:2670: gcc -c -g -O2  conftest.c 1>&5
configure:2695: checking flex version
configure:2711: checking whether byte ordering is bigendian
configure:2737: gcc -o conftest -g -O2   conftest.c  1>&5
configure: failed program was:
#line 2721 "configure"
#include "confdefs.h"

int main(void)
{
	short one = 1;
	char *cp = (char *)&one;

	if (*cp == 0) {
		return(0);
	} else {
		return(1);
	}
}
  
configure:2949: checking whether to force non-PIC code in shared modules
configure:3073: gcc -o conftest -g -O2   conftest.c  1>&5
/root/tmp/cccppdDZ.o(.text+0x28): In function `main':
/home/lera/tmp/php-4.4.5/configure:3068: undefined reference to `pthread_mutexattr_init'
/root/tmp/cccppdDZ.o(.text+0x3c):/home/lera/tmp/php-4.4.5/configure:3069: undefined reference to `pthread_create'
collect2: ld returned 1 exit status
configure: failed program was:
#line 3055 "configure"
#include "confdefs.h"

#include <pthread.h>
#include <stddef.h>

void *thread_routine(void *data) {
    return data;
}

int main() {
    pthread_t thd;
    pthread_mutexattr_t mattr;
    int data = 1;
    pthread_mutexattr_init(&mattr);
    return pthread_create(&thd, NULL, thread_routine, &data);
} 
configure:3093: checking for pthreads_cflags
configure:3133: gcc -o conftest -g -O2 -kthread   conftest.c  1>&5
gcc: unrecognized option `-kthread'
/root/tmp/cc84tPR1.o(.text+0x28): In function `main':
/home/lera/tmp/php-4.4.5/configure:3128: undefined reference to `pthread_mutexattr_init'
/root/tmp/cc84tPR1.o(.text+0x3c):/home/lera/tmp/php-4.4.5/configure:3129: undefined reference to `pthread_create'
collect2: ld returned 1 exit status
configure: failed program was:
#line 3115 "configure"
#include "confdefs.h"

#include <pthread.h>
#include <stddef.h>

void *thread_routine(void *data) {
    return data;
}

int main() {
    pthread_t thd;
    pthread_mutexattr_t mattr;
    int data = 1;
    pthread_mutexattr_init(&mattr);
    return pthread_create(&thd, NULL, thread_routine, &data);
} 
configure:3133: gcc -o conftest -g -O2 -pthread   conftest.c  1>&5
configure:3163: checking for pthreads_lib
configure:3301: checking for AOLserver support
configure:3542: checking for Apache 1.x module support via DSO through APXS
configure:3845: checking for Apache 1.x module support
configure:4680: checking for mod_charset compatibility option
configure:4704: checking whether gcc supports -rdynamic
configure:4747: checking for member fd in BUFF *
configure:4766: gcc -c -g -O2  -I/home/lera/tmp/apache_1.3.37rusPL30.23/src/include -I/home/lera/tmp/apache_1.3.37rusPL30.23/src/os/unix conftest.c 1>&5
configure:4817: checking for Apache 2.0 filter-module support via DSO through APXS
configure:5639: checking for Apache 2.0 handler-module support via DSO through APXS
configure:6462: checking for Caudium support
configure:6792: checking for CLI build
configure:6855: checking for embedded SAPI library support
configure:7058: checking for Zeus ISAPI support
configure:7288: checking for NSAPI support
configure:7629: checking for PHTTPD support
configure:7858: checking for Pi3Web support
configure:8187: checking for Roxen/Pike support
configure:8456: checking for Servlet support
configure:8974: checking for thttpd
configure:9200: checking for TUX
configure:9434: checking for webjames
configure:9855: checking for chosen SAPI module
configure:10760: checking for missing declarations of reentrant functions
configure:10769: gcc -c -g -O2  conftest.c 1>&5
configure:10794: gcc -c -g -O2  conftest.c 1>&5
configure:10819: gcc -c -g -O2  conftest.c 1>&5
configure:10844: gcc -c -g -O2  conftest.c 1>&5
configure:10869: gcc -c -g -O2  conftest.c 1>&5
configure:10893: checking for sendmail
configure:10934: checking whether system uses EBCDIC
configure:10953: gcc -o conftest -g -O2   conftest.c  1>&5
configure: failed program was:
#line 10945 "configure"
#include "confdefs.h"

int main(void) { 
  return (unsigned char)'A' != (unsigned char)0xC1; 
} 

configure:11026: checking for socket
configure:11054: gcc -o conftest -g -O2   conftest.c  1>&5
configure:11283: checking for htonl
configure:11311: gcc -o conftest -g -O2   conftest.c  1>&5
configure:11540: checking for gethostname
configure:11568: gcc -o conftest -g -O2   conftest.c  1>&5
configure:11797: checking for gethostbyaddr
configure:11825: gcc -o conftest -g -O2   conftest.c  1>&5
configure:12054: checking for yp_get_default_domain
configure:12082: gcc -o conftest -g -O2   conftest.c  1>&5
/root/tmp/ccy1A9K0.o(.text+0x9): In function `main':
/home/lera/tmp/php-4.4.5/configure:12076: undefined reference to `yp_get_default_domain'
collect2: ld returned 1 exit status
configure: failed program was:
#line 12059 "configure"
#include "confdefs.h"
/* System header to define __stub macros and hopefully few prototypes,
    which can conflict with char yp_get_default_domain(); below.  */
#include <assert.h>
/* Override any gcc2 internal prototype to avoid an error.  */
/* We use char because int might match the return type of a gcc2
    builtin and then its argument prototype would still apply.  */
char yp_get_default_domain();

int main() {

/* The GNU C library defines this for functions which it implements
    to always fail with ENOSYS.  Some functions are actually named
    something starting with __ and the normal name is an alias.  */
#if defined (__stub_yp_get_default_domain) || defined (__stub___yp_get_default_domain)
choke me
#else
yp_get_default_domain();
#endif

; return 0; }
configure:12100: checking for __yp_get_default_domain
configure:12128: gcc -o conftest -g -O2   conftest.c  1>&5
/root/tmp/ccoH36j1.o(.text+0x9): In function `main':
/home/lera/tmp/php-4.4.5/configure:12122: undefined reference to `__yp_get_default_domain'
collect2: ld returned 1 exit status
configure: failed program was:
#line 12105 "configure"
#include "confdefs.h"
/* System header to define __stub macros and hopefully few prototypes,
    which can conflict with char __yp_get_default_domain(); below.  */
#include <assert.h>
/* Override any gcc2 internal prototype to avoid an error.  */
/* We use char because int might match the return type of a gcc2
    builtin and then its argument prototype would still apply.  */
char __yp_get_default_domain();

int main() {

/* The GNU C library defines this for functions which it implements
    to always fail with ENOSYS.  Some functions are actually named
    something starting with __ and the normal name is an alias.  */
#if defined (__stub___yp_get_default_domain) || defined (__stub_____yp_get_default_domain)
choke me
#else
__yp_get_default_domain();
#endif

; return 0; }
configure:12166: checking for yp_get_default_domain in -lnsl
configure:12185: gcc -o conftest -g -O2   conftest.c -lnsl   1>&5
configure:12260: gcc -o conftest -g -O2   conftest.c  -lnsl 1>&5
configure:12312: checking for dlopen
configure:12340: gcc -o conftest -g -O2   conftest.c -lnsl  1>&5
/root/tmp/ccQ07oCk.o(.text+0x9): In function `main':
/home/lera/tmp/php-4.4.5/configure:12334: undefined reference to `dlopen'
collect2: ld returned 1 exit status
configure: failed program was:
#line 12317 "configure"
#include "confdefs.h"
/* System header to define __stub macros and hopefully few prototypes,
    which can conflict with char dlopen(); below.  */
#include <assert.h>
/* Override any gcc2 internal prototype to avoid an error.  */
/* We use char because int might match the return type of a gcc2
    builtin and then its argument prototype would still apply.  */
char dlopen();

int main() {

/* The GNU C library defines this for functions which it implements
    to always fail with ENOSYS.  Some functions are actually named
    something starting with __ and the normal name is an alias.  */
#if defined (__stub_dlopen) || defined (__stub___dlopen)
choke me
#else
dlopen();
#endif

; return 0; }
configure:12358: checking for __dlopen
configure:12386: gcc -o conftest -g -O2   conftest.c -lnsl  1>&5
/root/tmp/ccodChdn.o(.text+0x9): In function `main':
/home/lera/tmp/php-4.4.5/configure:12380: undefined reference to `__dlopen'
collect2: ld returned 1 exit status
configure: failed program was:
#line 12363 "configure"
#include "confdefs.h"
/* System header to define __stub macros and hopefully few prototypes,
    which can conflict with char __dlopen(); below.  */
#include <assert.h>
/* Override any gcc2 internal prototype to avoid an error.  */
/* We use char because int might match the return type of a gcc2
    builtin and then its argument prototype would still apply.  */
char __dlopen();

int main() {

/* The GNU C library defines this for functions which it implements
    to always fail with ENOSYS.  Some functions are actually named
    something starting with __ and the normal name is an alias.  */
#if defined (__stub___dlopen) || defined (__stub_____dlopen)
choke me
#else
__dlopen();
#endif

; return 0; }
configure:12424: checking for dlopen in -ldl
configure:12443: gcc -o conftest -g -O2   conftest.c -ldl  -lnsl  1>&5
configure:12518: gcc -o conftest -g -O2   conftest.c -lnsl  -ldl 1>&5
configure:12570: checking for sin in -lm
configure:12589: gcc -o conftest -g -O2   conftest.c -lm  -ldl -lnsl  1>&5
configure:12582: warning: conflicting types for built-in function `sin'
configure:12623: checking for res_search
configure:12651: gcc -o conftest -g -O2   conftest.c -lm -ldl -lnsl  1>&5
/root/tmp/ccKRebvU.o(.text+0x9): In function `main':
/home/lera/tmp/php-4.4.5/configure:12645: undefined reference to `res_search'
collect2: ld returned 1 exit status
configure: failed program was:
#line 12628 "configure"
#include "confdefs.h"
/* System header to define __stub macros and hopefully few prototypes,
    which can conflict with char res_search(); below.  */
#include <assert.h>
/* Override any gcc2 internal prototype to avoid an error.  */
/* We use char because int might match the return type of a gcc2
    builtin and then its argument prototype would still apply.  */
char res_search();

int main() {

/* The GNU C library defines this for functions which it implements
    to always fail with ENOSYS.  Some functions are actually named
    something starting with __ and the normal name is an alias.  */
#if defined (__stub_res_search) || defined (__stub___res_search)
choke me
#else
res_search();
#endif

; return 0; }
configure:12669: checking for __res_search
configure:12697: gcc -o conftest -g -O2   conftest.c -lm -ldl -lnsl  1>&5
/root/tmp/cckd9tKZ.o(.text+0x9): In function `main':
/home/lera/tmp/php-4.4.5/configure:12691: undefined reference to `__res_search'
collect2: ld returned 1 exit status
configure: failed program was:
#line 12674 "configure"
#include "confdefs.h"
/* System header to define __stub macros and hopefully few prototypes,
    which can conflict with char __res_search(); below.  */
#include <assert.h>
/* Override any gcc2 internal prototype to avoid an error.  */
/* We use char because int might match the return type of a gcc2
    builtin and then its argument prototype would still apply.  */
char __res_search();

int main() {

/* The GNU C library defines this for functions which it implements
    to always fail with ENOSYS.  Some functions are actually named
    something starting with __ and the normal name is an alias.  */
#if defined (__stub___res_search) || defined (__stub_____res_search)
choke me
#else
__res_search();
#endif

; return 0; }
configure:12735: checking for res_search in -lresolv
configure:12754: gcc -o conftest -g -O2   conftest.c -lresolv  -lm -ldl -lnsl  1>&5
configure:12829: gcc -o conftest -g -O2   conftest.c -lm -ldl -lnsl  -lresolv 1>&5
configure:13159: checking for inet_aton
configure:13187: gcc -o conftest -g -O2   conftest.c -lresolv -lm -ldl -lnsl  1>&5
configure:13555: checking for dn_skipname
configure:13583: gcc -o conftest -g -O2   conftest.c -lresolv -lm -ldl -lnsl  1>&5
/root/tmp/ccKypXdA.o(.text+0x9): In function `main':
/home/lera/tmp/php-4.4.5/configure:13577: undefined reference to `dn_skipname'
collect2: ld returned 1 exit status
configure: failed program was:
#line 13560 "configure"
#include "confdefs.h"
/* System header to define __stub macros and hopefully few prototypes,
    which can conflict with char dn_skipname(); below.  */
#include <assert.h>
/* Override any gcc2 internal prototype to avoid an error.  */
/* We use char because int might match the return type of a gcc2
    builtin and then its argument prototype would still apply.  */
char dn_skipname();

int main() {

/* The GNU C library defines this for functions which it implements
    to always fail with ENOSYS.  Some functions are actually named
    something starting with __ and the normal name is an alias.  */
#if defined (__stub_dn_skipname) || defined (__stub___dn_skipname)
choke me
#else
dn_skipname();
#endif

; return 0; }
configure:13601: checking for __dn_skipname
configure:13629: gcc -o conftest -g -O2   conftest.c -lresolv -lm -ldl -lnsl  1>&5
configure:13949: checking for ANSI C header files
configure:13962: gcc -E  conftest.c >/dev/null 2>conftest.out
configure:14029: gcc -o conftest -g -O2   conftest.c -lresolv -lm -ldl -lnsl  1>&5
configure:14057: checking for dirent.h that defines DIR
configure:14070: gcc -c -g -O2  conftest.c 1>&5
configure:14095: checking for opendir in -ldir
configure:14114: gcc -o conftest -g -O2   conftest.c -ldir  -lresolv -lm -ldl -lnsl  1>&5
/usr/bin/ld: cannot find -ldir
collect2: ld returned 1 exit status
configure: failed program was:
#line 14103 "configure"
#include "confdefs.h"
/* Override any gcc2 internal prototype to avoid an error.  */
/* We use char because int might match the return type of a gcc2
    builtin and then its argument prototype would still apply.  */
char opendir();

int main() {
opendir()
; return 0; }
configure:14180: checking for fclose declaration
configure:14189: gcc -c -g -O2  conftest.c 1>&5
configure:14266: checking for inttypes.h
configure:14276: gcc -E  conftest.c >/dev/null 2>conftest.out
configure:14266: checking for stdint.h
configure:14276: gcc -E  conftest.c >/dev/null 2>conftest.out
configure:14266: checking for dirent.h
configure:14276: gcc -E  conftest.c >/dev/null 2>conftest.out
configure:14266: checking for ApplicationServices/ApplicationServices.h
configure:14276: gcc -E  conftest.c >/dev/null 2>conftest.out
configure:14272:53: ApplicationServices/ApplicationServices.h: No such file or directory
configure: failed program was:
#line 14271 "configure"
#include "confdefs.h"
#include <ApplicationServices/ApplicationServices.h>
configure:14266: checking for sys/param.h
configure:14276: gcc -E  conftest.c >/dev/null 2>conftest.out
configure:14266: checking for sys/types.h
configure:14276: gcc -E  conftest.c >/dev/null 2>conftest.out
configure:14266: checking for sys/time.h
configure:14276: gcc -E  conftest.c >/dev/null 2>conftest.out
configure:14266: checking for netinet/in.h
configure:14276: gcc -E  conftest.c >/dev/null 2>conftest.out
configure:14266: checking for alloca.h
configure:14276: gcc -E  conftest.c >/dev/null 2>conftest.out
configure:14266: checking for arpa/inet.h
configure:14276: gcc -E  conftest.c >/dev/null 2>conftest.out
configure:14266: checking for arpa/nameser.h
configure:14276: gcc -E  conftest.c >/dev/null 2>conftest.out
configure:14266: checking for assert.h
configure:14276: gcc -E  conftest.c >/dev/null 2>conftest.out
configure:14266: checking for crypt.h
configure:14276: gcc -E  conftest.c >/dev/null 2>conftest.out
configure:14266: checking for fcntl.h
configure:14276: gcc -E  conftest.c >/dev/null 2>conftest.out
configure:14266: checking for grp.h
configure:14276: gcc -E  conftest.c >/dev/null 2>conftest.out
configure:14266: checking for ieeefp.h
configure:14276: gcc -E  conftest.c >/dev/null 2>conftest.out
configure:14272:20: ieeefp.h: No such file or directory
configure: failed program was:
#line 14271 "configure"
#include "confdefs.h"
#include <ieeefp.h>
configure:14266: checking for langinfo.h
configure:14276: gcc -E  conftest.c >/dev/null 2>conftest.out
configure:14266: checking for limits.h
configure:14276: gcc -E  conftest.c >/dev/null 2>conftest.out
configure:14266: checking for locale.h
configure:14276: gcc -E  conftest.c >/dev/null 2>conftest.out
configure:14266: checking for monetary.h
configure:14276: gcc -E  conftest.c >/dev/null 2>conftest.out
configure:14266: checking for mach-o/dyld.h
configure:14276: gcc -E  conftest.c >/dev/null 2>conftest.out
configure:14272:25: mach-o/dyld.h: No such file or directory
configure: failed program was:
#line 14271 "configure"
#include "confdefs.h"
#include <mach-o/dyld.h>
configure:14266: checking for netdb.h
configure:14276: gcc -E  conftest.c >/dev/null 2>conftest.out
configure:14266: checking for pwd.h
configure:14276: gcc -E  conftest.c >/dev/null 2>conftest.out
configure:14266: checking for resolv.h
configure:14276: gcc -E  conftest.c >/dev/null 2>conftest.out
configure:14266: checking for signal.h
configure:14276: gcc -E  conftest.c >/dev/null 2>conftest.out
configure:14266: checking for stdarg.h
configure:14276: gcc -E  conftest.c >/dev/null 2>conftest.out
configure:14266: checking for stdlib.h
configure:14276: gcc -E  conftest.c >/dev/null 2>conftest.out
configure:14266: checking for string.h
configure:14276: gcc -E  conftest.c >/dev/null 2>conftest.out
configure:14266: checking for syslog.h
configure:14276: gcc -E  conftest.c >/dev/null 2>conftest.out
configure:14266: checking for sysexits.h
configure:14276: gcc -E  conftest.c >/dev/null 2>conftest.out
configure:14266: checking for sys/file.h
configure:14276: gcc -E  conftest.c >/dev/null 2>conftest.out
configure:14266: checking for sys/mman.h
configure:14276: gcc -E  conftest.c >/dev/null 2>conftest.out
configure:14266: checking for sys/mount.h
configure:14276: gcc -E  conftest.c >/dev/null 2>conftest.out
configure:14266: checking for sys/poll.h
configure:14276: gcc -E  conftest.c >/dev/null 2>conftest.out
configure:14266: checking for sys/resource.h
configure:14276: gcc -E  conftest.c >/dev/null 2>conftest.out
configure:14266: checking for sys/select.h
configure:14276: gcc -E  conftest.c >/dev/null 2>conftest.out
configure:14266: checking for sys/socket.h
configure:14276: gcc -E  conftest.c >/dev/null 2>conftest.out
configure:14266: checking for sys/statfs.h
configure:14276: gcc -E  conftest.c >/dev/null 2>conftest.out
configure:14266: checking for sys/statvfs.h
configure:14276: gcc -E  conftest.c >/dev/null 2>conftest.out
configure:14266: checking for sys/vfs.h
configure:14276: gcc -E  conftest.c >/dev/null 2>conftest.out
configure:14266: checking for sys/sysexits.h
configure:14276: gcc -E  conftest.c >/dev/null 2>conftest.out
configure:14272:26: sys/sysexits.h: No such file or directory
configure: failed program was:
#line 14271 "configure"
#include "confdefs.h"
#include <sys/sysexits.h>
configure:14266: checking for sys/varargs.h
configure:14276: gcc -E  conftest.c >/dev/null 2>conftest.out
configure:14272:25: sys/varargs.h: No such file or directory
configure: failed program was:
#line 14271 "configure"
#include "confdefs.h"
#include <sys/varargs.h>
configure:14266: checking for sys/wait.h
configure:14276: gcc -E  conftest.c >/dev/null 2>conftest.out
configure:14266: checking for unistd.h
configure:14276: gcc -E  conftest.c >/dev/null 2>conftest.out
configure:14266: checking for unix.h
configure:14276: gcc -E  conftest.c >/dev/null 2>conftest.out
configure:14272:18: unix.h: No such file or directory
configure: failed program was:
#line 14271 "configure"
#include "confdefs.h"
#include <unix.h>
configure:14266: checking for utime.h
configure:14276: gcc -E  conftest.c >/dev/null 2>conftest.out
configure:14266: checking for sys/utsname.h
configure:14276: gcc -E  conftest.c >/dev/null 2>conftest.out
configure:14266: checking for sys/ipc.h
configure:14276: gcc -E  conftest.c >/dev/null 2>conftest.out
configure:14266: checking for dlfcn.h
configure:14276: gcc -E  conftest.c >/dev/null 2>conftest.out
configure:14305: checking for fopencookie
configure:14333: gcc -o conftest -g -O2   conftest.c -lresolv -lm -ldl -lnsl  1>&5
configure:14364: gcc -c -g -O2  conftest.c 1>&5
configure:14416: gcc -o conftest -g -O2   conftest.c -lresolv -lm -ldl -lnsl  1>&5
configure:14477: checking for broken getcwd
configure:14492: checking for broken libc stdio
configure:14553: gcc -o conftest -g -O2   conftest.c -lresolv -lm -ldl -lnsl  1>&5
configure: failed program was:
#line 14525 "configure"
#include "confdefs.h"

#include <stdio.h>
int main(int argc, char *argv[])
{
  FILE *fp;
  long position;
  char *filename = "/tmp/phpglibccheck";
  
  fp = fopen(filename, "w");
  if (fp == NULL) {
	  perror("fopen");
	  exit(2);
  }
  fputs("foobar", fp);
  fclose(fp);

  fp = fopen(filename, "a+");
  position = ftell(fp);
  fclose(fp);
  unlink(filename);
  if (position == 0)
	return 1;
  return 0;
}

configure:14581: checking whether struct tm is in sys/time.h or time.h
configure:14594: gcc -c -g -O2  conftest.c 1>&5
configure:14615: checking for tm_zone in struct tm
configure:14628: gcc -c -g -O2  conftest.c 1>&5
configure:14687: checking for tm_gmtoff in struct tm
configure:14700: gcc -c -g -O2  conftest.c 1>&5
configure:14723: checking for struct flock
configure:14738: gcc -c -g -O2  conftest.c 1>&5
configure:14765: checking for socklen_t
configure:14782: gcc -c -g -O2  conftest.c 1>&5
configure:14808: checking size of intmax_t
configure:14827: gcc -o conftest -g -O2   conftest.c -lresolv -lm -ldl -lnsl  1>&5
configure: In function `main':
configure:14822: error: `intmax_t' undeclared (first use in this function)
configure:14822: error: (Each undeclared identifier is reported only once
configure:14822: error: for each function it appears in.)
configure: failed program was:
#line 14816 "configure"
#include "confdefs.h"
#include <stdio.h>
int main()
{
  FILE *f=fopen("conftestval", "w");
  if (!f) return(1);
  fprintf(f, "%d\n", sizeof(intmax_t));
  return(0);
}
configure:14847: checking size of size_t
configure:14866: gcc -o conftest -g -O2   conftest.c -lresolv -lm -ldl -lnsl  1>&5
configure:14886: checking size of ssize_t
configure:14905: gcc -o conftest -g -O2   conftest.c -lresolv -lm -ldl -lnsl  1>&5
configure: In function `main':
configure:14900: error: `ssize_t' undeclared (first use in this function)
configure:14900: error: (Each undeclared identifier is reported only once
configure:14900: error: for each function it appears in.)
configure: failed program was:
#line 14894 "configure"
#include "confdefs.h"
#include <stdio.h>
int main()
{
  FILE *f=fopen("conftestval", "w");
  if (!f) return(1);
  fprintf(f, "%d\n", sizeof(ssize_t));
  return(0);
}
configure:14925: checking size of ptrdiff_t
configure:14944: gcc -o conftest -g -O2   conftest.c -lresolv -lm -ldl -lnsl  1>&5
configure: In function `main':
configure:14939: error: `ptrdiff_t' undeclared (first use in this function)
configure:14939: error: (Each undeclared identifier is reported only once
configure:14939: error: for each function it appears in.)
configure: failed program was:
#line 14933 "configure"
#include "confdefs.h"
#include <stdio.h>
int main()
{
  FILE *f=fopen("conftestval", "w");
  if (!f) return(1);
  fprintf(f, "%d\n", sizeof(ptrdiff_t));
  return(0);
}
configure:14964: checking size of long long
configure:14983: gcc -o conftest -g -O2   conftest.c -lresolv -lm -ldl -lnsl  1>&5
configure:15003: checking size of long long int
configure:15022: gcc -o conftest -g -O2   conftest.c -lresolv -lm -ldl -lnsl  1>&5
configure:15042: checking size of long
configure:15061: gcc -o conftest -g -O2   conftest.c -lresolv -lm -ldl -lnsl  1>&5
configure:15081: checking size of int
configure:15100: gcc -o conftest -g -O2   conftest.c -lresolv -lm -ldl -lnsl  1>&5
configure:15121: checking for st_blksize in struct stat
configure:15134: gcc -c -g -O2  conftest.c 1>&5
configure:15156: checking for st_blocks in struct stat
configure:15169: gcc -c -g -O2  conftest.c 1>&5
configure:15196: checking for st_rdev in struct stat
configure:15209: gcc -c -g -O2  conftest.c 1>&5
configure:15231: checking for size_t
configure:15264: checking for uid_t in sys/types.h
configure:15299: checking for struct sockaddr_storage
configure:15312: gcc -c -g -O2  conftest.c 1>&5
configure:15344: gcc -c -g -O2  conftest.c 1>&5
configure: In function `main':
configure:15340: error: structure has no member named `sa_len'
configure: failed program was:
#line 15334 "configure"
#include "confdefs.h"

#include <sys/types.h>
#include <sys/socket.h>

int main() {
static struct sockaddr sa; int n = (int) sa.sa_len; return n
; return 0; }
configure:15357: checking for IPv6 support
configure:15371: gcc -o conftest -g -O2   conftest.c -lresolv -lm -ldl -lnsl  1>&5
configure:15389: checking for vprintf
configure:15417: gcc -o conftest -g -O2   conftest.c -lresolv -lm -ldl -lnsl  1>&5
configure:15401: warning: conflicting types for built-in function `vprintf'
configure:15561: checking for alphasort
configure:15589: gcc -o conftest -g -O2   conftest.c -lresolv -lm -ldl -lnsl  1>&5
configure:15561: checking for asctime_r
configure:15589: gcc -o conftest -g -O2   conftest.c -lresolv -lm -ldl -lnsl  1>&5
configure:15561: checking for chroot
configure:15589: gcc -o conftest -g -O2   conftest.c -lresolv -lm -ldl -lnsl  1>&5
configure:15561: checking for ctime_r
configure:15589: gcc -o conftest -g -O2   conftest.c -lresolv -lm -ldl -lnsl  1>&5
configure:15561: checking for cuserid
configure:15589: gcc -o conftest -g -O2   conftest.c -lresolv -lm -ldl -lnsl  1>&5
configure:15561: checking for crypt
configure:15589: gcc -o conftest -g -O2   conftest.c -lresolv -lm -ldl -lnsl  1>&5
/root/tmp/cccMkcEv.o(.text+0x9): In function `main':
/home/lera/tmp/php-4.4.5/configure:15583: undefined reference to `crypt'
collect2: ld returned 1 exit status
configure: failed program was:
#line 15566 "configure"
#include "confdefs.h"
/* System header to define __stub macros and hopefully few prototypes,
    which can conflict with char crypt(); below.  */
#include <assert.h>
/* Override any gcc2 internal prototype to avoid an error.  */
/* We use char because int might match the return type of a gcc2
    builtin and then its argument prototype would still apply.  */
char crypt();

int main() {

/* The GNU C library defines this for functions which it implements
    to always fail with ENOSYS.  Some functions are actually named
    something starting with __ and the normal name is an alias.  */
#if defined (__stub_crypt) || defined (__stub___crypt)
choke me
#else
crypt();
#endif

; return 0; }
configure:15561: checking for flock
configure:15589: gcc -o conftest -g -O2   conftest.c -lresolv -lm -ldl -lnsl  1>&5
configure:15561: checking for ftok
configure:15589: gcc -o conftest -g -O2   conftest.c -lresolv -lm -ldl -lnsl  1>&5
configure:15561: checking for funopen
configure:15589: gcc -o conftest -g -O2   conftest.c -lresolv -lm -ldl -lnsl  1>&5
/root/tmp/ccpcw9Fm.o(.text+0x9): In function `main':
/home/lera/tmp/php-4.4.5/configure:15583: undefined reference to `funopen'
collect2: ld returned 1 exit status
configure: failed program was:
#line 15566 "configure"
#include "confdefs.h"
/* System header to define __stub macros and hopefully few prototypes,
    which can conflict with char funopen(); below.  */
#include <assert.h>
/* Override any gcc2 internal prototype to avoid an error.  */
/* We use char because int might match the return type of a gcc2
    builtin and then its argument prototype would still apply.  */
char funopen();

int main() {

/* The GNU C library defines this for functions which it implements
    to always fail with ENOSYS.  Some functions are actually named
    something starting with __ and the normal name is an alias.  */
#if defined (__stub_funopen) || defined (__stub___funopen)
choke me
#else
funopen();
#endif

; return 0; }
configure:15561: checking for gai_strerror
configure:15589: gcc -o conftest -g -O2   conftest.c -lresolv -lm -ldl -lnsl  1>&5
configure:15561: checking for gcvt
configure:15589: gcc -o conftest -g -O2   conftest.c -lresolv -lm -ldl -lnsl  1>&5
configure:15561: checking for getlogin
configure:15589: gcc -o conftest -g -O2   conftest.c -lresolv -lm -ldl -lnsl  1>&5
configure:15561: checking for getprotobyname
configure:15589: gcc -o conftest -g -O2   conftest.c -lresolv -lm -ldl -lnsl  1>&5
configure:15561: checking for getprotobynumber
configure:15589: gcc -o conftest -g -O2   conftest.c -lresolv -lm -ldl -lnsl  1>&5
configure:15561: checking for getservbyname
configure:15589: gcc -o conftest -g -O2   conftest.c -lresolv -lm -ldl -lnsl  1>&5
configure:15561: checking for getservbyport
configure:15589: gcc -o conftest -g -O2   conftest.c -lresolv -lm -ldl -lnsl  1>&5
configure:15561: checking for getrusage
configure:15589: gcc -o conftest -g -O2   conftest.c -lresolv -lm -ldl -lnsl  1>&5
configure:15561: checking for gettimeofday
configure:15589: gcc -o conftest -g -O2   conftest.c -lresolv -lm -ldl -lnsl  1>&5
configure:15561: checking for gmtime_r
configure:15589: gcc -o conftest -g -O2   conftest.c -lresolv -lm -ldl -lnsl  1>&5
configure:15561: checking for isascii
configure:15589: gcc -o conftest -g -O2   conftest.c -lresolv -lm -ldl -lnsl  1>&5
configure:15561: checking for link
configure:15589: gcc -o conftest -g -O2   conftest.c -lresolv -lm -ldl -lnsl  1>&5
configure:15561: checking for localtime_r
configure:15589: gcc -o conftest -g -O2   conftest.c -lresolv -lm -ldl -lnsl  1>&5
configure:15561: checking for lockf
configure:15589: gcc -o conftest -g -O2   conftest.c -lresolv -lm -ldl -lnsl  1>&5
configure:15561: checking for lrand48
configure:15589: gcc -o conftest -g -O2   conftest.c -lresolv -lm -ldl -lnsl  1>&5
configure:15561: checking for memcpy
configure:15589: gcc -o conftest -g -O2   conftest.c -lresolv -lm -ldl -lnsl  1>&5
configure:15573: warning: conflicting types for built-in function `memcpy'
configure:15561: checking for memmove
configure:15589: gcc -o conftest -g -O2   conftest.c -lresolv -lm -ldl -lnsl  1>&5
configure:15561: checking for mkstemp
configure:15589: gcc -o conftest -g -O2   conftest.c -lresolv -lm -ldl -lnsl  1>&5
configure:15561: checking for mmap
configure:15589: gcc -o conftest -g -O2   conftest.c -lresolv -lm -ldl -lnsl  1>&5
configure:15561: checking for nl_langinfo
configure:15589: gcc -o conftest -g -O2   conftest.c -lresolv -lm -ldl -lnsl  1>&5
configure:15561: checking for perror
configure:15589: gcc -o conftest -g -O2   conftest.c -lresolv -lm -ldl -lnsl  1>&5
configure:15561: checking for poll
configure:15589: gcc -o conftest -g -O2   conftest.c -lresolv -lm -ldl -lnsl  1>&5
configure:15561: checking for putenv
configure:15589: gcc -o conftest -g -O2   conftest.c -lresolv -lm -ldl -lnsl  1>&5
configure:15561: checking for realpath
configure:15589: gcc -o conftest -g -O2   conftest.c -lresolv -lm -ldl -lnsl  1>&5
configure:15561: checking for random
configure:15589: gcc -o conftest -g -O2   conftest.c -lresolv -lm -ldl -lnsl  1>&5
configure:15561: checking for rand_r
configure:15589: gcc -o conftest -g -O2   conftest.c -lresolv -lm -ldl -lnsl  1>&5
configure:15561: checking for regcomp
configure:15589: gcc -o conftest -g -O2   conftest.c -lresolv -lm -ldl -lnsl  1>&5
configure:15561: checking for res_search
configure:15561: checking for scandir
configure:15589: gcc -o conftest -g -O2   conftest.c -lresolv -lm -ldl -lnsl  1>&5
configure:15561: checking for setitimer
configure:15589: gcc -o conftest -g -O2   conftest.c -lresolv -lm -ldl -lnsl  1>&5
configure:15561: checking for setlocale
configure:15589: gcc -o conftest -g -O2   conftest.c -lresolv -lm -ldl -lnsl  1>&5
configure:15561: checking for localeconv
configure:15589: gcc -o conftest -g -O2   conftest.c -lresolv -lm -ldl -lnsl  1>&5
configure:15561: checking for setsockopt
configure:15589: gcc -o conftest -g -O2   conftest.c -lresolv -lm -ldl -lnsl  1>&5
configure:15561: checking for setvbuf
configure:15589: gcc -o conftest -g -O2   conftest.c -lresolv -lm -ldl -lnsl  1>&5
configure:15561: checking for shutdown
configure:15589: gcc -o conftest -g -O2   conftest.c -lresolv -lm -ldl -lnsl  1>&5
configure:15561: checking for sin
configure:15589: gcc -o conftest -g -O2   conftest.c -lresolv -lm -ldl -lnsl  1>&5
configure:15573: warning: conflicting types for built-in function `sin'
configure:15561: checking for snprintf
configure:15589: gcc -o conftest -g -O2   conftest.c -lresolv -lm -ldl -lnsl  1>&5
configure:15573: warning: conflicting types for built-in function `snprintf'
configure:15561: checking for srand48
configure:15589: gcc -o conftest -g -O2   conftest.c -lresolv -lm -ldl -lnsl  1>&5
configure:15561: checking for srandom
configure:15589: gcc -o conftest -g -O2   conftest.c -lresolv -lm -ldl -lnsl  1>&5
configure:15561: checking for statfs
configure:15589: gcc -o conftest -g -O2   conftest.c -lresolv -lm -ldl -lnsl  1>&5
configure:15561: checking for statvfs
configure:15589: gcc -o conftest -g -O2   conftest.c -lresolv -lm -ldl -lnsl  1>&5
configure:15561: checking for std_syslog
configure:15589: gcc -o conftest -g -O2   conftest.c -lresolv -lm -ldl -lnsl  1>&5
/root/tmp/cc0m60LJ.o(.text+0x9): In function `main':
/home/lera/tmp/php-4.4.5/configure:15583: undefined reference to `std_syslog'
collect2: ld returned 1 exit status
configure: failed program was:
#line 15566 "configure"
#include "confdefs.h"
/* System header to define __stub macros and hopefully few prototypes,
    which can conflict with char std_syslog(); below.  */
#include <assert.h>
/* Override any gcc2 internal prototype to avoid an error.  */
/* We use char because int might match the return type of a gcc2
    builtin and then its argument prototype would still apply.  */
char std_syslog();

int main() {

/* The GNU C library defines this for functions which it implements
    to always fail with ENOSYS.  Some functions are actually named
    something starting with __ and the normal name is an alias.  */
#if defined (__stub_std_syslog) || defined (__stub___std_syslog)
choke me
#else
std_syslog();
#endif

; return 0; }
configure:15561: checking for strcasecmp
configure:15589: gcc -o conftest -g -O2   conftest.c -lresolv -lm -ldl -lnsl  1>&5
configure:15561: checking for strcoll
configure:15589: gcc -o conftest -g -O2   conftest.c -lresolv -lm -ldl -lnsl  1>&5
configure:15561: checking for strdup
configure:15589: gcc -o conftest -g -O2   conftest.c -lresolv -lm -ldl -lnsl  1>&5
configure:15561: checking for strerror
configure:15589: gcc -o conftest -g -O2   conftest.c -lresolv -lm -ldl -lnsl  1>&5
configure:15561: checking for strftime
configure:15589: gcc -o conftest -g -O2   conftest.c -lresolv -lm -ldl -lnsl  1>&5
configure:15561: checking for strstr
configure:15589: gcc -o conftest -g -O2   conftest.c -lresolv -lm -ldl -lnsl  1>&5
configure:15573: warning: conflicting types for built-in function `strstr'
configure:15561: checking for strtok_r
configure:15589: gcc -o conftest -g -O2   conftest.c -lresolv -lm -ldl -lnsl  1>&5
configure:15561: checking for symlink
configure:15589: gcc -o conftest -g -O2   conftest.c -lresolv -lm -ldl -lnsl  1>&5
configure:15561: checking for tempnam
configure:15589: gcc -o conftest -g -O2   conftest.c -lresolv -lm -ldl -lnsl  1>&5
/root/tmp/ccDJLmhg.o(.text+0x9): In function `main':
/home/lera/tmp/php-4.4.5/configure:15583: warning: the use of `tempnam' is dangerous, better use `mkstemp'
configure:15561: checking for tzset
configure:15589: gcc -o conftest -g -O2   conftest.c -lresolv -lm -ldl -lnsl  1>&5
configure:15561: checking for unsetenv
configure:15589: gcc -o conftest -g -O2   conftest.c -lresolv -lm -ldl -lnsl  1>&5
configure:15561: checking for usleep
configure:15589: gcc -o conftest -g -O2   conftest.c -lresolv -lm -ldl -lnsl  1>&5
configure:15561: checking for utime
configure:15589: gcc -o conftest -g -O2   conftest.c -lresolv -lm -ldl -lnsl  1>&5
configure:15561: checking for vsnprintf
configure:15589: gcc -o conftest -g -O2   conftest.c -lresolv -lm -ldl -lnsl  1>&5
configure:15573: warning: conflicting types for built-in function `vsnprintf'
configure:15615: checking for getaddrinfo
configure:15627: gcc -o conftest -g -O2   conftest.c -lresolv -lm -ldl -lnsl  1>&5
configure:15673: gcc -o conftest -g -O2   conftest.c -lresolv -lm -ldl -lnsl  1>&5
configure:15705: checking for strlcat
configure:15733: gcc -o conftest -g -O2   conftest.c -lresolv -lm -ldl -lnsl  1>&5
/root/tmp/ccbdmCyk.o(.text+0x9): In function `main':
/home/lera/tmp/php-4.4.5/configure:15727: undefined reference to `strlcat'
collect2: ld returned 1 exit status
configure: failed program was:
#line 15710 "configure"
#include "confdefs.h"
/* System header to define __stub macros and hopefully few prototypes,
    which can conflict with char strlcat(); below.  */
#include <assert.h>
/* Override any gcc2 internal prototype to avoid an error.  */
/* We use char because int might match the return type of a gcc2
    builtin and then its argument prototype would still apply.  */
char strlcat();

int main() {

/* The GNU C library defines this for functions which it implements
    to always fail with ENOSYS.  Some functions are actually named
    something starting with __ and the normal name is an alias.  */
#if defined (__stub_strlcat) || defined (__stub___strlcat)
choke me
#else
strlcat();
#endif

; return 0; }
configure:15705: checking for strlcpy
configure:15733: gcc -o conftest -g -O2   conftest.c -lresolv -lm -ldl -lnsl  1>&5
/root/tmp/cc2XEIzf.o(.text+0x9): In function `main':
/home/lera/tmp/php-4.4.5/configure:15727: undefined reference to `strlcpy'
collect2: ld returned 1 exit status
configure: failed program was:
#line 15710 "configure"
#include "confdefs.h"
/* System header to define __stub macros and hopefully few prototypes,
    which can conflict with char strlcpy(); below.  */
#include <assert.h>
/* Override any gcc2 internal prototype to avoid an error.  */
/* We use char because int might match the return type of a gcc2
    builtin and then its argument prototype would still apply.  */
char strlcpy();

int main() {

/* The GNU C library defines this for functions which it implements
    to always fail with ENOSYS.  Some functions are actually named
    something starting with __ and the normal name is an alias.  */
#if defined (__stub_strlcpy) || defined (__stub___strlcpy)
choke me
#else
strlcpy();
#endif

; return 0; }
configure:15705: checking for getopt
configure:15733: gcc -o conftest -g -O2   conftest.c -lresolv -lm -ldl -lnsl  1>&5
configure:15760: checking whether utime accepts a null argument
configure:15781: gcc -o conftest -g -O2   conftest.c -lresolv -lm -ldl -lnsl  1>&5
configure:15807: checking for working alloca.h
configure:15840: checking for alloca
configure:15873: gcc -o conftest -g -O2   conftest.c -lresolv -lm -ldl -lnsl  1>&5
configure:16040: checking for declared timezone
configure:16061: gcc -c -g -O2  conftest.c 1>&5
configure:16087: checking for type of reentrant time-related functions
configure:16116: gcc -o conftest -g -O2   conftest.c -lresolv -lm -ldl -lnsl  1>&5
configure: In function `main':
configure:16108: warning: assignment makes integer from pointer without a cast
configure:16109: error: too many arguments to function `asctime_r'
configure: failed program was:
#line 16098 "configure"
#include "confdefs.h"

#include <time.h>

main() {
char buf[27];
struct tm t;
time_t old = 0;
int r, s;

s = gmtime_r(&old, &t);
r = (int) asctime_r(&t, buf, 26);
if (r == s && s == 0) return (0);
return (1);
}

configure:16146: gcc -o conftest -g -O2   conftest.c -lresolv -lm -ldl -lnsl  1>&5
configure: In function `main':
configure:16139: error: too many arguments to function `asctime_r'
configure: failed program was:
#line 16130 "configure"
#include "confdefs.h"

#include <time.h>
main() {
  struct tm t, *s;
  time_t old = 0;
  char buf[27], *p;
  
  s = gmtime_r(&old, &t);
  p = asctime_r(&t, buf, 26);
  if (p == buf && s == &t) return (0);
  return (1);
}
  
configure:16184: checking for readdir_r
configure:16212: gcc -o conftest -g -O2   conftest.c -lresolv -lm -ldl -lnsl  1>&5
configure:16234: checking for type of readdir_r
configure:16270: gcc -o conftest -g -O2   conftest.c -lresolv -lm -ldl -lnsl  1>&5
configure:16388: checking whether to include debugging symbols
configure:16421: checking layout of installed files
configure:16455: checking path to configuration file
configure:16491: checking directory to be scanned for configuration files
configure:16521: checking whether to enable safe mode by default
configure:16556: checking for safe mode exec dir
configure:16597: checking whether to enable PHP's own SIGCHLD handler
configure:16634: checking whether to enable magic quotes by default
configure:16671: checking whether to enable runpaths
configure:16696: checking whether to explicitly link against libgcc
configure:16775: checking whether to enable short tags by default
configure:16812: checking whether to enable dmalloc
configure:16900: checking whether to enable IPv6 support
configure:16930: checking whether to enable versioning
configure:16982: checking for OpenSSL support
configure:17028: checking for Kerberos support
configure:18319: checking for PCRE support
configure:19067: checking for ZLIB support
configure:19113: checking if the location of ZLIB install directory is defined
configure:19664: checking whether to enable bc style precision math functions
configure:19999: checking for BZip2 support
configure:20598: checking whether to enable calendar conversion support
configure:20918: checking for cpdflib support
configure:22138: checking for CRACKlib support
configure:22603: checking whether to enable ctype functions
configure:22919: checking for CURL support
configure:23872: checking for cyrus imap support
configure:24838: checking for xDBM support
configure:25510: checking whether to enable DBA
configure:25835: checking for GDBM support
configure:26140: checking for NDBM support
configure:26442: checking for Berkeley DB4 support
configure:26765: checking for Berkeley DB3 support
configure:27088: checking for Berkeley DB2 support
configure:27408: checking for DBM support
configure:27749: checking for CDB support
configure:27803: checking for INI File support
configure:27857: checking for FlatFile support
configure:27872: checking whether to enable DBA interface
configure:28168: checking whether to enable dbase support
configure:28484: checking whether to enable dbx support
configure:28796: checking whether to enable direct I/O support
configure:29110: checking for DOM support
configure:29824: checking for DOM XSLT support
configure:29849: checking for DOM EXSLT support
configure:30492: checking whether to enable EXIF (metadata from images) support
configure:30808: checking for FrontBase SQL92 (fbsql) support
configure:31283: checking for FDF support
configure:32048: checking whether to enable the bundled filePro support
configure:32364: checking for FriBidi support
configure:32860: checking whether to enable FTP support
configure:33177: checking for GD support
configure:33224: checking for the location of libjpeg
configure:33251: checking for the location of libpng
configure:33304: checking for the location of libXpm
configure:33329: checking for FreeType 1.x support
configure:33354: checking for FreeType 2
configure:33379: checking for T1lib support
configure:33404: checking whether to enable truetype string function in GD
configure:33429: checking whether to enable JIS-mapped Japanese font support in GD
configure:40629: checking for GNU gettext support
configure:41358: checking for GNU MP support
configure:42078: checking for hwapi support
configure:42844: checking for Hyperwave support
configure:43140: checking for iconv support
configure:44270: checking for IMAP support
configure:44316: checking for IMAP Kerberos support
configure:44341: checking for IMAP SSL support
configure:46467: checking for Informix support
configure:47120: checking for Ingres II support
configure:47873: checking for InterBase support
configure:48595: checking for IRCG support
configure:49129: checking for Java support
configure:49966: checking for LDAP support
configure:52448: checking whether to enable multibyte string support
configure:52494: checking whether to enable multibyte regex support
configure:52519: checking for external libmbfl
configure:53284: checking for MCAL support
configure:53734: checking for mcrypt support
configure:54895: checking for MCVE support
configure:54941: checking OpenSSL dir for MCVE
configure:56363: checking for mhash support
configure:56818: checking whether to include mime_magic support
configure:57156: checking for MING support
configure:57876: checking for mnoGoSearch support
configure:58335: checking for msession support
configure:58774: checking for mSQL support
configure:59266: checking for MSSQL support via FreeTDS
configure:59933: checking for MySQL support
configure:59979: checking for specified location of the MySQL UNIX socket
configure:60036: checking for MySQL UNIX socket location
configure:61741: checking size of char
configure:61760: gcc -o conftest -g -O2   conftest.c -lresolv -lm -ldl -lnsl  1>&5
configure:61781: checking size of int
configure:61820: checking size of long
configure:61859: checking size of long long
configure:61898: checking for size_t
configure:61931: checking whether time.h and sys/time.h may both be included
configure:61945: gcc -c -g -O2  conftest.c 1>&5
configure:61966: checking for uid_t in sys/types.h
configure:62001: checking for type ulong
configure:62020: gcc -o conftest -g -O2   conftest.c -lresolv -lm -ldl -lnsl  1>&5
configure:62044: checking for type uchar
configure:62063: gcc -o conftest -g -O2   conftest.c -lresolv -lm -ldl -lnsl  1>&5
configure: In function `main':
configure:62057: error: `uchar' undeclared (first use in this function)
configure:62057: error: (Each undeclared identifier is reported only once
configure:62057: error: for each function it appears in.)
configure:62057: error: parse error before "foo"
configure:62058: error: `foo' undeclared (first use in this function)
configure: failed program was:
#line 62052 "configure"
#include "confdefs.h"
#include <stdio.h>
#include <sys/types.h>
main()
{
  uchar foo;
  foo++;
  exit(0);
}
configure:62087: checking for type uint
configure:62106: gcc -o conftest -g -O2   conftest.c -lresolv -lm -ldl -lnsl  1>&5
configure:62130: checking for type ushort
configure:62149: gcc -o conftest -g -O2   conftest.c -lresolv -lm -ldl -lnsl  1>&5
configure:62173: checking for int8
configure:62203: gcc -o conftest -g -O2   conftest.c -lresolv -lm -ldl -lnsl  1>&5
configure: In function `main':
configure:62197: error: `int8' undeclared (first use in this function)
configure:62197: error: (Each undeclared identifier is reported only once
configure:62197: error: for each function it appears in.)
configure:62197: error: parse error before "i"
configure: failed program was:
#line 62181 "configure"
#include "confdefs.h"

#ifdef HAVE_STDLIB_H
#include <stdlib.h>
#endif

#ifdef HAVE_STDDEF_H
#include <stddef.h>
#endif

#ifdef HAVE_SYS_TYPES_H
#include <sys/types.h>
#endif

int main()
{
    int8 i;
    return 0;
}

configure:62229: checking base type of last arg to accept
configure:62257: g++ -c   conftest.C 1>&5
configure:62306: checking return type of qsort
configure:62324: gcc -c -g -O2  conftest.c 1>&5