rendered paste bodyx86_64-pc-linux-gnu-gcc -DHAVE_CONFIG_H -I. -I../../.. -I. -I../../.. -I../../.
./src/include -I/usr/include/taglib -march=k8 -O2 -pipe -D_FILE_OFFSET_BITS=64 -
MT audio_tagger_la-evfs_debug.lo -MD -MP -MF .deps/audio_tagger_la-evfs_debug.Tp
o -c ../../../src/common/evfs_debug.c -fPIC -DPIC -o .libs/audio_tagger_la-evfs
_debug.o
evfs_meta_audio.c:44:19: error: tag_c.h: No such file or directory
evfs_meta_audio.c: In function 'evfs_file_meta_retrieve':
evfs_meta_audio.c:70: error: 'TagLib_File' undeclared (first use in this functio
n)
evfs_meta_audio.c:70: error: (Each undeclared identifier is reported only once
evfs_meta_audio.c:70: error: for each function it appears in.)
evfs_meta_audio.c:70: error: 'taglib_file' undeclared (first use in this functio
n)
evfs_meta_audio.c:71: error: 'TagLib_Tag' undeclared (first use in this function
)
evfs_meta_audio.c:71: error: 'taglib_tag' undeclared (first use in this function
)
evfs_meta_audio.c:72: error: expected '=', ',', ';', 'asm' or '__attribute__' be
fore '*' token
evfs_meta_audio.c:72: error: 'taglib_props' undeclared (first use in this functi
on)
evfs_meta_audio.c:88: error: 'tmp' undeclared (first use in this function)
make[4]: *** [audio_tagger_la-evfs_meta_audio.lo] Error 1
make[4]: *** Waiting for unfinished jobs....
x86_64-pc-linux-gnu-gcc -DHAVE_CONFIG_H -I. -I../../.. -I. -I../../.. -I../../.
./src/include -I/usr/include/taglib -march=k8 -O2 -pipe -D_FILE_OFFSET_BITS=64 -
MT audio_tagger_la-evfs_debug.lo -MD -MP -MF .deps/audio_tagger_la-evfs_debug.Tp
o -c ../../../src/common/evfs_debug.c -o audio_tagger_la-evfs_debug.o >/dev/null
2>&1
mv -f .deps/audio_tagger_la-evfs_debug.Tpo .deps/audio_tagger_la-evfs_debug.Plo
make[4]: Leaving directory `/var/tmp/portage/sys-fs/evfs-9999/work/e17/apps/evfs
/src/plugins/meta'
make[3]: *** [all-recursive] Error 1
make[3]: Leaving directory `/var/tmp/portage/sys-fs/evfs-9999/work/e17/apps/evfs
/src/plugins'
make[2]: *** [all-recursive] Error 1
make[2]: Leaving directory `/var/tmp/portage/sys-fs/evfs-9999/work/e17/apps/evfs
/src'
make[1]: *** [all-recursive] Error 1
make[1]: Leaving directory `/var/tmp/portage/sys-fs/evfs-9999/work/e17/apps/evfs
'
make: *** [all] Error 2