make
gcc -O2 -Wall -fPIC -DVER_MINOR=0 -DVER_MAJOR=2 -DVER_PATCH=9 -DVER_STRING=\"2.0.9\" -DPCIIDS=\"/usr/share/misc/pci.ids\" -Dbuttonbar -c -o xsys.o xsys.c
xsys.c:133: warning: `xchat_plugin_deinit' defined but not used
gcc -O2 -Wall -fPIC -DVER_MINOR=0 -DVER_MAJOR=2 -DVER_PATCH=9 -DVER_STRING=\"2.0.9\" -DPCIIDS=\"/usr/share/misc/pci.ids\" -Dbuttonbar -c -o parse.o parse.c
parse.c:31:24: pci/header.h: No such file or directory
In file included from parse.c:42:
pci.h:24:21: pci/pci.h: No such file or directory
In file included from parse.c:42:
pci.h:26: error: syntax error before '*' token
parse.c: In function `xs_parse_sound':
parse.c:182: error: `u16' undeclared (first use in this function)
parse.c:182: error: (Each undeclared identifier is reported only once
parse.c:182: error: for each function it appears in.)
parse.c:182: error: syntax error before "class"
parse.c:186: error: `class' undeclared (first use in this function)
parse.c: In function `xs_parse_video':
parse.c:223: error: `u16' undeclared (first use in this function)
parse.c:223: error: syntax error before "class"
parse.c:224: error: `class' undeclared (first use in this function)
parse.c: In function `xs_parse_ether':
parse.c:234: error: `u16' undeclared (first use in this function)
parse.c:234: error: syntax error before "class"
parse.c:235: error: `class' undeclared (first use in this function)
parse.c: In function `xs_parse_agpbridge':
parse.c:245: error: `u16' undeclared (first use in this function)
parse.c:245: error: syntax error before "class"
parse.c:246: error: `class' undeclared (first use in this function)
make: *** [parse.o] Error 1
[ax@pclinuxos xsys-2.0.9]$ make install
gcc -O2 -Wall -fPIC -DVER_MINOR=0 -DVER_MAJOR=2 -DVER_PATCH=9 -DVER_STRING=\"2.0.9\" -DPCIIDS=\"/usr/share/misc/pci.ids\" -Dbuttonbar -c -o parse.o parse.c
parse.c:31:24: pci/header.h: No such file or directory
In file included from parse.c:42:
pci.h:24:21: pci/pci.h: No such file or directory
In file included from parse.c:42:
pci.h:26: error: syntax error before '*' token
parse.c: In function `xs_parse_sound':
parse.c:182: error: `u16' undeclared (first use in this function)
parse.c:182: error: (Each undeclared identifier is reported only once
parse.c:182: error: for each function it appears in.)
parse.c:182: error: syntax error before "class"
parse.c:186: error: `class' undeclared (first use in this function)
parse.c: In function `xs_parse_video':
parse.c:223: error: `u16' undeclared (first use in this function)
parse.c:223: error: syntax error before "class"
parse.c:224: error: `class' undeclared (first use in this function)
parse.c: In function `xs_parse_ether':
parse.c:234: error: `u16' undeclared (first use in this function)
parse.c:234: error: syntax error before "class"
parse.c:235: error: `class' undeclared (first use in this function)
parse.c: In function `xs_parse_agpbridge':
parse.c:245: error: `u16' undeclared (first use in this function)
parse.c:245: error: syntax error before "class"
parse.c:246: error: `class' undeclared (first use in this function)
make: *** [parse.o] Error 1