1.
* >> Compiling 2.6.20-gentoo modules...
2.
* ERROR: Failed to compile the "modules" target...
3.
4.
* -- Grepping log... --
5.
6.
SHIPPED scripts/kconfig/lex.zconf.c
7.
SHIPPED scripts/kconfig/zconf.hash.c
8.
HOSTCC scripts/kconfig/zconf.tab.o
9.
HOSTLD scripts/kconfig/conf
10.
scripts/kconfig/conf -o arch/x86_64/Kconfig
11.
.config:198:warning: trying to assign nonexistent symbol SUSPEND2_CRYPTO
12.
.config:199:warning: trying to assign nonexistent symbol SUSPEND2
13.
.config:204:warning: trying to assign nonexistent symbol SUSPEND2_FILE
14.
.config:205:warning: trying to assign nonexistent symbol SUSPEND2_SWAP
15.
.config:210:warning: trying to assign nonexistent symbol SUSPEND2_DEFAULT_RESUM2
16.
.config:211:warning: trying to assign nonexistent symbol SUSPEND2_KEEP_IMAGE
17.
.config:212:warning: trying to assign nonexistent symbol SUSPEND2_REPLACE_SWSUS
18.
.config:213:warning: trying to assign nonexistent symbol SUSPEND_SHARED
19.
.config:349:warning: trying to assign nonexistent symbol IP_ROUTE_FWMARK
20.
.config:449:warning: trying to assign nonexistent symbol IPV6_ROUTE_FWMARK
21.
.config:522:warning: trying to assign nonexistent symbol IP_NF_MATCH_HASHLIMIT
22.
.config:643:warning: trying to assign nonexistent symbol DECNET_ROUTE_FWMARK
23.
.config:836:warning: trying to assign nonexistent symbol IEEE80211_RADIOTAP
24.
.config:1538:warning: trying to assign nonexistent symbol IPW3945
25.
.config:1539:warning: trying to assign nonexistent symbol IPW3945_DEBUG
26.
.config:1540:warning: trying to assign nonexistent symbol IPW3945_MONITOR
27.
.config:1541:warning: trying to assign nonexistent symbol IPW3945_PROMISCUOUS
28.
.config:2056:warning: trying to assign nonexistent symbol SENSORS_CORETEMP
29.
.config:2091:warning: trying to assign nonexistent symbol SENSORS_APPLESMC
30.
.config:2526:warning: trying to assign nonexistent symbol SND_AC97_BUS
31.
.config:2679:warning: trying to assign nonexistent symbol USB_HIDINPUT
32.
.config:2690:warning: trying to assign nonexistent symbol USB_APPLEIR
33.
.config:3249:warning: trying to assign nonexistent symbol UNWIND_INFO
34.
.config:3306:warning: trying to assign nonexistent symbol CRYPTO_LZF
35.
.config:3322:warning: trying to assign nonexistent symbol DYN_PAGEFLAGS
36.
--
37.
* Bus options (PCI etc.)
38.
*
39.
PCI support (PCI) [Y] y
40.
Support mmconfig PCI config space access (PCI_MMCONFIG) [Y/n] y
41.
PCI Express support (PCIEPORTBUS) [Y/n/?] y
42.
Root Port Advanced Error Reporting support (PCIEAER) [Y/n/?] y
43.
--
44.
SCSI media changer support (CHR_DEV_SCH) [M/n/y/?] m
45.
*
46.
* Some SCSI devices (e.g. CD jukebox) support multiple LUNs
47.
*
48.
Probe all LUNs on each SCSI device (SCSI_MULTI_LUN) [Y/n/?] y
49.
Verbose SCSI error reporting (kernel size +=12K) (SCSI_CONSTANTS) [N/y/?] n
50.
--
51.
IP-over-InfiniBand debugging (INFINIBAND_IPOIB_DEBUG) [Y/?] (NEW) y
52.
IP-over-InfiniBand data path debugging (INFINIBAND_IPOIB_DEBUG_DATA) [N/y?] n
53.
InfiniBand SCSI RDMA Protocol (INFINIBAND_SRP) [M/n/?] m
54.
iSCSI Extensions for RDMA (iSER) (INFINIBAND_ISER) [M/n/?] m
55.
*
56.
* EDAC - error detection and reporting (RAS) (EXPERIMENTAL)
57.
*
58.
EDAC core system error reporting (EXPERIMENTAL) (EDAC) [N/m/y/?] n
59.
--
60.
HOSTCC scripts/kconfig/conf.o
61.
HOSTCC scripts/kconfig/kxgettext.o
62.
HOSTCC scripts/kconfig/zconf.tab.o
63.
HOSTLD scripts/kconfig/conf
64.
scripts/kconfig/conf -s arch/x86_64/Kconfig
65.
*** Warning: make dep is unnecessary now.
66.
--
67.
CC mm/truncate.o
68.
CC kernel/power/process.o
69.
CC mm/vmscan.o
70.
CC kernel/power/console.o
71.
CC kernel/power/pm.o
72.
kernel/power/pm.c:205: warning: ‘pm_register’ is deprecated (declared at kernelpower/pm.c:64)
73.
kernel/power/pm.c:205: warning: ‘pm_register’ is deprecated (declared at kernelpower/pm.c:64)
74.
kernel/power/pm.c:206: warning: ‘pm_send_all’ is deprecated (declared at kernelpower/pm.c:180)
75.
kernel/power/pm.c:206: warning: ‘pm_send_all’ is deprecated (declared at kernelpower/pm.c:180)
76.
--
77.
CC kernel/audit.o
78.
CC mm/mempolicy.o
79.
CC kernel/auditfilter.o
80.
CC mm/sparse.o
81.
kernel/auditfilter.c: In function ‘audit_filter_user’:
82.
kernel/auditfilter.c:1605: warning: ‘state’ may be used uninitialized in this fnction
83.
CC mm/shmem.o
84.
kernel/auditfilter.c: In function ‘audit_receive_filter’:
85.
kernel/auditfilter.c:1170: warning: ‘ndw’ may be used uninitialized in this funtion
86.
kernel/auditfilter.c:1170: warning: ‘ndp’ may be used uninitialized in this funtion
87.
--
88.
CC ipc/msgutil.o
89.
CC ipc/msg.o
90.
CC fs/char_dev.o
91.
CC fs/stat.o
92.
ipc/msg.c: In function ‘sys_msgctl’:
93.
ipc/msg.c:390: warning: ‘setbuf.qbytes’ may be used uninitialized in this functon
94.
ipc/msg.c:390: warning: ‘setbuf.uid’ may be used uninitialized in this function
95.
ipc/msg.c:390: warning: ‘setbuf.gid’ may be used uninitialized in this function
96.
ipc/msg.c:390: warning: ‘setbuf.mode’ may be used uninitialized in this functio
97.
CC ipc/sem.o
98.
CC fs/exec.o
99.
ipc/sem.c: In function ‘sys_semctl’:
100.
ipc/sem.c:862: warning: ‘setbuf.uid’ may be used uninitialized in this function
101.
ipc/sem.c:862: warning: ‘setbuf.gid’ may be used uninitialized in this function
102.
ipc/sem.c:862: warning: ‘setbuf.mode’ may be used uninitialized in this functio
103.
--
104.
LD drivers/acpi/processor.o
105.
LD drivers/acpi/built-in.o
106.
CC drivers/ata/libata-core.o
107.
CC fs/fat/fatent.o
108.
drivers/ata/libata-core.c: In function ‘ata_pci_device_do_resume’:
109.
drivers/ata/libata-core.c:6219: warning: ignoring return value of ‘pci_enable_dvice’, declared with attribute warn_unused_result
110.
--
111.
LD fs/freevxfs/built-in.o
112.
CC fs/fuse/dev.o
113.
CC drivers/ata/libata-sff.o
114.
CC fs/fuse/dir.o
115.
drivers/ata/libata-sff.c: In function ‘ata_pci_init_one’:
116.
drivers/ata/libata-sff.c:1083: warning: ignoring return value of ‘pci_request_rgion’, declared with attribute warn_unused_result
117.
drivers/ata/libata-sff.c:1085: warning: ignoring return value of ‘pci_request_rgion’, declared with attribute warn_unused_result
118.
drivers/ata/libata-sff.c:1087: warning: ignoring return value of ‘pci_request_rgion’, declared with attribute warn_unused_result
119.
--
120.
CC drivers/ata/pata_cs5520.o
121.
CC fs/hfsplus/dir.o
122.
CC drivers/ata/pata_cs5530.o
123.
CC fs/hfsplus/btree.o
124.
drivers/ata/pata_cs5530.c: In function ‘cs5530_init_chip’:
125.
drivers/ata/pata_cs5530.c:275: warning: ignoring return value of ‘pci_set_mwi’,declared with attribute warn_unused_result
126.
--
127.
LD drivers/ata/libata.o
128.
LD drivers/ata/built-in.o
129.
LD drivers/atm/built-in.o
130.
CC drivers/base/core.o
131.
drivers/base/core.c: In function ‘device_add’:
132.
drivers/base/core.c:514: warning: ignoring return value of ‘sysfs_create_link’,declared with attribute warn_unused_result
133.
drivers/base/core.c:519: warning: ignoring return value of ‘sysfs_create_link’,declared with attribute warn_unused_result
134.
drivers/base/core.c:523: warning: ignoring return value of ‘sysfs_create_link’,declared with attribute warn_unused_result
135.
drivers/base/core.c:525: warning: ignoring return value of ‘sysfs_create_link’,declared with attribute warn_unused_result
136.
drivers/base/core.c: In function ‘device_rename’:
137.
drivers/base/core.c:937: warning: ignoring return value of ‘sysfs_create_link’,declared with attribute warn_unused_result
138.
drivers/base/core.c:947: warning: ignoring return value of ‘sysfs_create_link’,declared with attribute warn_unused_result
139.
--
140.
CC fs/isofs/namei.o
141.
CC drivers/base/driver.o
142.
CC drivers/base/class.o
143.
CC fs/isofs/inode.o
144.
drivers/base/class.c: In function ‘class_device_rename’:
145.
drivers/base/class.c:866: warning: ignoring return value of ‘sysfs_create_link’ declared with attribute warn_unused_result
146.
CC drivers/base/platform.o
147.
drivers/base/platform.c: In function ‘platform_bus_init’:
148.
drivers/base/platform.c:614: warning: ignoring return value of ‘device_register, declared with attribute warn_unused_result
149.
--
150.
CC fs/jbd/revoke.o
151.
LD drivers/base/built-in.o
152.
CC drivers/block/floppy.o
153.
CC fs/jbd/journal.o
154.
drivers/block/floppy.c: In function ‘floppy_init’:
155.
drivers/block/floppy.c:4337: warning: ignoring return value of ‘device_create_fle’, declared with attribute warn_unused_result
156.
--
157.
CC drivers/char/random.o
158.
CC fs/jfs/jfs_logmgr.o
159.
CC drivers/char/tty_io.o
160.
CC fs/jfs/jfs_txnmgr.o
161.
fs/jfs/jfs_txnmgr.c: In function ‘txCommit’:
162.
fs/jfs/jfs_txnmgr.c:1922: warning: ‘pxd.addr2’ may be used uninitialized in thi function
163.
fs/jfs/jfs_txnmgr.c:1922: warning: ‘pxd.addr1’ may be used uninitialized in thi function
164.
fs/jfs/jfs_txnmgr.c:1922: warning: ‘pxd.len’ may be used uninitialized in this unction
165.
--
166.
LD drivers/connector/cn.o
167.
LD drivers/connector/built-in.o
168.
CC fs/nfs/read.o
169.
CC drivers/cpufreq/cpufreq.o
170.
drivers/cpufreq/cpufreq.c: In function ‘cpufreq_add_dev’:
171.
drivers/cpufreq/cpufreq.c:755: warning: ignoring return value of ‘sysfs_create_ile’, declared with attribute warn_unused_result
172.
drivers/cpufreq/cpufreq.c:759: warning: ignoring return value of ‘sysfs_create_ile’, declared with attribute warn_unused_result
173.
drivers/cpufreq/cpufreq.c:761: warning: ignoring return value of ‘sysfs_create_ile’, declared with attribute warn_unused_result
174.
--
175.
CC fs/nfs/nfs3proc.o
176.
LD drivers/cpufreq/built-in.o
177.
LD drivers/crypto/built-in.o
178.
CC drivers/dma/dmaengine.o
179.
drivers/dma/dmaengine.c: In function ‘dma_async_device_register’:
180.
drivers/dma/dmaengine.c:338: warning: ignoring return value of ‘class_device_reister’, declared with attribute warn_unused_result
181.
--
182.
CC fs/nfsd/nfs2acl.o
183.
CC drivers/input/ff-memless.o
184.
CC fs/nfsd/nfs3proc.o
185.
CC drivers/input/mousedev.o
186.
drivers/input/mousedev.c: In function ‘mousedev_connect’:
187.
drivers/input/mousedev.c:664: warning: ignoring return value of ‘sysfs_create_lnk’, declared with attribute warn_unused_result
188.
CC fs/nfsd/nfs3xdr.o
189.
CC drivers/input/evdev.o
190.
drivers/input/evdev.c: In function ‘evdev_connect’:
191.
drivers/input/evdev.c:653: warning: ignoring return value of ‘sysfs_create_link, declared with attribute warn_unused_result
192.
CC drivers/input/tsdev.o
193.
drivers/input/tsdev.c: In function ‘tsdev_connect’:
194.
drivers/input/tsdev.c:419: warning: ignoring return value of ‘sysfs_create_link, declared with attribute warn_unused_result
195.
--
196.
CC drivers/md/kcopyd.o
197.
CC fs/ntfs/runlist.o
198.
CC drivers/md/dm-snap.o
199.
CC drivers/md/dm-exception-store.o
200.
drivers/md/dm-exception-store.c: In function ‘persistent_read_metadata’:
201.
drivers/md/dm-exception-store.c:416: warning: ‘new_snapshot’ may be used uninitalized in this function
202.
CC drivers/md/md.o
203.
CC fs/ntfs/super.o
204.
drivers/md/md.c: In function ‘bind_rdev_to_array’:
205.
drivers/md/md.c:1379: warning: ignoring return value of ‘kobject_add’, declaredwith attribute warn_unused_result
206.
drivers/md/md.c:1385: warning: ignoring return value of ‘sysfs_create_link’, delared with attribute warn_unused_result
207.
drivers/md/md.c: In function ‘md_probe’:
208.
drivers/md/md.c:2988: warning: ignoring return value of ‘kobject_register’, decared with attribute warn_unused_result
209.
drivers/md/md.c: In function ‘do_md_run’:
210.
drivers/md/md.c:3137: warning: ignoring return value of ‘sysfs_create_group’, dclared with attribute warn_unused_result
211.
drivers/md/md.c:3152: warning: ignoring return value of ‘sysfs_create_link’, delared with attribute warn_unused_result
212.
drivers/md/md.c: In function ‘md_check_recovery’:
213.
drivers/md/md.c:5483: warning: ignoring return value of ‘sysfs_create_link’, delared with attribute warn_unused_result
214.
--
215.
CC fs/ntfs/bitmap.o
216.
CC fs/ntfs/lcnalloc.o
217.
CC drivers/md/raid5.o
218.
CC fs/ntfs/logfile.o
219.
drivers/md/raid5.c: In function ‘run’:
220.
drivers/md/raid5.c:3522: warning: ignoring return value of ‘sysfs_create_group’ declared with attribute warn_unused_result
221.
drivers/md/raid5.c: In function ‘raid5_start_reshape’:
222.
drivers/md/raid5.c:3829: warning: ignoring return value of ‘sysfs_create_link’,declared with attribute warn_unused_result
223.
--
224.
CC fs/partitions/check.o
225.
CC drivers/md/raid6algos.o
226.
CC drivers/md/raid6recov.o
227.
HOSTCC drivers/md/mktables
228.
fs/partitions/check.c: In function ‘add_partition’:
229.
fs/partitions/check.c:389: warning: ignoring return value of ‘kobject_add’, decared with attribute warn_unused_result
230.
fs/partitions/check.c:392: warning: ignoring return value of ‘sysfs_create_link, declared with attribute warn_unused_result
231.
--
232.
CC drivers/md/dm-zero.o
233.
CC fs/partitions/ultrix.o
234.
CC drivers/md/dm-bbr.o
235.
CC fs/partitions/efi.o
236.
drivers/md/dm-bbr.c: In function ‘bbr_io_remap_error’:
237.
drivers/md/dm-bbr.c:483: warning: format ‘%lu’ expects type ‘long unsigned int’ but argument 3 has type ‘u64’
238.
drivers/md/dm-bbr.c:483: warning: format ‘%lu’ expects type ‘long unsigned int’ but argument 4 has type ‘u64’
239.
drivers/md/dm-bbr.c:492: warning: format ‘%lu’ expects type ‘long unsigned int’ but argument 3 has type ‘u64’
240.
drivers/md/dm-bbr.c: In function ‘bbr_status’:
241.
drivers/md/dm-bbr.c:889: warning: format ‘%lu’ expects type ‘long unsigned int’ but argument 5 has type ‘u64’
242.
drivers/md/dm-bbr.c:889: warning: format ‘%lu’ expects type ‘long unsigned int’ but argument 6 has type ‘u64’
243.
drivers/md/dm-bbr.c:889: warning: format ‘%lu’ expects type ‘long unsigned int’ but argument 7 has type ‘u64’
244.
drivers/md/dm-bbr.c:889: warning: format ‘%lu’ expects type ‘long unsigned int’ but argument 8 has type ‘u64’
245.
drivers/md/dm-bbr.c:889: warning: format ‘%lu’ expects type ‘long unsigned int’ but argument 9 has type ‘u64’
246.
drivers/md/dm-bbr.c:889: warning: format ‘%lu’ expects type ‘long unsigned int’ but argument 10 has type ‘u64’
247.
drivers/md/dm-bbr.c:889: warning: format ‘%lu’ expects type ‘long unsigned int’ but argument 5 has type ‘u64’
248.
drivers/md/dm-bbr.c:889: warning: format ‘%lu’ expects type ‘long unsigned int’ but argument 6 has type ‘u64’
249.
drivers/md/dm-bbr.c:889: warning: format ‘%lu’ expects type ‘long unsigned int’ but argument 7 has type ‘u64’
250.
drivers/md/dm-bbr.c:889: warning: format ‘%lu’ expects type ‘long unsigned int’ but argument 8 has type ‘u64’
251.
drivers/md/dm-bbr.c:889: warning: format ‘%lu’ expects type ‘long unsigned int’ but argument 9 has type ‘u64’
252.
drivers/md/dm-bbr.c:889: warning: format ‘%lu’ expects type ‘long unsigned int’ but argument 10 has type ‘u64’
253.
--
254.
LD drivers/media/built-in.o
255.
CC drivers/message/fusion/mptbase.o
256.
CC fs/reiserfs/namei.o
257.
CC fs/reiserfs/inode.o
258.
drivers/message/fusion/mptbase.c: In function ‘mpt_resume’:
259.
drivers/message/fusion/mptbase.c:1536: warning: ignoring return value of ‘pci_eable_device’, declared with attribute warn_unused_result
260.
--
261.
LD drivers/message/fusion/built-in.o
262.
CC drivers/message/i2o/bus-osm.o
263.
CC drivers/message/i2o/config-osm.o
264.
In file included from drivers/message/i2o/config-osm.c:39:
265.
drivers/message/i2o/i2o_config.c: In function ‘i2o_cfg_passthru’:
266.
drivers/message/i2o/i2o_config.c:879: warning: cast to pointer from integer of ifferent size
267.
drivers/message/i2o/i2o_config.c:934: warning: cast to pointer from integer of ifferent size
268.
--
269.
CC fs/reiserfs/journal.o
270.
CC drivers/message/i2o/iop.o
271.
CC drivers/message/i2o/driver.o
272.
CC drivers/message/i2o/device.o
273.
drivers/message/i2o/device.c: In function ‘i2o_device_add’:
274.
drivers/message/i2o/device.c:247: warning: ignoring return value of ‘sysfs_creae_link’, declared with attribute warn_unused_result
275.
drivers/message/i2o/device.c:254: warning: ignoring return value of ‘sysfs_creae_link’, declared with attribute warn_unused_result
276.
drivers/message/i2o/device.c:260: warning: ignoring return value of ‘sysfs_creae_link’, declared with attribute warn_unused_result
277.
drivers/message/i2o/device.c:267: warning: ignoring return value of ‘sysfs_creae_link’, declared with attribute warn_unused_result
278.
--
279.
CC drivers/parport/parport_pc.o
280.
LD fs/smbfs/built-in.o
281.
CC fs/squashfs/inode.o
282.
CC drivers/parport/parport_serial.o
283.
drivers/parport/parport_serial.c: In function ‘parport_serial_pci_resume’:
284.
drivers/parport/parport_serial.c:402: warning: ignoring return value of ‘pci_enble_device’, declared with attribute warn_unused_result
285.
--
286.
LD fs/sysv/built-in.o
287.
CC fs/udf/balloc.o
288.
CC drivers/pci/pcie/aer/aerdrv.o
289.
CC drivers/pci/pcie/aer/aerdrv_acpi.o
290.
fs/udf/balloc.c: In function ‘udf_table_new_block’:
291.
fs/udf/balloc.c:751: warning: ‘goal_eloc.logicalBlockNum’ may be used uninitialzed in this function
292.
--
293.
CC drivers/pcmcia/cardbus.o
294.
LD drivers/pcmcia/pcmcia_core.o
295.
LD drivers/pcmcia/built-in.o
296.
CC drivers/pnp/core.o
297.
fs/udf/super.c: In function ‘udf_fill_super’:
298.
fs/udf/super.c:1363: warning: ‘ino.partitionReferenceNum’ may be used uninitialzed in this function
299.
--
300.
CC drivers/scsi/scsi_transport_iscsi.o
301.
CC fs/xfs/linux-2.6/xfs_stats.o
302.
CC fs/xfs/linux-2.6/xfs_sysctl.o
303.
CC drivers/scsi/scsi_transport_sas.o
304.
drivers/scsi/scsi_transport_sas.c: In function ‘sas_port_create_link’:
305.
drivers/scsi/scsi_transport_sas.c:582: warning: ignoring return value of ‘sysfscreate_link’, declared with attribute warn_unused_result
306.
drivers/scsi/scsi_transport_sas.c:583: warning: ignoring return value of ‘sysfscreate_link’, declared with attribute warn_unused_result
307.
drivers/scsi/scsi_transport_sas.c: In function ‘sas_port_mark_backlink’:
308.
drivers/scsi/scsi_transport_sas.c:826: warning: ignoring return value of ‘sysfscreate_link’, declared with attribute warn_unused_result
309.
CC fs/xfs/linux-2.6/xfs_ioctl32.o
310.
CC fs/xfs/xfs_alloc.o
311.
CC drivers/scsi/BusLogic.o
312.
drivers/scsi/BusLogic.c: In function ‘BusLogic_InitializeProbeInfoListISA’:
313.
drivers/scsi/BusLogic.c:584: warning: ‘check_region’ is deprecated (declared atinclude/linux/ioport.h:137)
314.
drivers/scsi/BusLogic.c:586: warning: ‘check_region’ is deprecated (declared atinclude/linux/ioport.h:137)
315.
drivers/scsi/BusLogic.c:588: warning: ‘check_region’ is deprecated (declared atinclude/linux/ioport.h:137)
316.
drivers/scsi/BusLogic.c:590: warning: ‘check_region’ is deprecated (declared atinclude/linux/ioport.h:137)
317.
drivers/scsi/BusLogic.c:592: warning: ‘check_region’ is deprecated (declared atinclude/linux/ioport.h:137)
318.
drivers/scsi/BusLogic.c:594: warning: ‘check_region’ is deprecated (declared atinclude/linux/ioport.h:137)
319.
drivers/scsi/BusLogic.c: In function ‘BusLogic_InitializeMultiMasterProbeInfo’:
320.
drivers/scsi/BusLogic.c:800: warning: ‘check_region’ is deprecated (declared atinclude/linux/ioport.h:137)
321.
drivers/scsi/BusLogic.c:810: warning: ‘check_region’ is deprecated (declared atinclude/linux/ioport.h:137)
322.
drivers/scsi/BusLogic.c:812: warning: ‘check_region’ is deprecated (declared atinclude/linux/ioport.h:137)
323.
drivers/scsi/BusLogic.c:814: warning: ‘check_region’ is deprecated (declared atinclude/linux/ioport.h:137)
324.
drivers/scsi/BusLogic.c:816: warning: ‘check_region’ is deprecated (declared atinclude/linux/ioport.h:137)
325.
drivers/scsi/BusLogic.c:818: warning: ‘check_region’ is deprecated (declared atinclude/linux/ioport.h:137)
326.
drivers/scsi/BusLogic.c: At top level:
327.
drivers/scsi/BusLogic.c:3603: warning: ‘BusLogic_pci_tbl’ defined but not used
328.
--
329.
LD sound/isa/ad1816a/built-in.o
330.
LD sound/isa/ad1848/built-in.o
331.
LD sound/isa/cs423x/built-in.o
332.
LD sound/isa/es1688/built-in.o
333.
drivers/scsi/ips.c: In function ‘ips_register_scsi’:
334.
drivers/scsi/ips.c:7029: warning: ignoring return value of ‘scsi_add_host’, decared with attribute warn_unused_result
335.
--
336.
LD sound/pci/au88x0/built-in.o
337.
LD sound/pci/ca0106/built-in.o
338.
LD sound/pci/cs46xx/built-in.o
339.
LD sound/pci/cs5535audio/built-in.o
340.
drivers/scsi/ips.c: In function ‘ips_insert_device’:
341.
drivers/scsi/ips.c:7110: warning: ‘index’ may be used uninitialized in this funtion
342.
--
343.
LD sound/usb/built-in.o
344.
CC sound/last.o
345.
LD sound/soundcore.o
346.
LD sound/built-in.o
347.
CC arch/x86_64/pci/../../i386/pci/acpi.o
348.
drivers/scsi/NCR5380.c:633: warning: ‘NCR5380_print_options’ defined but not usd
349.
drivers/scsi/NCR5380.c:708: warning: ‘NCR5380_proc_info’ defined but not used
350.
drivers/scsi/NCR5380.c:360: warning: ‘phases’ defined but not used
351.
drivers/scsi/NCR5380.c:579: warning: ‘NCR5380_probe_irq’ defined but not used
352.
--
353.
CC arch/x86_64/pci/../../i386/pci/legacy.o
354.
CC arch/x86_64/pci/mmconfig.o
355.
CC drivers/scsi/megaraid.o
356.
CC arch/x86_64/pci/k8-bus.o
357.
drivers/scsi/megaraid.c: In function ‘megadev_ioctl’:
358.
drivers/scsi/megaraid.c:3570: warning: cast to pointer from integer of differen size
359.
drivers/scsi/megaraid.c:3622: warning: cast to pointer from integer of differen size
360.
drivers/scsi/megaraid.c:3648: warning: cast to pointer from integer of differen size
361.
drivers/scsi/megaraid.c:3701: warning: cast to pointer from integer of differen size
362.
drivers/scsi/megaraid.c:3741: warning: cast to pointer from integer of differen size
363.
--
364.
CC net/core/filter.o
365.
CC drivers/serial/8250_pnp.o
366.
CC drivers/serial/8250_pci.o
367.
CC net/core/flow.o
368.
drivers/serial/8250_pci.c: In function ‘pciserial_resume_one’:
369.
drivers/serial/8250_pci.c:1816: warning: ignoring return value of ‘pci_enable_dvice’, declared with attribute warn_unused_result
370.
--
371.
CC [M] arch/x86_64/crypto/twofish.o
372.
LD [M] arch/x86_64/crypto/aes-x86_64.o
373.
LD [M] arch/x86_64/crypto/twofish-x86_64.o
374.
CC [M] arch/x86_64/kernel/../../i386/kernel/microcode.o
375.
arch/x86_64/kernel/../../i386/kernel/microcode.c: In function ‘microcode_write’
376.
arch/x86_64/kernel/../../i386/kernel/microcode.c:387: warning: ‘new_mc’ may be sed uninitialized in this function
377.
--
378.
CC [M] drivers/atm/zatm.o
379.
CC [M] fs/befs/linuxvfs.o
380.
LD [M] fs/befs/befs.o
381.
CC [M] fs/bfs/inode.o
382.
drivers/atm/zatm.c: In function ‘zatm_open’:
383.
drivers/atm/zatm.c:919: warning: ‘pcr’ may be used uninitialized in this functin
384.
--
385.
CC [M] drivers/atm/ambassador.o
386.
CC [M] fs/bfs/dir.o
387.
LD [M] fs/bfs/bfs.o
388.
CC [M] fs/configfs/inode.o
389.
drivers/atm/ambassador.c: In function ‘amb_open’:
390.
drivers/atm/ambassador.c:1043: warning: ‘tx_rate_bits’ may be used uninitialize in this function
391.
--
392.
CC [M] fs/dlm/lockspace.o
393.
CC [M] drivers/atm/firestream.o
394.
CC [M] fs/dlm/main.o
395.
CC [M] fs/dlm/member.o
396.
drivers/atm/firestream.c: In function ‘top_off_fp’:
397.
drivers/atm/firestream.c:1505: warning: cast to pointer from integer of differet size
398.
--
399.
LD [M] fs/dlm/dlm.o
400.
CC [M] fs/efs/super.o
401.
CC [M] drivers/block/nbd.o
402.
CC [M] fs/efs/inode.o
403.
drivers/block/nbd.c: In function ‘nbd_do_it’:
404.
drivers/block/nbd.c:376: warning: ignoring return value of ‘sysfs_create_file’,declared with attribute warn_unused_result
405.
--
406.
CC [M] fs/jffs2/read.o
407.
CC [M] drivers/block/paride/friq.o
408.
CC [M] fs/jffs2/nodemgmt.o
409.
CC [M] fs/jffs2/readinode.o
410.
fs/jffs2/readinode.c: In function ‘jffs2_do_read_inode_internal’:
411.
fs/jffs2/readinode.c:667: warning: ‘latest_mctime’ may be used uninitialized inthis function
412.
fs/jffs2/readinode.c:664: warning: ‘fd_list’ may be used uninitialized in this unction
413.
--
414.
CC [M] fs/nls/nls_cp863.o
415.
CC [M] drivers/char/epca.o
416.
CC [M] fs/nls/nls_cp864.o
417.
CC [M] fs/nls/nls_cp865.o
418.
CC [M] fs/nls/nls_cp866.o
419.
drivers/char/epca.c:2744: warning: ‘get_termio’ defined but not used
420.
--
421.
CC [M] fs/ocfs2/ver.o
422.
CC [M] drivers/char/drm/i915_irq.o
423.
CC [M] fs/ocfs2/vote.o
424.
CC [M] drivers/char/drm/i915_mem.o
425.
fs/ocfs2/vote.c: In function ‘ocfs2_do_request_vote’:
426.
fs/ocfs2/vote.c:667: warning: ‘response’ may be used uninitialized in this funcion
427.
--
428.
CC [M] fs/ocfs2/cluster/ver.o
429.
LD [M] fs/ocfs2/cluster/ocfs2_nodemanager.o
430.
CC [M] fs/ocfs2/dlm/dlmdomain.o
431.
CC [M] drivers/char/drm/r128_irq.o
432.
fs/ocfs2/dlm/dlmdomain.c: In function ‘dlm_try_to_join_domain’:
433.
fs/ocfs2/dlm/dlmdomain.c:919: warning: ‘response’ may be used uninitialized in his function
434.
--
435.
CC [M] sound/drivers/opl3/opl3_drums.o
436.
CC [M] sound/drivers/opl3/opl3_oss.o
437.
LD [M] sound/drivers/opl3/snd-opl3-lib.o
438.
LD [M] sound/drivers/opl3/snd-opl3-synth.o
439.
drivers/char/speakup/speakup.c: In function ‘say_line’:
440.
drivers/char/speakup/speakup.c:900: warning: format ‘%d’ expects type ‘int’, bu argument 3 has type ‘long int’
441.
drivers/char/speakup/speakup.c:900: warning: format ‘%d’ expects type ‘int’, bu argument 3 has type ‘long int’
442.
drivers/char/speakup/speakup.c: At top level:
443.
drivers/char/speakup/speakup.c:2031: error: expected identifier or ‘(’ before ‘’ token
444.
make[3]: *** [drivers/char/speakup/speakup.o] Error 1
445.
make[2]: *** [drivers/char/speakup] Error 2
446.
make[1]: *** [drivers/char] Error 2
447.
make: *** [drivers] Error 2
448.
--
449.
CC [M] sound/pci/ice1712/vt1720_mobo.o
450.
CC [M] sound/pci/pcxhr/pcxhr.o
451.
CC [M] sound/pci/ice1712/pontis.o
452.
CC [M] sound/pci/ice1712/prodigy192.o
453.
sound/pci/pcxhr/pcxhr.c: In function ‘pcxhr_trigger’:
454.
sound/pci/pcxhr/pcxhr.c:640: warning: ‘stream’ may be used uninitialized in thi function
455.
--
456.
LD [M] sound/pci/snd-via82xx-modem.o
457.
LD [M] sound/pci/ymfpci/snd-ymfpci.o
458.
* Gentoo Linux Genkernel; Version 3.4.5
459.
* Running with options: all
460.
461.
* ERROR: Failed to compile the "modules" target...
462.
463.
* -- End log... --