rendered paste body| ccache i486-linux-uclibc-gcc -DLOCALEDIR=\"/usr/share/locale\" -DLOCALE_ALIAS_PATH=\"/usr/share/locale\" -DUSEJEXE=0 -DGETTEXTJEXEDIR=\"/usr/lib/gettext\" -DGETTEXTJAR=\"/usr/share/gettext/gettext.jar\" -DLIBDIR=\"/usr/lib\" -DGETTEXTDATADIR=\"/usr/share/gettext\" -DPROJECTSDIR=\"/usr/share/gettext/projects\" -DHAVE_CONFIG_H -I. -I/home/mati/openembedded/build/tmp/work/i486-linux-uclibc/gettext-0.14.1-r4/gettext-0.14.1/gettext-tools/src -I.. -I. -I/home/mati/openembedded/build/tmp/work/i486-linux-uclibc/gettext-0.14.1-r4/gettext-0.14.1/gettext-tools/src -I.. -I/home/mati/openembedded/build/tmp/work/i486-linux-uclibc/gettext-0.14.1-r4/gettext-0.14.1/gettext-tools/libuniname -I../lib -I/home/mati/openembedded/build/tmp/work/i486-linux-uclibc/gettext-0.14.1-r4/gettext-0.14.1/gettext-tools/lib -I../intl -I/home/mati/openembedded/build/tmp/work/i486-linux-uclibc/gettext-0.14.1-r4/gettext-0.14.1/gettext-tools/../gettext-runtime/intl -isystem/home/mati/openembedded/build/tmp/staging/i486-linux-uclibc/include -DINSTALLDIR=\"/usr/bin\" -isystem/home/mati/openembedded/build/tmp/staging/i486-linux-uclibc/include -fexpensive-optimizations -fomit-frame-pointer -frename-registers -O2 -c -o msgfmt-plural-eval.o `test -f 'plural-eval.c' || echo '/home/mati/openembedded/build/tmp/work/i486-linux-uclibc/gettext-0.14.1-r4/gettext-0.14.1/gettext-tools/src/'`plural-eval.c
| In file included from plural-eval.c:34:
| /home/mati/openembedded/build/tmp/work/i486-linux-uclibc/gettext-0.14.1-r4/gettext-0.14.1/gettext-tools/../gettext-runtime/intl/eval-plural.h:28: error: conflicting types for 'plural_eval'
| /home/mati/openembedded/build/tmp/work/i486-linux-uclibc/gettext-0.14.1-r4/gettext-0.14.1/gettext-tools/../gettext-runtime/intl/plural-exp.h:115: error: previous declaration of 'plural_eval' was here
| make[4]: *** [msgfmt-plural-eval.o] Error 1
| make[4]: Leaving directory `/home/mati/openembedded/build/tmp/work/i486-linux-uclibc/gettext-0.14.1-r4/gettext-0.14.1/gettext-tools/src'
| make[3]: *** [all] Error 2
| make[3]: Leaving directory `/home/mati/openembedded/build/tmp/work/i486-linux-uclibc/gettext-0.14.1-r4/gettext-0.14.1/gettext-tools/src'
| make[2]: *** [all-recursive] Error 1
| make[2]: Leaving directory `/home/mati/openembedded/build/tmp/work/i486-linux-uclibc/gettext-0.14.1-r4/gettext-0.14.1/gettext-tools'
| make[1]: *** [all] Error 2
| make[1]: Leaving directory `/home/mati/openembedded/build/tmp/work/i486-linux-uclibc/gettext-0.14.1-r4/gettext-0.14.1/gettext-tools'
| make: *** [all-recursive] Error 1
| FATAL: oe_runmake failed
NOTE: Task failed: /home/mati/openembedded/build/tmp/work/i486-linux-uclibc/gettext-0.14.1-r4/temp/log.do_compile.17483
NOTE: package gettext-0.14.1-r4: task do_compile: failed
ERROR: TaskFailed event exception, aborting
NOTE: package gettext-0.14.1: failed
ERROR: Build of bootstrap-image failed