All pastes #371505 Raw Edit

Untitled

public text v1 · immutable
#371505 ·published 2007-02-25 12:05 UTC
rendered paste body
NOTE: package libx11-X11R7.1-1.0.1: started
NOTE: package libx11-X11R7.1-1.0.1-r1: task do_fetch: started
NOTE: fetch http://xorg.freedesktop.org/releases/X11R7.1/src/lib/libX11-X11R7.1-1.0.1.tar.bz2
--12:32:06--  http://xorg.freedesktop.org/releases/X11R7.1/src/lib/libX11-X11R7.1-1.0.1.tar.bz2
           => `/home/luitvd/mokomakefile/sources/libX11-X11R7.1-1.0.1.tar.bz2'
Resolving xorg.freedesktop.org... 131.252.208.36
Connecting to xorg.freedesktop.org|131.252.208.36|:80... connected.
HTTP request sent, awaiting response... 200 OK
Length: 1,420,904 (1.4M) [application/x-tar]

100%[======================================================================================================================================================================>] 1,420,904    361.63K/s    ETA 00:00

12:32:11 (345.31 KB/s) - `/home/luitvd/mokomakefile/sources/libX11-X11R7.1-1.0.1.tar.bz2' saved [1420904/1420904]

NOTE: package libx11-X11R7.1-1.0.1-r1: task do_fetch: completed
NOTE: package libx11-X11R7.1-1.0.1-r1: task do_unpack: started
NOTE: Unpacking /home/luitvd/mokomakefile/sources/libX11-X11R7.1-1.0.1.tar.bz2 to /home/luitvd/mokomakefile/build/tmp/work/armv5te-linux/libx11-X11R7.1-1.0.1-r1/
NOTE: package libx11-X11R7.1-1.0.1-r1: task do_unpack: completed
NOTE: package libx11-X11R7.1-1.0.1-r1: task do_patch: started
NOTE: package libx11-X11R7.1-1.0.1-r1: task do_patch: completed
NOTE: package libx11-X11R7.1-1.0.1-r1: task do_configure: started
NOTE: SITE files /home/luitvd/mokomakefile/openembedded/site/endian-little /home/luitvd/mokomakefile/openembedded/site/arm-linux 
NOTE: package libx11-X11R7.1-1.0.1-r1: task do_configure: completed
NOTE: package libx11-X11R7.1-1.0.1-r1: task do_compile: started
NOTE: SITE files /home/luitvd/mokomakefile/openembedded/site/endian-little /home/luitvd/mokomakefile/openembedded/site/arm-linux 
ERROR: function do_compile failed
ERROR: log data follows (/home/luitvd/mokomakefile/build/tmp/work/armv5te-linux/libx11-X11R7.1-1.0.1-r1/temp/log.do_compile.729)
| makekeys.c:34:19: error: X11/X.h: No such file or directory
| makekeys.c:35:21: error: X11/Xos.h: No such file or directory
| makekeys.c:36:27: error: X11/keysymdef.h: No such file or directory
| makekeys.c:49: error: expected specifier-qualifier-list before ‘KeySym’
| makekeys.c:58: error: expected ‘=’, ‘,’, ‘;’, ‘asm’ or ‘__attribute__’ before ‘values’
| makekeys.c: In function ‘main’:
| makekeys.c:74: error: ‘KeySym’ undeclared (first use in this function)
| makekeys.c:74: error: (Each undeclared identifier is reported only once
| makekeys.c:74: error: for each function it appears in.)
| makekeys.c:74: error: expected ‘;’ before ‘val’
| makekeys.c:80: error: ‘struct info’ has no member named ‘val’
| makekeys.c:87: error: ‘struct info’ has no member named ‘val’
| makekeys.c:87: error: ‘struct info’ has no member named ‘val’
| makekeys.c:98: error: ‘struct info’ has no member named ‘val’
| makekeys.c:98: error: ‘XK_VoidSymbol’ undeclared (first use in this function)
| makekeys.c:99: error: ‘struct info’ has no member named ‘val’
| makekeys.c:100: error: ‘struct info’ has no member named ‘val’
| makekeys.c:106: warning: incompatible implicit declaration of built-in function ‘strlen’
| makekeys.c:111: warning: incompatible implicit declaration of built-in function ‘strcpy’
| makekeys.c:177: error: ‘val’ undeclared (first use in this function)
| makekeys.c:177: error: ‘struct info’ has no member named ‘val’
| makekeys.c:210: error: ‘struct info’ has no member named ‘val’
| makekeys.c:213: error: ‘values’ undeclared (first use in this function)
| makekeys.c:243: error: ‘struct info’ has no member named ‘val’
NOTE: Task failed: /home/luitvd/mokomakefile/build/tmp/work/armv5te-linux/libx11-X11R7.1-1.0.1-r1/temp/log.do_compile.729
NOTE: package libx11-X11R7.1-1.0.1-r1: task do_compile: failed
ERROR: TaskFailed event exception, aborting
NOTE: package libx11-X11R7.1-1.0.1: failed
ERROR: Build of openmoko-devel-image failed
make: *** [openmoko-devel-image] Error 1