All pastes #371079 Raw Edit

Stuff

public text v1 · immutable
#371079 ·published 2007-02-25 02:23 UTC
rendered paste body
us-1.0/include -I/usr/include/glib-2.0 -I/usr/lib/glib-2.0/include   -O2 -march=pentium-m -pipe -fomit-frame-pointer -lexo-0.3 -lgtk-x11-2.0 -lxfce4util -lgdk-x11-2.0 -latk-1.0 -lgdk_pixbuf-2.0 -lm -lpangocairo-1.0 -lpango-1.0 -lcairo -lgobject-2.0 -lgmodule-2.0 -ldl -lglib-2.0   -lxfce4panel -lxfcegui4 -lgtk-x11-2.0 -lxfce4util -lgdk-x11-2.0 -latk-1.0 -lgdk_pixbuf-2.0 -lm -lpangocairo-1.0 -lpango-1.0 -lcairo -lgobject-2.0 -lgmodule-2.0 -ldl -lglib-2.0 -lxfce4util -lglib-2.0   -lpcre -lglib-2.0   -pthread -lgthread-2.0 -lglib-2.0 -ldbus-glib-1 -ldbus-1 -lglib-2.0   -Wl,-O1 -o xfce4-verve-plugin xfce4_verve_plugin-verve-plugin.o xfce4_verve_plugin-verve.o xfce4_verve_plugin-verve-history.o xfce4_verve_plugin-verve-env.o xfce4_verve_plugin-verve-dbus-service.o  
mkdir .libs
libtool: link: cannot find the library `/home/rfauth/local/lib/libxfce4util.la' or unhandled argument `/home/rfauth/local/lib/libxfce4util.la'
make[3]: *** [xfce4-verve-plugin] Error 1
rm verve.desktop.in
make[3]: Leaving directory `/var/tmp/portage/verve-0.3.5/work/verve-plugin-0.3.5/panel-plugin'
make[2]: *** [all] Error 2
make[2]: Leaving directory `/var/tmp/portage/verve-0.3.5/work/verve-plugin-0.3.5/panel-plugin'
make[1]: *** [all-recursive] Error 1
make[1]: Leaving directory `/var/tmp/portage/verve-0.3.5/work/verve-plugin-0.3.5'
make: *** [all] Error 2

!!! ERROR: xfce-extra/verve-0.3.5 failed.
Call stack:
  ebuild.sh, line 1546:   Called dyn_compile
  ebuild.sh, line 937:   Called src_compile
  ebuild.sh, line 1255:   Called xfce44_src_compile
  xfce44.eclass, line 130:   Called die

!!! (no error message)
!!! If you need support, post the topmost build error, and the call stack if relevant.