All pastes #370675 Raw Edit

Unnamed

public text v1 · immutable
#370675 ·published 2007-02-24 19:56 UTC
rendered paste body
Source/nsIScriptableMplayerPlugin.h:10:25: error: nsISupports.h: No such file or directory
In file included from Source/plugin.h:54,
                 from Source/plugin.cpp:37:
Source/nsScriptablePeer.h:49:26: error: nsIClassInfo.h: No such file or directory
Source/plugin.cpp:38:31: error: nsIServiceManager.h: No such file or directory
Source/plugin.cpp:39:23: error: nsIMemory.h: No such file or directory
Source/plugin.cpp:40:74: error: nsISupportsUtils.h: No such file or directory
include/pluginbase.h:55: warning: 'class nsPluginInstanceBase' has virtual functions but non-virtual destructor
Source/nsIScriptableMplayerPlugin.h:25: error: expected class-name before '{' token
Source/nsIScriptableMplayerPlugin.h:28: error: expected identifier before '{' token
Source/nsIScriptableMplayerPlugin.h:28: error: expected `)' before '{' token
Source/nsIScriptableMplayerPlugin.h:28: error: ISO C++ forbids declaration of 'NS_DEFINE_STATIC_IID_ACCESSOR' with no type
Source/nsIScriptableMplayerPlugin.h:28: error: expected unqualified-id before ')' token
Source/nsIScriptableMplayerPlugin.h:34: error: 'NS_IMETHOD' does not name a type
Source/nsIScriptableMplayerPlugin.h:37: error: 'NS_IMETHOD' does not name a type
Source/nsIScriptableMplayerPlugin.h: In member function 'int nsIScriptableWMPPlugin::NS_DEFINE_STATIC_IID_ACCESSOR(int)':
Source/nsIScriptableMplayerPlugin.h:28: warning: left-hand operand of comma has no effect
Source/nsIScriptableMplayerPlugin.h:28: warning: right-hand operand of comma has no effect
Source/nsIScriptableMplayerPlugin.h:28: error: expected primary-expression before '{' token
Source/nsIScriptableMplayerPlugin.h:28: error: expected `;' before '{' token
Source/nsIScriptableMplayerPlugin.h:28: warning: no return statement in function returning non-void
Source/nsIScriptableMplayerPlugin.h: At global scope:
Source/nsIScriptableMplayerPlugin.h:120: error: expected class-name before '{' token
Source/nsIScriptableMplayerPlugin.h:123: error: expected identifier before '{' token
Source/nsIScriptableMplayerPlugin.h:123: error: expected `)' before '{' token
Source/nsIScriptableMplayerPlugin.h:123: error: ISO C++ forbids declaration of 'NS_DEFINE_STATIC_IID_ACCESSOR' with no type
Source/nsIScriptableMplayerPlugin.h:123: error: expected unqualified-id before ')' token
Source/nsIScriptableMplayerPlugin.h:129: error: 'NS_IMETHOD' does not name a type
Source/nsIScriptableMplayerPlugin.h:132: error: 'NS_IMETHOD' does not name a type
Source/nsIScriptableMplayerPlugin.h:135: error: 'NS_IMETHOD' does not name a type
Source/nsIScriptableMplayerPlugin.h:138: error: 'NS_IMETHOD' does not name a type
Source/nsIScriptableMplayerPlugin.h:141: error: 'NS_IMETHOD' does not name a type
Source/nsIScriptableMplayerPlugin.h:144: error: 'NS_IMETHOD' does not name a type
Source/nsIScriptableMplayerPlugin.h:147: error: 'NS_IMETHOD' does not name a type
Source/nsIScriptableMplayerPlugin.h:150: error: 'NS_IMETHOD' does not name a type
Source/nsIScriptableMplayerPlugin.h:153: error: 'NS_IMETHOD' does not name a type
Source/nsIScriptableMplayerPlugin.h:156: error: 'NS_IMETHOD' does not name a type
Source/nsIScriptableMplayerPlugin.h:159: error: 'NS_IMETHOD' does not name a type
Source/nsIScriptableMplayerPlugin.h:162: error: 'NS_IMETHOD' does not name a type
Source/nsIScriptableMplayerPlugin.h:165: error: 'NS_IMETHOD' does not name a type
Source/nsIScriptableMplayerPlugin.h:168: error: 'NS_IMETHOD' does not name a type
Source/nsIScriptableMplayerPlugin.h:171: error: 'NS_IMETHOD' does not name a type
Source/nsIScriptableMplayerPlugin.h:174: error: 'NS_IMETHOD' does not name a type
Source/nsIScriptableMplayerPlugin.h:177: error: 'NS_IMETHOD' does not name a type
Source/nsIScriptableMplayerPlugin.h:180: error: 'NS_IMETHOD' does not name a type
Source/nsIScriptableMplayerPlugin.h:183: error: 'NS_IMETHOD' does not name a type
Source/nsIScriptableMplayerPlugin.h:186: error: 'NS_IMETHOD' does not name a type
Source/nsIScriptableMplayerPlugin.h:189: error: 'NS_IMETHOD' does not name a type
Source/nsIScriptableMplayerPlugin.h:192: error: 'NS_IMETHOD' does not name a type
Source/nsIScriptableMplayerPlugin.h:195: error: 'NS_IMETHOD' does not name a type
Source/nsIScriptableMplayerPlugin.h:198: error: 'NS_IMETHOD' does not name a type
Source/nsIScriptableMplayerPlugin.h:201: error: 'NS_IMETHOD' does not name a type
Source/nsIScriptableMplayerPlugin.h:204: error: 'NS_IMETHOD' does not name a type
Source/nsIScriptableMplayerPlugin.h:207: error: 'NS_IMETHOD' does not name a type
Source/nsIScriptableMplayerPlugin.h:210: error: 'NS_IMETHOD' does not name a type
Source/nsIScriptableMplayerPlugin.h:213: error: 'NS_IMETHOD' does not name a type
Source/nsIScriptableMplayerPlugin.h:216: error: 'NS_IMETHOD' does not name a type
Source/nsIScriptableMplayerPlugin.h:219: error: 'NS_IMETHOD' does not name a type
Source/nsIScriptableMplayerPlugin.h:222: error: 'NS_IMETHOD' does not name a type
Source/nsIScriptableMplayerPlugin.h:223: error: 'NS_IMETHOD' does not name a type
Source/nsIScriptableMplayerPlugin.h:226: error: 'NS_IMETHOD' does not name a type
Source/nsIScriptableMplayerPlugin.h:227: error: 'NS_IMETHOD' does not name a type
Source/nsIScriptableMplayerPlugin.h:230: error: 'NS_IMETHOD' does not name a type
Source/nsIScriptableMplayerPlugin.h:231: error: 'NS_IMETHOD' does not name a type
Source/nsIScriptableMplayerPlugin.h:234: error: 'NS_IMETHOD' does not name a type
Source/nsIScriptableMplayerPlugin.h:235: error: 'NS_IMETHOD' does not name a type
Source/nsIScriptableMplayerPlugin.h:238: error: 'NS_IMETHOD' does not name a type
Source/nsIScriptableMplayerPlugin.h:241: error: 'NS_IMETHOD' does not name a type
Source/nsIScriptableMplayerPlugin.h: In member function 'int nsIScriptableMplayerPlugin::NS_DEFINE_STATIC_IID_ACCESSOR(int)':
Source/nsIScriptableMplayerPlugin.h:123: warning: left-hand operand of comma has no effect
Source/nsIScriptableMplayerPlugin.h:123: warning: right-hand operand of comma has no effect
Source/nsIScriptableMplayerPlugin.h:123: error: expected primary-expression before '{' token
Source/nsIScriptableMplayerPlugin.h:123: error: expected `;' before '{' token
Source/nsIScriptableMplayerPlugin.h:123: warning: no return statement in function returning non-void
Source/nsScriptablePeer.h: At global scope:
Source/nsScriptablePeer.h:56: error: expected class-name before '{' token
Source/nsScriptablePeer.h:59: error: 'NS_IMETHOD' does not name a type
Source/nsScriptablePeer.h:62: error: 'NS_IMETHOD' does not name a type
Source/nsScriptablePeer.h:68: error: 'NS_IMETHOD' does not name a type
Source/nsScriptablePeer.h:71: error: 'NS_IMETHOD' does not name a type
Source/nsScriptablePeer.h:75: error: 'NS_IMETHOD' does not name a type
Source/nsScriptablePeer.h:78: error: 'NS_IMETHOD' does not name a type
Source/nsScriptablePeer.h:81: error: 'NS_IMETHOD' does not name a type
Source/nsScriptablePeer.h:84: error: 'NS_IMETHOD' does not name a type
Source/nsScriptablePeer.h:97: error: 'NS_IMETHOD' does not name a type
Source/nsScriptablePeer.h:98: error: 'nsrefcnt' has not been declared
Source/nsScriptablePeer.h:98: error: ISO C++ forbids declaration of 'NS_IMETHOD_' with no type
Source/nsScriptablePeer.h:98: error: expected ';' before 'AddRef'
Source/nsScriptablePeer.h:99: error: 'nsrefcnt' has not been declared
Source/nsScriptablePeer.h:99: error: ISO C++ forbids declaration of 'NS_IMETHOD_' with no type
Source/nsScriptablePeer.h:99: error: expected ';' before 'Release'
Source/nsScriptablePeer.h:102: error: 'nsrefcnt' does not name a type
Source/nsScriptablePeer.h:106: error: 'NS_IMETHOD' does not name a type
Source/nsScriptablePeer.h:106: error: 'NS_IMETHOD' does not name a type
Source/nsScriptablePeer.h:106: error: 'NS_IMETHOD' does not name a type
Source/nsScriptablePeer.h:120: error: 'NS_IMETHOD' does not name a type
Source/nsScriptablePeer.h:121: error: 'nsrefcnt' has not been declared
Source/nsScriptablePeer.h:121: error: ISO C++ forbids declaration of 'NS_IMETHOD_' with no type
Source/nsScriptablePeer.h:121: error: expected ';' before 'AddRef'
Source/nsScriptablePeer.h:122: error: 'nsrefcnt' has not been declared
Source/nsScriptablePeer.h:122: error: ISO C++ forbids declaration of 'NS_IMETHOD_' with no type
Source/nsScriptablePeer.h:122: error: expected ';' before 'Release'
Source/nsScriptablePeer.h:125: error: 'nsrefcnt' does not name a type
Source/nsScriptablePeer.h:129: error: 'NS_IMETHOD' does not name a type
Source/nsScriptablePeer.h:129: error: 'NS_IMETHOD' does not name a type
Source/nsScriptablePeer.h:129: error: 'NS_IMETHOD' does not name a type
Source/nsScriptablePeer.h:129: error: 'NS_IMETHOD' does not name a type
Source/nsScriptablePeer.h:129: error: 'NS_IMETHOD' does not name a type
Source/nsScriptablePeer.h:129: error: 'NS_IMETHOD' does not name a type
Source/nsScriptablePeer.h:129: error: 'NS_IMETHOD' does not name a type
Source/nsScriptablePeer.h:129: error: 'NS_IMETHOD' does not name a type
Source/nsScriptablePeer.h:129: error: 'NS_IMETHOD' does not name a type
Source/nsScriptablePeer.h:129: error: 'NS_IMETHOD' does not name a type
Source/nsScriptablePeer.h:129: error: 'NS_IMETHOD' does not name a type
Source/nsScriptablePeer.h:129: error: 'NS_IMETHOD' does not name a type
Source/nsScriptablePeer.h:129: error: 'NS_IMETHOD' does not name a type
Source/nsScriptablePeer.h:129: error: 'NS_IMETHOD' does not name a type
Source/nsScriptablePeer.h:129: error: 'NS_IMETHOD' does not name a type
Source/nsScriptablePeer.h:129: error: 'NS_IMETHOD' does not name a type
Source/nsScriptablePeer.h:129: error: 'NS_IMETHOD' does not name a type
Source/nsScriptablePeer.h:129: error: 'NS_IMETHOD' does not name a type
Source/nsScriptablePeer.h:129: error: 'NS_IMETHOD' does not name a type
Source/nsScriptablePeer.h:129: error: 'NS_IMETHOD' does not name a type
Source/nsScriptablePeer.h:129: error: 'NS_IMETHOD' does not name a type
Source/nsScriptablePeer.h:129: error: 'NS_IMETHOD' does not name a type
Source/nsScriptablePeer.h:129: error: 'NS_IMETHOD' does not name a type
Source/nsScriptablePeer.h:129: error: 'NS_IMETHOD' does not name a type
Source/nsScriptablePeer.h:129: error: 'NS_IMETHOD' does not name a type
Source/nsScriptablePeer.h:129: error: 'NS_IMETHOD' does not name a type
Source/nsScriptablePeer.h:129: error: 'NS_IMETHOD' does not name a type
Source/nsScriptablePeer.h:129: error: 'NS_IMETHOD' does not name a type
Source/nsScriptablePeer.h:129: error: 'NS_IMETHOD' does not name a type
Source/nsScriptablePeer.h:129: error: 'NS_IMETHOD' does not name a type
Source/nsScriptablePeer.h:129: error: 'NS_IMETHOD' does not name a type
Source/nsScriptablePeer.h:129: error: 'NS_IMETHOD' does not name a type
Source/nsScriptablePeer.h:129: error: 'NS_IMETHOD' does not name a type
Source/nsScriptablePeer.h:129: error: 'NS_IMETHOD' does not name a type
Source/nsScriptablePeer.h:129: error: 'NS_IMETHOD' does not name a type
Source/nsScriptablePeer.h:129: error: 'NS_IMETHOD' does not name a type
Source/nsScriptablePeer.h:129: error: 'NS_IMETHOD' does not name a type
Source/nsScriptablePeer.h:129: error: 'NS_IMETHOD' does not name a type
Source/nsScriptablePeer.h:129: error: 'NS_IMETHOD' does not name a type
Source/nsScriptablePeer.h:129: error: 'NS_IMETHOD' does not name a type
Source/nsScriptablePeer.h:129: error: 'NS_IMETHOD' does not name a type
Source/nsScriptablePeer.h:129: error: 'NS_IMETHOD' does not name a type
Source/plugin.cpp:66: error: expected constructor, destructor, or type conversion before '*' token
Source/plugin.cpp: In function 'NPError NS_PluginInitialize()':
Source/plugin.cpp:91: error: 'nsISupports' was not declared in this scope
Source/plugin.cpp:91: error: 'sm' was not declared in this scope
Source/plugin.cpp:100: error: 'nsIServiceManager' was not declared in this scope
Source/plugin.cpp:100: error: 'NS_GET_IID' was not declared in this scope
Source/plugin.cpp:101: error: 'gServiceManager' was not declared in this scope
Source/plugin.cpp:102: error: 'NS_RELEASE' was not declared in this scope
Source/plugin.cpp: In function 'void NS_PluginShutdown()':
Source/plugin.cpp:111: error: 'gServiceManager' was not declared in this scope
Source/plugin.cpp:111: error: 'NS_IF_RELEASE' was not declared in this scope
Source/plugin.cpp: In constructor 'nsPluginInstance::nsPluginInstance(NPP_t*)':
Source/plugin.cpp:162: error: 'class nsControlsScriptablePeer' has no member named 'AddRef'
Source/plugin.cpp: In destructor 'virtual nsPluginInstance::~nsPluginInstance()':
Source/plugin.cpp:369: error: 'class nsControlsScriptablePeer' has no member named 'Release'
Source/plugin.cpp:370: error: 'NS_IF_RELEASE' was not declared in this scope
Source/plugin.cpp:376: error: 'NS_IF_RELEASE' was not declared in this scope
Source/plugin.cpp: In member function 'virtual NPError nsPluginInstance::GetValue(NPPVariable, void*)':
Source/plugin.cpp:3229: error: 'nsISupports' was not declared in this scope
Source/plugin.cpp:3229: error: expected primary-expression before ')' token
Source/plugin.cpp:3229: error: expected `;' before 'aValue'
Source/plugin.cpp:3236: error: 'nsIID' does not name a type
Source/plugin.cpp:3237: error: 'nsIID' was not declared in this scope
Source/plugin.cpp:3237: error: 'ptr' was not declared in this scope
Source/plugin.cpp:3237: error: expected primary-expression before ')' token
Source/plugin.cpp:3237: error: expected `;' before 'NPN_MemAlloc'
Source/plugin.cpp:3239: error: 'scriptableIID' was not declared in this scope
Source/plugin.cpp:3240: error: expected primary-expression before ')' token
Source/plugin.cpp:3240: error: expected `;' before 'aValue'
Source/plugin.cpp: In member function 'nsScriptablePeer* nsPluginInstance::getScriptablePeer()':
Source/plugin.cpp:3273: error: 'NS_ADDREF' was not declared in this scope
Source/plugin.cpp:3276: error: 'NS_ADDREF' was not declared in this scope
Source/plugin.cpp: In member function 'nsControlsScriptablePeer* nsPluginInstance::getControlsScriptablePeer()':
Source/plugin.cpp:3287: error: 'NS_ADDREF' was not declared in this scope
Source/plugin.cpp:3290: error: 'NS_ADDREF' was not declared in this scope
make: *** [plugin.o] Error 1

!!! ERROR: net-www/mplayerplug-in-3.35 failed.
Call stack:
  ebuild.sh, line 1614:   Called dyn_compile
  ebuild.sh, line 971:   Called qa_call 'src_compile'
  environment, line 3001:   Called src_compile
  mplayerplug-in-3.35.ebuild, line 64:   Called die

!!! emake failed
!!! If you need support, post the topmost build error, and the call stack if relevant.
!!! A complete build log is located at '/var/tmp/portage/net-www/mplayerplug-in-3.35/temp/build.log'.