All pastes #369980 Raw Edit

Stuff

public text v1 · immutable
#369980 ·published 2007-02-24 04:39 UTC
rendered paste body
./libtool: line 297: s,^.*/,,g: No such file or directory
./libtool: line 711: -e: command not found
*** Warning: inferring the mode of operation is deprecated.
*** Future versions of Libtool will require --mode=MODE be specified.
./libtool: line 1022: -e: command not found
./libtool: line 1022: -e: command not found
./libtool: line 1022: -e: command not found
./libtool: line 1022: -e: command not found
./libtool: line 1022: -e: command not found
./libtool: line 1022: -e: command not found
./libtool: line 1022: -e: command not found
./libtool: line 1022: -e: command not found
./libtool: line 1022: -e: command not found
./libtool: line 1022: -e: command not found
./libtool: line 1022: -e: command not found
./libtool: line 1022: -e: command not found
./libtool: line 1022: -e: command not found
./libtool: line 1022: -e: command not found
./libtool: line 1022: -e: command not found
./libtool: line 1050: -e: command not found
./libtool: line 1074: -e: command not found
: compile: cannot determine name of library object from `'
make[2]: *** [garray.lo] Error 1
make[2]: Leaving directory `/var/tmp/portage/dev-libs/glib-1.2.10-r5/work/glib-1.2.10'
make[1]: *** [all-recursive] Error 1
make[1]: Leaving directory `/var/tmp/portage/dev-libs/glib-1.2.10-r5/work/glib-1.2.10'
make: *** [all-recursive-am] Error 2

!!! ERROR: dev-libs/glib-1.2.10-r5 failed.
Call stack:
  ebuild.sh, line 1614:   Called dyn_compile
  ebuild.sh, line 971:   Called qa_call 'src_compile'
  environment, line 3723:   Called src_compile
  glib-1.2.10-r5.ebuild, line 54:   Called die

!!! (no error message)
!!! If you need support, post the topmost build error, and the call stack if relevant.
!!! A complete build log is located at '/var/tmp/portage/dev-libs/glib-1.2.10-r5/temp/build.log'.