All pastes #369693 Raw Edit

Stuff

public text v1 · immutable
#369693 ·published 2007-02-24 00:09 UTC
rendered paste body
/bin/sh ../libtool --tag=CC   --mode=compile i686-pc-linux-gnu-gcc -DHAVE_CONFIG_H -I. -I.. -I/usr/include/python2.4 -I/usr/include/pygtk-2.0 -I/usr/include/glib-2.0 -I/usr/lib/glib-2.0/include     -I/usr/include/metacity-1 -I/usr/include/gtk-2.0 -I/usr/lib/gtk-2.0/include -I/usr/include/atk-1.0 -I/usr/include/cairo -I/usr/include/pango-1.0 -I/usr/include/glib-2.0 -I/usr/lib/glib-2.0/include -I/usr/include/freetype2 -I/usr/include/libpng12   -O2 -march=pentium-m -pipe -Wall -std=c9x -fno-strict-aliasing -MT metacity_la-metacity.lo -MD -MP -MF .deps/metacity_la-metacity.Tpo -c -o metacity_la-metacity.lo `test -f 'metacity.c' || echo './'`metacity.c
 i686-pc-linux-gnu-gcc -DHAVE_CONFIG_H -I. -I.. -I/usr/include/python2.4 -I/usr/include/pygtk-2.0 -I/usr/include/glib-2.0 -I/usr/lib/glib-2.0/include -I/usr/include/metacity-1 -I/usr/include/gtk-2.0 -I/usr/lib/gtk-2.0/include -I/usr/include/atk-1.0 -I/usr/include/cairo -I/usr/include/pango-1.0 -I/usr/include/glib-2.0 -I/usr/lib/glib-2.0/include -I/usr/include/freetype2 -I/usr/include/libpng12 -O2 -march=pentium-m -pipe -Wall -std=c9x -fno-strict-aliasing -MT metacity_la-metacity.lo -MD -MP -MF .deps/metacity_la-metacity.Tpo -c metacity.c  -fPIC -DPIC -o .libs/metacity_la-metacity.o
metacity.c: In function 'pymetacity_add_constants':
metacity.c:977: error: 'META_ACTION_DOUBLE_CLICK_TITLEBAR_TOGGLE_SHADE' undeclared (first use in this function)
metacity.c:977: error: (Each undeclared identifier is reported only once
metacity.c:977: error: for each function it appears in.)
metacity.c:978: error: 'META_ACTION_DOUBLE_CLICK_TITLEBAR_TOGGLE_MAXIMIZE' undeclared (first use in this function)
metacity.c:979: error: 'META_ACTION_DOUBLE_CLICK_TITLEBAR_LAST' undeclared (first use in this function)
make[2]: *** [metacity_la-metacity.lo] Error 1
make[2]: Leaving directory `/var/tmp/paludis/dev-python/gnome-python-desktop-2.17.3/work/gnome-python-desktop-2.17.3/metacity'
make[1]: *** [all-recursive] Error 1
make[1]: Leaving directory `/var/tmp/paludis/dev-python/gnome-python-desktop-2.17.3/work/gnome-python-desktop-2.17.3'
make: *** [all] Error 2