unix/x11.cpp: In member function void KeyboardSetup::Define(int, masktype, KeyboardSetup::functiontype, unsigned int):
unix/x11.cpp:1104: error: keydata was not declared in this scope
unix/x11.cpp: In member function void KeyboardSetup::VerifySetup():
unix/x11.cpp:1129: error: keydata was not declared in this scope
unix/x11.cpp:1131: error: base operand of -> is not a pointer
unix/x11.cpp:1132: error: base operand of -> is not a pointer
unix/x11.cpp:1133: error: base operand of -> is not a pointer
unix/x11.cpp:1134: error: base operand of -> is not a pointer
unix/x11.cpp: In member function const KeyboardSetup::Keyfunction& KeyboardSetup::GetKeyFunction(int, unsigned int) const:
unix/x11.cpp:1282: error: keydata was not declared in this scope
unix/x11.cpp:1296: error: base operand of -> is not a pointer
unix/x11.cpp:1297: error: base operand of -> is not a pointer
unix/x11.cpp:1298: error: base operand of -> is not a pointer
unix/x11.cpp:1299: error: base operand of -> is not a pointer
make: *** [unix/x11.o] Error 1