unix/x11.cpp:1103: error: keydata was not declared in this scope
unix/x11.cpp:1063: error: bool KeyboardSetup::Keyfunction::inited is private
unix/x11.cpp:1114: error: within this context
unix/x11.cpp:1063: error: bool KeyboardSetup::Keyfunction::inited is private
unix/x11.cpp:1117: error: within this context
unix/x11.cpp:1063: error: bool KeyboardSetup::Keyfunction::inited is private
unix/x11.cpp:1118: error: within this context
unix/x11.cpp:1063: error: bool KeyboardSetup::Keyfunction::inited is private
unix/x11.cpp:1119: error: within this context
unix/x11.cpp: In member function void KeyboardSetup::VerifySetup():
unix/x11.cpp:1128: error: keydata was not declared in this scope
unix/x11.cpp:1130: error: base operand of -> is not a pointer
unix/x11.cpp:1131: error: base operand of -> is not a pointer
unix/x11.cpp:1132: error: base operand of -> is not a pointer
unix/x11.cpp:1133: error: base operand of -> is not a pointer
unix/x11.cpp: In member function const KeyboardSetup::Keyfunction& KeyboardSetup::GetKeyFunction(int, unsigned int) const:
unix/x11.cpp:1281: error: keydata was not declared in this scope
unix/x11.cpp:1295: error: base operand of -> is not a pointer
unix/x11.cpp:1296: error: base operand of -> is not a pointer
unix/x11.cpp:1297: error: base operand of -> is not a pointer
unix/x11.cpp:1298: error: base operand of -> is not a pointer
unix/x11.cpp: In function void S9xProcessEvents(bool8):
unix/x11.cpp:1061: error: KeyboardSetup::functiontype KeyboardSetup::Keyfunction::func is private
unix/x11.cpp:1337: error: within this context
unix/x11.cpp:1062: error: unsigned int KeyboardSetup::Keyfunction::param is private
unix/x11.cpp:1345: error: within this context
unix/x11.cpp:1062: error: unsigned int KeyboardSetup::Keyfunction::param is private
unix/x11.cpp:1346: error: within this context
unix/x11.cpp:1062: error: unsigned int KeyboardSetup::Keyfunction::param is private
unix/x11.cpp:1362: error: within this context
unix/x11.cpp:1062: error: unsigned int KeyboardSetup::Keyfunction::param is private
unix/x11.cpp:1364: error: within this context
unix/x11.cpp:1062: error: unsigned int KeyboardSetup::Keyfunction::param is private
unix/x11.cpp:1365: error: within this context
unix/x11.cpp:1062: error: unsigned int KeyboardSetup::Keyfunction::param is private
unix/x11.cpp:1369: error: within this context
unix/x11.cpp:1062: error: unsigned int KeyboardSetup::Keyfunction::param is private
unix/x11.cpp:1370: error: within this context
unix/x11.cpp:1062: error: unsigned int KeyboardSetup::Keyfunction::param is private
unix/x11.cpp:1378: error: within this context
unix/x11.cpp:1062: error: unsigned int KeyboardSetup::Keyfunction::param is private
unix/x11.cpp:1389: error: within this context
unix/x11.cpp:1062: error: unsigned int KeyboardSetup::Keyfunction::param is private
unix/x11.cpp:1390: error: within this context
unix/x11.cpp:1062: error: unsigned int KeyboardSetup::Keyfunction::param is private
unix/x11.cpp:1405: error: within this context
unix/x11.cpp:1062: error: unsigned int KeyboardSetup::Keyfunction::param is private
unix/x11.cpp:1416: error: within this context
unix/x11.cpp:1062: error: unsigned int KeyboardSetup::Keyfunction::param is private
unix/x11.cpp:1419: error: within this context
unix/x11.cpp:1062: error: unsigned int KeyboardSetup::Keyfunction::param is private
unix/x11.cpp:1428: error: within this context
unix/x11.cpp:1062: error: unsigned int KeyboardSetup::Keyfunction::param is private
unix/x11.cpp:1432: error: within this context
unix/x11.cpp:1062: error: unsigned int KeyboardSetup::Keyfunction::param is private
unix/x11.cpp:1438: error: within this context
unix/x11.cpp:1062: error: unsigned int KeyboardSetup::Keyfunction::param is private
unix/x11.cpp:1455: error: within this context
unix/x11.cpp:1062: error: unsigned int KeyboardSetup::Keyfunction::param is private
unix/x11.cpp:1457: error: within this context
unix/x11.cpp:1062: error: unsigned int KeyboardSetup::Keyfunction::param is private
unix/x11.cpp:1459: error: within this context
unix/x11.cpp:1062: error: unsigned int KeyboardSetup::Keyfunction::param is private
unix/x11.cpp:1462: error: within this context
make: *** [unix/x11.o] Error 1