All pastes #367917 Raw Edit

dr.bombay

public text v1 · immutable
#367917 ·published 2007-02-22 18:10 UTC
rendered paste body
../libtool: line 1022: -e: command not found
../libtool: line 1022: -e: command not found
../libtool: line 1022: -e: command not found
../libtool: line 1022: -e: command not found
../libtool: line 1022: -e: command not found
../libtool: line 1022: -e: command not found
../libtool: line 1022: -e: command not found
../libtool: line 1022: -e: command not found
../libtool: line 1022: -e: command not found
../libtool: line 1022: -e: command not found
../libtool: line 1022: -e: command not found
../libtool: line 1022: -e: command not found
../libtool: line 1022: -e: command not found
../libtool: line 1022: -e: command not found
../libtool: line 1022: -e: command not found
../libtool: line 1022: -e: command not found
../libtool: line 1022: -e: command not found
../libtool: line 1022: -e: command not found
../libtool: line 1022: -e: command not found
../libtool: line 1022: -e: command not found
../libtool: line 1022: -e: command not found
../libtool: line 1022: -e: command not found
../libtool: line 1022: -e: command not found
../libtool: line 1022: -e: command not found
../libtool: line 1022: -e: command not found
../libtool: line 1022: -e: command not found
../libtool: line 1022: -e: command not found
../libtool: line 1022: -e: command not found
../libtool: line 1022: -e: command not found
../libtool: line 1022: -e: command not found
../libtool: line 1022: -e: command not found
../libtool: line 1050: -e: command not found
../libtool: line 1050: -e: command not found
../libtool: line 1074: -e: command not found
: compile: cannot determine name of library object from `'
make[2]: *** [gdkcc.lo] Error 1
make[2]: *** Waiting for unfinished jobs....
../libtool: line 1074: -e: command not found
: compile: cannot determine name of library object from `'
make[2]: *** [gdk.lo] Error 1
make[2]: Leaving directory `/var/tmp/portage/x11-libs/gtk+-1.2.10-r12/work/gtk+-1.2.10/gdk'
make[1]: *** [all-recursive] Error 1
make[1]: Leaving directory `/var/tmp/portage/x11-libs/gtk+-1.2.10-r12/work/gtk+-1.2.10'
make: *** [all-recursive-am] Error 2

!!! ERROR: x11-libs/gtk+-1.2.10-r12 failed.
Call stack:
  ebuild.sh, line 1614:   Called dyn_compile
  ebuild.sh, line 971:   Called qa_call 'src_compile'
  environment, line 3534:   Called src_compile
  gtk+-1.2.10-r12.ebuild, line 62:   Called die

!!! (no error message)
!!! If you need support, post the topmost build error, and the call stack if relevant.
!!! A complete build log is located at '/var/tmp/portage/x11-libs/gtk+-1.2.10-r12/temp/build.log'.