rendered paste body=========================================================
Pike v7.6 release 86 configuration summary
install information:
prefix........ /usr/local
pike binary... /usr/local/bin/pike
pike library.. /usr/local/pike/7.6.86/lib
system information:
system.... Linux 2.6.17-11-generic
uname..... Linux myhome 2.6.17-11-generic #2 SMP Thu Feb 1 19:52:28 UTC 2007 arm GNU/Linux
hostname.. myhome
build information:
source path..... /home/mortel/Source/Pike-v7.6.86/src
build path...... /home/mortel/Source/Pike-v7.6.86/build/linux-2.6.17-11-generic-arm
cpp............. gcc -E
cc.............. /home/mortel/Source/Pike-v7.6.86/build/linux-2.6.17-11-generic-arm/smartlink gcc
ld.............. $(CC) $(CFLAGS)
cc shared....... -fPIC -DDYNAMIC_MODULE
ld shared....... -rdynamic
pike............
install......... /scratchbox/tools/bin/install -c
shared object... .so
libs............ -ldl -lrt -lnsl -lm -ldl -lrt -lnsl -lm -lpthread -lcrypt -lpthread -lcrypt
cross-compiled.. no
CPPFLAGS........ -I/home/mortel/Source/Pike-v7.6.86/build/linux-2.6.17-11-generic-arm/bundles/include -I/usr/local/include -I/usr/X11R6/include
CFLAGS (opt).... -O2 -pipe
CFLAGS (warn)... -W -Wall -Wno-unused -Wcomment -Wformat -Wimplicit-function-declaration -Wmultichar -Wswitch -Wuninitialized -Wpointer-arith -Wchar-subscripts -Wno-long-long
CFLAGS (misc)... -g -Wa,--execstack
LDFLAGS......... -L/home/mortel/Source/Pike-v7.6.86/build/linux-2.6.17-11-generic-arm/bundles/lib -Wl,-z,execstack -R/usr/local/lib -L/usr/local/lib -R/usr/X11R6/lib -L/usr/X11R6/lib -rdynamic
features:
dynamic loading..... yes
threads............. yes (posix)
signal handler...... SIGCHILD
cdebug.............. yes
rtldebug............ no
dmalloc............. no
mmx................. no (no mmx.h found)
byte code format.... virtual machine
module reloc........ no
use machine code.... no
int type............ long (4 bytes)
float type.......... float (4 bytes) (ieee little endian)
pointer size........ 4 bytes
svalue size......... 8 bytes (2+2+4)
Bz2................. yes (using libbz2)
DVB................. no (missing linux/dvb/sec.h - version 3 api?)
FFmpeg.............. no (dependencies failed)
GLUT................ no (dependencies failed)
GTK................. no (dependencies failed)
GTK.GlArea.......... no (dependencies failed)
GTK.GladeXML........ no (dependencies failed)
GTK2................ yes
Gdbm................ yes
Gmp (bignums)....... yes (version 4.1.4, using libgmp)
Gz.................. yes (libz)
Image............... yes
Image.FreeType...... yes
Image.GIF........... yes
Image.JPEG.......... yes
Image.SVG........... no (dependencies failed)
Image.TIFF.......... yes
Image.TTF........... no (dependencies failed)
Image.XFace......... yes
Java................ no (no known JVM found)
Kerberos............ no (krb5.h not found)
MIME................ yes
Math................ yes
Math.Transforms.FFT. no (fftw.h not found)
Mird................ no (libmird/mird.h not found)
Mysql............... no (dependencies failed)
Nettle.............. yes
Odbc................ no (dependencies failed)
Oracle.............. no (dependencies failed)
PDF.PDFlib.......... no (dependencies failed)
PDF.Panda........... no (dependencies failed)
Perl................ no (use --with-perl to compile it)
Postgres............ no (dependencies failed)
Regexp.PCRE......... no (dependencies failed)
SDL................. yes
SDL_mixer........... yes
Ssleay.............. no (use --with-ssleay to compile it)
sybase.............. no (dependencies failed)
=========================================================
Making all in build/linux-2.6.17-11-generic-arm
make[1]: Entering directory `/home/mortel/Source/Pike-v7.6.86/build/linux-2.6.17-11-generic-arm'
Creating lib/.
Creating lib/modules/.
Creating lib/include/.
Done.
make[2]: Entering directory `/home/mortel/Source/Pike-v7.6.86/build/linux-2.6.17-11-generic-arm/modules'
Making CommonLog
make[3]: Entering directory `/home/mortel/Source/Pike-v7.6.86/build/linux-2.6.17-11-generic-arm/modules/CommonLog'
Compiling /home/mortel/Source/Pike-v7.6.86/src/modules/CommonLog/clf.c
Linking CommonLog
make[3]: Leaving directory `/home/mortel/Source/Pike-v7.6.86/build/linux-2.6.17-11-generic-arm/modules/CommonLog'
Making DVB
make[3]: Entering directory `/home/mortel/Source/Pike-v7.6.86/build/linux-2.6.17-11-generic-arm/modules/DVB'
Compiling /home/mortel/Source/Pike-v7.6.86/src/modules/DVB/dvb.c
Compiling /home/mortel/Source/Pike-v7.6.86/src/modules/DVB/psparser.c
Linking DVB
make[3]: Leaving directory `/home/mortel/Source/Pike-v7.6.86/build/linux-2.6.17-11-generic-arm/modules/DVB'
Making GTK2
make[3]: Entering directory `/home/mortel/Source/Pike-v7.6.86/build/linux-2.6.17-11-generic-arm/modules/GTK2'
Makefile:453: warning: overriding commands for target `depend'
Makefile:232: warning: ignoring old commands for target `depend'
make[3]: *** No rule to make target `/home/mortel/Source/Pike-v7.6.86/src/modules/GTK2/dependencies', needed by `Makefile'. Stop.
make[3]: Leaving directory `/home/mortel/Source/Pike-v7.6.86/build/linux-2.6.17-11-generic-arm/modules/GTK2'
make[2]: *** [GTK2] Error 1
make[2]: Leaving directory `/home/mortel/Source/Pike-v7.6.86/build/linux-2.6.17-11-generic-arm/modules'
make[1]: *** [module_objects] Error 1
make[1]: Leaving directory `/home/mortel/Source/Pike-v7.6.86/build/linux-2.6.17-11-generic-arm'
make: *** [compile] Error 2