dsp.c: In function '__opbx_dsp_digitdetect':
dsp.c:455: error: 'struct opbx_dsp' has no member named 'td'
dsp.c:456: error: 'struct opbx_dsp' has no member named 'td'
dsp.c:463: error: 'struct opbx_dsp' has no member named 'td'
dsp.c:471: warning: implicit declaration of function 'modem_connect_tones_rx'
dsp.c:471: error: 'struct opbx_dsp' has no member named 'fax_cng_rx'
dsp.c: In function 'opbx_dsp_getdigits':
dsp.c:524: error: 'struct opbx_dsp' has no member named 'td'
dsp.c:525: error: 'struct opbx_dsp' has no member named 'td'
dsp.c:526: error: 'struct opbx_dsp' has no member named 'td'
dsp.c:529: error: 'struct opbx_dsp' has no member named 'td'
dsp.c:530: error: 'struct opbx_dsp' has no member named 'td'
dsp.c:530: error: 'struct opbx_dsp' has no member named 'td'
dsp.c:530: error: 'struct opbx_dsp' has no member named 'td'
dsp.c:531: error: 'struct opbx_dsp' has no member named 'td'
dsp.c: In function 'opbx_dsp_process':
dsp.c:1091: error: 'struct opbx_dsp' has no member named 'td'
dsp.c:1103: error: 'struct opbx_dsp' has no member named 'td'
dsp.c:1105: error: 'struct opbx_dsp' has no member named 'td'
dsp.c:1106: error: 'struct opbx_dsp' has no member named 'td'
dsp.c:1106: error: 'struct opbx_dsp' has no member named 'td'
dsp.c:1106: error: 'struct opbx_dsp' has no member named 'td'
dsp.c:1107: error: 'struct opbx_dsp' has no member named 'td'
dsp.c: In function 'opbx_dsp_new':
dsp.c:1175: warning: implicit declaration of function 'modem_connect_tones_rx_in it'
dsp.c:1175: error: 'struct opbx_dsp' has no member named 'fax_cng_rx'
dsp.c:1176: error: 'MODEM_CONNECT_TONES_FAX_CNG' undeclared (first use in this f unction)
dsp.c:1176: error: (Each undeclared identifier is reported only once
dsp.c:1176: error: for each function it appears in.)
dsp.c:1180: error: 'struct opbx_dsp' has no member named 'td'
dsp.c: In function 'opbx_dsp_digitreset':
dsp.c:1225: error: 'struct opbx_dsp' has no member named 'td'
dsp.c:1230: error: 'struct opbx_dsp' has no member named 'fax_cng_rx'
dsp.c:1231: error: 'MODEM_CONNECT_TONES_FAX_CNG' undeclared (first use in this f unction)
dsp.c:1235: error: 'struct opbx_dsp' has no member named 'td'
dsp.c:1235: error: 'struct opbx_dsp' has no member named 'td'
dsp.c:1236: error: 'struct opbx_dsp' has no member named 'td'
dsp.c:1240: error: 'struct opbx_dsp' has no member named 'td'
dsp.c:1241: error: 'struct opbx_dsp' has no member named 'td'
dsp.c:1244: error: 'struct opbx_dsp' has no member named 'td'
dsp.c:1246: error: 'struct opbx_dsp' has no member named 'td'
dsp.c:1247: error: 'struct opbx_dsp' has no member named 'td'
dsp.c:1248: error: 'struct opbx_dsp' has no member named 'td'
dsp.c:1249: error: 'struct opbx_dsp' has no member named 'td'
dsp.c:1250: error: 'struct opbx_dsp' has no member named 'td'
dsp.c:1251: error: 'struct opbx_dsp' has no member named 'td'
dsp.c: In function 'opbx_dsp_digitmode':
dsp.c:1278: error: 'struct opbx_dsp' has no member named 'td'
dsp.c:1280: error: 'struct opbx_dsp' has no member named 'td'
make[3]: *** [libopenpbx_la-dsp.lo] Error 1
make[3]: Leaving directory `/usr/src/openpbx/corelib'
make[2]: *** [all-recursive] Error 1
make[2]: Leaving directory `/usr/src/openpbx/corelib'
make[1]: *** [all] Error 2
make[1]: Leaving directory `/usr/src/openpbx/corelib'
make: *** [all-recursive] Error 1