All pastes #364462 Raw Edit

Something

public text v1 · immutable
#364462 ·published 2007-02-20 04:57 UTC
rendered paste body
cc1: warning: command line option "-Wno-ctor-dtor-privacy" is valid for C++/ObjC++ but not for C
cc1: warning: command line option "-Wno-ctor-dtor-privacy" is valid for C++/ObjC++ but not for C
cc1: warning: command line option "-Wno-ctor-dtor-privacy" is valid for C++/ObjC++ but not for C
In file included from ./include/wx/string.h:55,
                 from ./include/wx/memory.h:20,
                 from ./include/wx/object.h:25,
                 from ./include/wx/wx.h:16,
                 from ./include/wx/wxprec.h:54:
./include/wx/buffer.h:96: error: expected ‘=’, ‘,’, ‘;’, ‘asm’ or ‘__attribute__’ before ‘wxCharBuffer’
./include/wx/buffer.h:100: error: expected ‘=’, ‘,’, ‘;’, ‘asm’ or ‘__attribute__’ before ‘wxWCharBuffer’
./include/wx/buffer.h:123: error: expected ‘=’, ‘,’, ‘;’, ‘asm’ or ‘__attribute__’ before ‘wxMemoryBufferData’
./include/wx/buffer.h:180: error: expected ‘=’, ‘,’, ‘;’, ‘asm’ or ‘__attribute__’ before ‘wxMemoryBuffer’
In file included from ./include/wx/string.h:56,
                 from ./include/wx/memory.h:20,
                 from ./include/wx/object.h:25,
                 from ./include/wx/wx.h:16,
                 from ./include/wx/wxprec.h:54:
./include/wx/strconv.h:39: error: expected ‘=’, ‘,’, ‘;’, ‘asm’ or ‘__attribute__’ before ‘wxMBConv’
./include/wx/strconv.h:82: error: expected ‘=’, ‘,’, ‘;’, ‘asm’ or ‘__attribute__’ before ‘wxMBConvLibc’
./include/wx/strconv.h:98: error: expected ‘=’, ‘,’, ‘;’, ‘asm’ or ‘__attribute__’ before ‘wxConvBrokenFileNames’
./include/wx/strconv.h:118: error: expected ‘=’, ‘,’, ‘;’, ‘asm’ or ‘__attribute__’ before ‘wxMBConvUTF7’
./include/wx/strconv.h:129: error: expected ‘=’, ‘,’, ‘;’, ‘asm’ or ‘__attribute__’ before ‘wxMBConvUTF8’
./include/wx/strconv.h:150: error: expected ‘=’, ‘,’, ‘;’, ‘asm’ or ‘__attribute__’ before ‘wxMBConvUTF16LE’
./include/wx/strconv.h:161: error: expected ‘=’, ‘,’, ‘;’, ‘asm’ or ‘__attribute__’ before ‘wxMBConvUTF16BE’
./include/wx/strconv.h:172: error: expected ‘=’, ‘,’, ‘;’, ‘asm’ or ‘__attribute__’ before ‘wxMBConvUTF32LE’
./include/wx/strconv.h:183: error: expected ‘=’, ‘,’, ‘;’, ‘asm’ or ‘__attribute__’ before ‘wxMBConvUTF32BE’
In file included from ./include/wx/string.h:56,
                 from ./include/wx/memory.h:20,
                 from ./include/wx/object.h:25,
                 from ./include/wx/wx.h:16,
                 from ./include/wx/wxprec.h:54:
./include/wx/strconv.h:196: error: expected ‘=’, ‘,’, ‘;’, ‘asm’ or ‘__attribute__’ before ‘wxCSConv’
./include/wx/strconv.h:246: error: expected ‘=’, ‘,’, ‘;’, ‘asm’ or ‘__attribute__’ before ‘&’ token
./include/wx/strconv.h:249: error: expected ‘=’, ‘,’, ‘;’, ‘asm’ or ‘__attribute__’ before ‘&’ token
./include/wx/strconv.h:250: error: expected ‘=’, ‘,’, ‘;’, ‘asm’ or ‘__attribute__’ before ‘&’ token
./include/wx/strconv.h:251: error: expected ‘=’, ‘,’, ‘;’, ‘asm’ or ‘__attribute__’ before ‘&’ token
./include/wx/strconv.h:260: error: expected ‘=’, ‘,’, ‘;’, ‘asm’ or ‘__attribute__’ before ‘*’ token
./include/wx/strconv.h:267: error: expected ‘=’, ‘,’, ‘;’, ‘asm’ or ‘__attribute__’ before ‘*’ token
./include/wx/strconv.h:270: error: expected ‘=’, ‘,’, ‘;’, ‘asm’ or ‘__attribute__’ before ‘&’ token
./include/wx/strconv.h:281: error: expected ‘=’, ‘,’, ‘;’, ‘asm’ or ‘__attribute__’ before ‘wxMBConvUTF16’
./include/wx/strconv.h:282: error: expected ‘=’, ‘,’, ‘;’, ‘asm’ or ‘__attribute__’ before ‘wxMBConvUTF32’
In file included from ./include/wx/memory.h:20,
                 from ./include/wx/object.h:25,
                 from ./include/wx/wx.h:16,
                 from ./include/wx/wxprec.h:54:
./include/wx/string.h:58: error: expected ‘=’, ‘,’, ‘;’, ‘asm’ or ‘__attribute__’ before ‘wxString’
./include/wx/string.h:98: error: expected ‘=’, ‘,’, ‘;’, ‘asm’ or ‘__attribute__’ before ‘IsEmpty’
In file included from ./include/wx/memory.h:20,
                 from ./include/wx/object.h:25,
                 from ./include/wx/wx.h:16,
                 from ./include/wx/wxprec.h:54:
./include/wx/string.h:170:18: warning: string: No such file or directory
In file included from ./include/wx/memory.h:20,
                 from ./include/wx/object.h:25,
                 from ./include/wx/wx.h:16,
                 from ./include/wx/wxprec.h:54:
./include/wx/string.h:180: error: expected ‘=’, ‘,’, ‘;’, ‘asm’ or ‘__attribute__’ before ‘:’ token
./include/wx/string.h:217: error: expected ‘:’, ‘,’, ‘;’, ‘}’ or ‘__attribute__’ before ‘const’
./include/wx/string.h:246: error: expected ‘=’, ‘,’, ‘;’, ‘asm’ or ‘__attribute__’ before ‘wxStringBase’
./include/wx/string.h:610: error: expected ‘=’, ‘,’, ‘;’, ‘asm’ or ‘__attribute__’ before ‘wxString’
In file included from ./include/wx/string.h:1291,
                 from ./include/wx/memory.h:20,
                 from ./include/wx/object.h:25,
                 from ./include/wx/wx.h:16,
                 from ./include/wx/wxprec.h:54:
./include/wx/arrstr.h:18: error: expected ‘)’ before ‘*’ token
./include/wx/arrstr.h:19: error: expected ‘)’ before ‘*’ token
./include/wx/arrstr.h:98: error: expected ‘=’, ‘,’, ‘;’, ‘asm’ or ‘__attribute__’ before ‘wxArrayString’
./include/wx/arrstr.h:336: error: expected ‘=’, ‘,’, ‘;’, ‘asm’ or ‘__attribute__’ before ‘wxSortedArrayString’
./include/wx/arrstr.h:349: error: expected ‘=’, ‘,’, ‘;’, ‘asm’ or ‘__attribute__’ before ‘wxCArrayString’
In file included from ./include/wx/memory.h:20,
                 from ./include/wx/object.h:25,
                 from ./include/wx/wx.h:16,
                 from ./include/wx/wxprec.h:54:
./include/wx/string.h:1299: error: expected ‘=’, ‘,’, ‘;’, ‘asm’ or ‘__attribute__’ before ‘&’ token
./include/wx/string.h:1364: error: expected ‘=’, ‘,’, ‘;’, ‘asm’ or ‘__attribute__’ before ‘wxStringBuffer’
./include/wx/string.h:1382: error: expected ‘=’, ‘,’, ‘;’, ‘asm’ or ‘__attribute__’ before ‘wxStringBufferLength’
./include/wx/string.h:1421: error: expected ‘=’, ‘,’, ‘;’, ‘asm’ or ‘__attribute__’ before ‘operator’
./include/wx/string.h:1423: error: expected ‘=’, ‘,’, ‘;’, ‘asm’ or ‘__attribute__’ before ‘operator’
./include/wx/string.h:1425: error: expected ‘=’, ‘,’, ‘;’, ‘asm’ or ‘__attribute__’ before ‘operator’
./include/wx/string.h:1427: error: expected ‘=’, ‘,’, ‘;’, ‘asm’ or ‘__attribute__’ before ‘operator’
./include/wx/string.h:1429: error: expected ‘=’, ‘,’, ‘;’, ‘asm’ or ‘__attribute__’ before ‘operator’
./include/wx/string.h:1431: error: expected ‘=’, ‘,’, ‘;’, ‘asm’ or ‘__attribute__’ before ‘operator’
./include/wx/string.h:1433: error: expected ‘=’, ‘,’, ‘;’, ‘asm’ or ‘__attribute__’ before ‘operator’
./include/wx/string.h:1435: error: expected ‘=’, ‘,’, ‘;’, ‘asm’ or ‘__attribute__’ before ‘operator’
./include/wx/string.h:1437: error: expected ‘=’, ‘,’, ‘;’, ‘asm’ or ‘__attribute__’ before ‘operator’
./include/wx/string.h:1439: error: expected ‘=’, ‘,’, ‘;’, ‘asm’ or ‘__attribute__’ before ‘operator’
./include/wx/string.h:1441: error: expected ‘=’, ‘,’, ‘;’, ‘asm’ or ‘__attribute__’ before ‘operator’
./include/wx/string.h:1443: error: expected ‘=’, ‘,’, ‘;’, ‘asm’ or ‘__attribute__’ before ‘operator’
./include/wx/string.h:1445: error: expected ‘=’, ‘,’, ‘;’, ‘asm’ or ‘__attribute__’ before ‘operator’
./include/wx/string.h:1447: error: expected ‘=’, ‘,’, ‘;’, ‘asm’ or ‘__attribute__’ before ‘operator’
./include/wx/string.h:1449: error: expected ‘=’, ‘,’, ‘;’, ‘asm’ or ‘__attribute__’ before ‘operator’
./include/wx/string.h:1451: error: expected ‘=’, ‘,’, ‘;’, ‘asm’ or ‘__attribute__’ before ‘operator’
./include/wx/string.h:1453: error: expected ‘=’, ‘,’, ‘;’, ‘asm’ or ‘__attribute__’ before ‘operator’
./include/wx/string.h:1455: error: expected ‘=’, ‘,’, ‘;’, ‘asm’ or ‘__attribute__’ before ‘operator’
./include/wx/string.h:1468: error: expected ‘=’, ‘,’, ‘;’, ‘asm’ or ‘__attribute__’ before ‘operator’
./include/wx/string.h:1470: error: expected ‘=’, ‘,’, ‘;’, ‘asm’ or ‘__attribute__’ before ‘operator’
./include/wx/string.h:1472: error: expected ‘=’, ‘,’, ‘;’, ‘asm’ or ‘__attribute__’ before ‘operator’
./include/wx/string.h:1474: error: expected ‘=’, ‘,’, ‘;’, ‘asm’ or ‘__attribute__’ before ‘operator’
./include/wx/string.h:1484: error: expected ‘=’, ‘,’, ‘;’, ‘asm’ or ‘__attribute__’ before ‘operator’
./include/wx/string.h:1486: error: expected ‘=’, ‘,’, ‘;’, ‘asm’ or ‘__attribute__’ before ‘operator’
./include/wx/string.h:1494: error: expected ‘=’, ‘,’, ‘;’, ‘asm’ or ‘__attribute__’ before ‘operator’
./include/wx/string.h:1495: error: expected ‘=’, ‘,’, ‘;’, ‘asm’ or ‘__attribute__’ before ‘operator’
./include/wx/string.h:1496: error: expected ‘=’, ‘,’, ‘;’, ‘asm’ or ‘__attribute__’ before ‘operator’
./include/wx/string.h:1497: error: expected ‘=’, ‘,’, ‘;’, ‘asm’ or ‘__attribute__’ before ‘operator’
In file included from ./include/wx/string.h:1508,
                 from ./include/wx/memory.h:20,
                 from ./include/wx/object.h:25,
                 from ./include/wx/wx.h:16,
                 from ./include/wx/wxprec.h:54:
./include/wx/iosfwrap.h:18:21: warning: iosfwd: No such file or directory
In file included from ./include/wx/memory.h:20,
                 from ./include/wx/object.h:25,
                 from ./include/wx/wx.h:16,
                 from ./include/wx/wxprec.h:54:
./include/wx/string.h:1510: error: expected ‘=’, ‘,’, ‘;’, ‘asm’ or ‘__attribute__’ before ‘:’ token
./include/wx/string.h:1511: error: expected ‘=’, ‘,’, ‘;’, ‘asm’ or ‘__attribute__’ before ‘:’ token
In file included from ./include/wx/memory.h:21,
                 from ./include/wx/object.h:25,
                 from ./include/wx/wx.h:16,
                 from ./include/wx/wxprec.h:54:
./include/wx/msgout.h:38: error: expected ‘=’, ‘,’, ‘;’, ‘asm’ or ‘__attribute__’ before ‘wxMessageOutput’
./include/wx/msgout.h:65: error: expected ‘=’, ‘,’, ‘;’, ‘asm’ or ‘__attribute__’ before ‘wxMessageOutputBest’
./include/wx/msgout.h:79: error: expected ‘=’, ‘,’, ‘;’, ‘asm’ or ‘__attribute__’ before ‘wxMessageOutputStderr’
./include/wx/msgout.h:107: error: expected ‘=’, ‘,’, ‘;’, ‘asm’ or ‘__attribute__’ before ‘wxMessageOutputDebug’
./include/wx/msgout.h:119: error: expected ‘=’, ‘,’, ‘;’, ‘asm’ or ‘__attribute__’ before ‘wxMessageOutputLog’
In file included from ./include/wx/wx.h:16,
                 from ./include/wx/wxprec.h:54:
./include/wx/object.h:27: error: expected ‘=’, ‘,’, ‘;’, ‘asm’ or ‘__attribute__’ before ‘wxObject’
./include/wx/object.h:50: error: expected ‘=’, ‘,’, ‘;’, ‘asm’ or ‘__attribute__’ before ‘wxClassInfo’
./include/wx/object.h:51: error: expected ‘=’, ‘,’, ‘;’, ‘asm’ or ‘__attribute__’ before ‘wxHashTable’
./include/wx/object.h:52: error: expected ‘=’, ‘,’, ‘;’, ‘asm’ or ‘__attribute__’ before ‘wxObjectRefData’
./include/wx/object.h:58: error: expected ‘=’, ‘,’, ‘;’, ‘asm’ or ‘__attribute__’ before ‘*’ token
./include/wx/object.h:60: error: expected ‘=’, ‘,’, ‘;’, ‘asm’ or ‘__attribute__’ before ‘wxClassInfo’
./include/wx/object.h:148: error: expected ‘=’, ‘,’, ‘;’, ‘asm’ or ‘__attribute__’ before ‘*’ token
./include/wx/object.h:151: error: expected ‘=’, ‘,’, ‘;’, ‘asm’ or ‘__attribute__’ before ‘:’ token
./include/wx/object.h:152: error: expected ‘=’, ‘,’, ‘;’, ‘asm’ or ‘__attribute__’ before ‘:’ token
./include/wx/object.h:400: error: expected ‘=’, ‘,’, ‘;’, ‘asm’ or ‘__attribute__’ before ‘wxObject’
./include/wx/object.h:505: error: expected ‘=’, ‘,’, ‘;’, ‘asm’ or ‘__attribute__’ before ‘wxObjectRefData’
./include/wx/object.h:520: error: expected ‘=’, ‘,’, ‘;’, ‘asm’ or ‘__attribute__’ before ‘*’ token
In file included from ./include/wx/wx.h:17,
                 from ./include/wx/wxprec.h:54:
./include/wx/dynarray.h:72: error: expected identifier or ‘(’ before string constant
./include/wx/dynarray.h:809: error: expected ‘=’, ‘,’, ‘;’, ‘asm’ or ‘__attribute__’ before ‘wxBaseArrayPtrVoid’
./include/wx/dynarray.h:811: error: expected ‘=’, ‘,’, ‘;’, ‘asm’ or ‘__attribute__’ before ‘wxBaseArrayShort’
./include/wx/dynarray.h:812: error: expected ‘=’, ‘,’, ‘;’, ‘asm’ or ‘__attribute__’ before ‘wxBaseArrayInt’
./include/wx/dynarray.h:813: error: expected ‘=’, ‘,’, ‘;’, ‘asm’ or ‘__attribute__’ before ‘wxBaseArrayLong’
./include/wx/dynarray.h:814: error: expected ‘=’, ‘,’, ‘;’, ‘asm’ or ‘__attribute__’ before ‘wxBaseArraySizeT’
./include/wx/dynarray.h:815: error: expected ‘=’, ‘,’, ‘;’, ‘asm’ or ‘__attribute__’ before ‘wxBaseArrayDouble’
./include/wx/dynarray.h:963: error: ‘wxBaseArrayShort’ undeclared here (not in a function)
./include/wx/dynarray.h:963: error: expected ‘)’ before ‘:’ token
./include/wx/dynarray.h:963: error: bit-field ‘TypeTooBigToBeStoredInwxBaseArrayShort’ width not an integer constant
./include/wx/dynarray.h:963: error: expected ‘=’, ‘,’, ‘;’, ‘asm’ or ‘__attribute__’ before ‘wxArrayShort’
./include/wx/dynarray.h:964: error: ‘wxBaseArrayInt’ undeclared here (not in a function)
./include/wx/dynarray.h:964: error: expected ‘)’ before ‘:’ token
./include/wx/dynarray.h:964: error: bit-field ‘TypeTooBigToBeStoredInwxBaseArrayInt’ width not an integer constant
./include/wx/dynarray.h:964: error: expected ‘=’, ‘,’, ‘;’, ‘asm’ or ‘__attribute__’ before ‘wxArrayInt’
./include/wx/dynarray.h:965: error: ‘wxBaseArrayLong’ undeclared here (not in a function)
./include/wx/dynarray.h:965: error: expected ‘)’ before ‘:’ token
./include/wx/dynarray.h:965: error: bit-field ‘TypeTooBigToBeStoredInwxBaseArrayLong’ width not an integer constant
./include/wx/dynarray.h:965: error: expected ‘=’, ‘,’, ‘;’, ‘asm’ or ‘__attribute__’ before ‘wxArrayLong’
./include/wx/dynarray.h:966: error: ‘wxBaseArrayPtrVoid’ undeclared here (not in a function)
./include/wx/dynarray.h:966: error: expected ‘)’ before ‘:’ token
./include/wx/dynarray.h:966: error: bit-field ‘TypeTooBigToBeStoredInwxBaseArrayPtrVoid’ width not an integer constant
./include/wx/dynarray.h:966: error: expected ‘=’, ‘,’, ‘;’, ‘asm’ or ‘__attribute__’ before ‘wxArrayPtrVoid’
In file included from ./include/wx/string.h:55,
                 from ./include/wx/memory.h:20,
                 from ./include/wx/object.h:25,
                 from ./include/w./include/wx/list.h:62: error: expected ‘=’, ‘,’, ‘;’, ‘asm’ or ‘__attribute__’ before ‘wxObjectListNode’
./include/wx/list.h:63: error: expected ‘=’, ‘,’, ‘;’, ‘asm’ or ‘__attribute__’ before ‘wxNode’
./include/wx/buffer.h:100: error: expected ‘=’, ‘,’, ‘;’, ‘asm’ or ‘__attribute__’ before ‘wxWCharBuffer’
./include/wx/buffer.h:123: error: expected ‘=’, ‘,’, ‘;’, ‘asm’ or ‘__attribute__’ before ‘wxMemoryBufferData’
./include/wx/buffer.h:180: error: expected ‘=’, ‘,’, ‘;’, ‘asm’ or ‘__attribute__’ before ‘wxMemoryBuffer’
In file included from ./include/wx/string.h:56,
                 from ./include/wx/memory.h:20,
                 from ./include/wx/object.h:25,
                 from ./include/wx/wx.h:16,
                 from ./include/wx/wxprec.h:54:
./include/wx/strconv.h:39: error: expected ‘=’, ‘,’, ‘;’, ‘asm’ or ‘__attribute__’ before ‘wxMBConv’
./include/wx/list.h:350: error: expected ‘=’, ‘,’, ‘;’, ‘asm’ or ‘__attribute__’ before ‘wxListKey’
./include/wx/strconv.h:82: error: expected ‘=’, ‘,’, ‘;’, ‘asm’ or ‘__attribute__’ before ‘wxMBConvLibc’
./include/wx/strconv.h:98: error: expected ‘=’, ‘,’, ‘;’, ‘asm’ or ‘__attribute__’ before ‘wxConvBrokenFileNames’
./include/wx/list.h:391: error: expected ‘=’, ‘,’, ‘;’, ‘asm’ or ‘__attribute__’ before ‘wxDefaultListKey’
./include/wx/list.h:393: error: expected ‘=’, ‘,’, ‘;’, ‘asm’ or ‘__attribute__’ before ‘wxListBase’./include/wx/strconv.h:118: error: expected ‘=’, ‘,’, ‘;’, ‘asm’ or ‘__attribute__’ before ‘wxMBConvUTF7’./include/wx/list.h:395: error: expected ‘=’, ‘,’, ‘;’, ‘asm’ or ‘__attribute__’ before ‘wxNodeBase’
./include/wx/strconv.h:129: error: expected ‘=’, ‘,’, ‘;’, ‘asm’ or ‘__attribute__’ before ‘wxMBConvUTF8’
./include/wx/strconv.h:150: error: expected ‘=’, ‘,’, ‘;’, ‘asm’ or ‘__attribute__’ before ‘wxMBConvUTF16LE’
./include/wx/strconv.h:161: error: expected ‘=’, ‘,’, ‘;’, ‘asm’ or ‘__attribute__’ before ‘wxMBConvUTF16BE’./include/wx/list.h:455: error: expected ‘=’, ‘,’, ‘;’, ‘asm’ or ‘__attribute__’ before ‘wxList’
./include/wx/list.h:457: error: expected ‘=’, ‘,’, ‘;’, ‘asm’ or ‘__attribute__’ before ‘wxListBase’
./include/wx/strconv.h:183: error: expected ‘=’, ‘,’, ‘;’, ‘asm’ or ‘__attribute__’ before ‘wxMBConvUTF32BE’
In file included from ./include/wx/string.h:56,
                 from ./include/wx/memory.h:20,
                 from ./include/wx/object.h:25,
                 from ./include/wx/wx.h:16,
                 from ./include/wx/wxprec.h:54:
./include/wx/strconv.h:196: error: expected ‘=’, ‘,’, ‘;’, ‘asm’ or ‘__attribute__’ before ‘wxCSConv’
./include/wx/strconv.h:246: error: expected ‘=’, ‘,’, ‘;’, ‘asm’ or ‘__attribute__’ before ‘&’ token
./include/wx/strconv.h:249: error: expected ‘=’, ‘,’, ‘;’, ‘asm’ or ‘__attribute__’ before ‘&’ token
./include/wx/strconv.h:250: error: expected ‘=’, ‘,’, ‘;’, ‘asm’ or ‘__attribute__’ before ‘&’ token
./include/wx/strconv.h:251: error: expected ‘=’, ‘,’, ‘;’, ‘asm’ or ‘__attribute__’ before ‘&’ token
./include/wx/strconv.h:260: error: expected ‘=’, ‘,’, ‘;’, ‘asm’ or ‘__attribute__’ before ‘*’ token
./include/wx/strconv.h:267: error: expected ‘=’, ‘,’, ‘;’, ‘asm’ or ‘__attribute__’ before ‘*’ token
./include/wx/strconv.h:270: error: expected ‘=’, ‘,’, ‘;’, ‘asm’ or ‘__attribute__’ before ‘&’ token
./include/wx/strconv.h:281: error: expected ‘=’, ‘,’, ‘;’, ‘asm’ or ‘__attribute__’ before ‘wxMBConvUTF16’
./include/wx/strconv.h:282: error: expected ‘=’, ‘,’, ‘;’, ‘asm’ or ‘__attribute__’ before ‘wxMBConvUTF32’
In file included from ./include/wx/memory.h:20,
                 from ./include/wx/object.h:25,
                 from ./include/wx/wx.h:16,
                 from ./include/wx/wxprec.h:54:
./include/wx/string.h:58: error: expected ‘=’, ‘,’, ‘;’, ‘asm’ or ‘__attribute__’ before ‘wxString’
./include/wx/string.h:98: error: expected ‘=’, ‘,’, ‘;’, ‘asm’ or ‘__attribute__’ before ‘IsEmpty’
./include/wx/list.h:1098: error: expected ‘=’, ‘,’, ‘;’, ‘asm’ or ‘__attribute__’ before ‘*’ token
./include/wx/list.h:1099: error: expected ‘=’, ‘,’, ‘;’, ‘asm’ or ‘__attribute__’ before ‘*’ token
./include/wx/list.h:1100: error: expected ‘=’, ‘,’, ‘;’, ‘asm’ or ‘__attribute__’ before ‘*’ token
./include/wx/list.h:1106: error: expected ‘=’, ‘,’, ‘;’, ‘asm’ or ‘__attribute__’ before ‘:’ token
In file included from ./include/wx/memory.h:20,
                 from ./include/wx/object.h:25,
                 from ./include/wx/wx.h:16,
                 from ./include/wx/wxprec.h:54:
./include/wx/string.h:170:18: warning: string: No such file or directory
./include/wx/list.h:1121: warning: type defaults to ‘int’ in declaration of ‘wxObject’
./include/wx/list.h:1121: error: expected ‘;’, ‘,’ or ‘)’ before ‘*’ token
./include/wx/list.h:1121: error: expected ‘=’, ‘,’, ‘;’, ‘asm’ or ‘__attribute__’ before ‘wxObjectListNode’
./include/wx/string.h:217: error: expected ‘:’, ‘,’, ‘;’, ‘}’ or ‘__attribute__’ before ‘const’
./include/wx/string.h:246: error: expected ‘=’, ‘,’, ‘;’, ‘asm’ or ‘__attribute__’ before ‘wxStringBase’
./include/wx/list.h:1124: error: expected ‘=’, ‘,’, ‘;’, ‘asm’ or ‘__attribute__’ before ‘wxList’
./include/wx/list.h:1161: error: expected ‘=’, ‘,’, ‘;’, ‘asm’ or ‘__attribute__’ before ‘wxStringListNode’
./include/wx/list.h:1161: error: expected ‘=’, ‘,’, ‘;’, ‘asm’ or ‘__attribute__’ before ‘wxStringListBase’
./include/wx/list.h:1163: error: expected ‘=’, ‘,’, ‘;’, ‘asm’ or ‘__attribute__’ before ‘wxStringList’
In file included from ./include/wx/wx.h:19,
                 from ./include/wx/wxprec.h:54:
./include/wx/hash.h:56: error: expected ‘=’, ‘,’, ‘;’, ‘asm’ or ‘__attribute__’ before ‘wxHashTableBase’
./include/wx/hash.h:240: error: expected ‘=’, ‘,’, ‘;’, ‘asm’ or ‘__attribute__’ before ‘wxHashTableLong’
./include/wx/hash.h:278: error: expected ‘=’, ‘,’, ‘;’, ‘asm’ or ‘__attribute__’ before ‘wxStringHashTable’
./include/wx/hash.h:418: error: expected ‘=’, ‘,’, ‘;’, ‘asm’ or ‘__attribute__’ before ‘wxHashTable’
In file included from ./include/wx/wx.h:21,
                 from ./include/wx/wxprec.h:54:
./include/wx/intl.h:51: error: expected ‘=’, ‘,’, ‘;’, ‘asm’ or ‘__attribute__’ before ‘wxLocale’
./include/wx/intl.h:52: error: expected ‘=’, ‘,’, ‘;’, ‘asm’ or ‘__attribute__’ before ‘wxLanguageInfoArray’
./include/wx/intl.h:53: error: expected ‘=’, ‘,’, ‘;’, ‘asm’ or ‘__attribute__’ before ‘wxMsgCatalog’
./include/wx/intl.h:317: error: expected specifier-qualifier-list before ‘wxString’
./include/wx/intl.h:368: error: expected ‘=’, ‘,’, ‘;’, ‘asm’ or ‘__attribute__’ before ‘wxLocale’
./include/wx/intl.h:552: error: expected ‘=’, ‘,’, ‘;’, ‘asm’ or ‘__attribute__’ before ‘*’ token
./include/wx/intl.h: In function ‘wxGetTranslation’:
./include/wx/intl.h:557: error: ‘wxLocale’ undeclared (first use in this function)
./include/wx/intl.h:557: error: (Each undeclared identifier is reported only once
./include/wx/intl.h:557: error: for each function it appears in.)
./include/wx/intl.h:557: error: ‘pLoc’ undeclared (first use in this function)
./include/wx/intl.h:557: warning: implicit declaration of function ‘wxGetLocale’
./include/wx/intl.h: At top level:
./include/wx/intl.h:565: error: conflicting types for ‘wxGetTranslation’
./include/wx/intl.h:556: error: previous definition of ‘wxGetTranslation’ was here
./include/wx/intl.h: In function ‘wxGetTranslation’:
./include/wx/intl.h:566: error: ‘wxLocale’ undeclared (first use in this function)
./include/wx/intl.h:566: error: ‘pLoc’ undeclared (first use in this function)
In file included from ./include/wx/string.h:1291,
                 from ./include/wx/memory.h:20,
                 from ./include/wx/object.h:25,
                 from ./include/wx/wx.h:16,
                 from ./include/wx/wxprec.h:54:
./include/wx/arrstr.h:18: error: expected ‘)’ before ‘*’ token
./include/wx/arrstr.h:19: error: expected ‘)’ before ‘*’ token
./include/wx/arrstr.h:98: error: expected ‘=’, ‘,’, ‘;’, ‘asm’ or ‘__attribute__’ before ‘wxArrayString’
./include/wx/arrstr.h:336: error: expected ‘=’, ‘,’, ‘;’, ‘asm’ or ‘__attribute__’ before ‘wxSortedArrayString’
./include/wx/arrstr.h:349: error: expected ‘=’, ‘,’, ‘;’, ‘asm’ or ‘__attribute__’ before ‘wxCArrayString’
In file included from ./include/wx/memory.h:20,
                 from ./include/wx/object.h:25,
                 from ./include/wx/wx.h:16,
                 from ./include/wx/wxprec.h:54:
./include/wx/string.h:1299: error: expected ‘=’, ‘,’, ‘;’, ‘asm’ or ‘__attribute__’ before ‘&’ token
./include/wx/string.h:1364: error: expected ‘=’, ‘,’, ‘;’, ‘asm’ or ‘__attribute__’ before ‘wxStringBuffer’
./include/wx/string.h:1382: error: expected ‘=’, ‘,’, ‘;’, ‘asm’ or ‘__attribute__’ before ‘wxStringBufferLength’
./include/wx/string.h:1421: error: expected ‘=’, ‘,’, ‘;’, ‘asm’ or ‘__attribute__’ before ‘operator’
./include/wx/string.h:1423: error: expected ‘=’, ‘,’, ‘;’, ‘asm’ or ‘__attribute__’ before ‘operator’
./include/wx/string.h:1425: error: expected ‘=’, ‘,’, ‘;’, ‘asm’ or ‘__attribute__’ before ‘operator’
./include/wx/string.h:1427: error: expected ‘=’, ‘,’, ‘;’, ‘asm’ or ‘__attribute__’ before ‘operator’
./include/wx/string.h:1429: error: expected ‘=’, ‘,’, ‘;’, ‘asm’ or ‘__attribute__’ before ‘operator’
./include/wx/string.h:1431: error: expected ‘=’, ‘,’, ‘;’, ‘asm’ or ‘__attribute__’ before ‘operator’
./include/wx/string.h:1433: error: expected ‘=’, ‘,’, ‘;’, ‘asm’ or ‘__attribute__’ before ‘operator’
./include/wx/string.h:1435: error: expected ‘=’, ‘,’, ‘;’, ‘asm’ or ‘__attribute__’ before ‘operator’
./include/wx/string.h:1437: error: expected ‘=’, ‘,’, ‘;’, ‘asm’ or ‘__attribute__’ before ‘operator’
./include/wx/string.h:1439: error: expected ‘=’, ‘,’, ‘;’, ‘asm’ or ‘__attribute__’ before ‘operator’
In file included from ./include/wx/wx.h:22,
                 from ./include/wx/wxprec.h:54:
./include/wx/log.h: At top level:../include/wx/log.h:122: error: expected ‘=’, ‘,’, ‘;’, ‘asm’ or ‘__attribute__’ before ‘wxLog’
./include/wx/string.h:1443: error: expected ‘=’, ‘,’, ‘;’, ‘asm’ or ‘__attribute__’ before ‘operator’
./include/wx/string.h:1445: error: expected ‘=’, ‘,’, ‘;’, ‘asm’ or ‘__attribute__’ before ‘operator’
./include/wx/string.h:1447: error: expected ‘=’, ‘,’, ‘;’, ‘asm’ or ‘__attribute__’ before ‘operator’
./include/wx/string.h:1449: error: expected ‘=’, ‘,’, ‘;’, ‘asm’ or ‘__attribute__’ before ‘operator’
./include/wx/string.h:1451: error: expected ‘=’, ‘,’, ‘;’, ‘asm’ or ‘__attribute__’ before ‘operator’
./include/wx/string.h:1453: error: expected ‘=’, ‘,’, ‘;’, ‘asm’ or ‘__attribute__’ before ‘operator’
./include/wx/log.h:294: error: expected ‘=’, ‘,’, ‘;’, ‘asm’ or ‘__attribute__’ before ‘wxLogBuffer’./include/wx/string.h:1455: error: expected ‘=’, ‘,’, ‘;’, ‘asm’ or ‘__attribute__’ before ‘operator’
./include/wx/log.h:319: error: expected ‘=’, ‘,’, ‘;’, ‘asm’ or ‘__attribute__’ before ‘wxLogStderr’
./include/wx/string.h:1468: error: expected ‘=’, ‘,’, ‘;’, ‘asm’ or ‘__attribute__’ before ‘operator’
./include/wx/log.h:337: error: expected ‘=’, ‘,’, ‘;’, ‘asm’ or ‘__attribute__’ before ‘wxLogStream’
./include/wx/string.h:1472: error: expected ‘=’, ‘,’, ‘;’, ‘asm’ or ‘__attribute__’ before ‘operator’
./include/wx/string.h:1474: error: expected ‘=’, ‘,’, ‘;’, ‘asm’ or ‘__attribute__’ before ‘operator’
./include/wx/log.h:392: error: expected ‘=’, ‘,’, ‘;’, ‘asm’ or ‘__attribute__’ before ‘wxLogChain’
./include/wx/string.h:1484: error: expected ‘=’, ‘,’, ‘;’, ‘asm’ or ‘__attribute__’ before ‘operator’
./include/wx/string.h:1486: error: expected ‘=’, ‘,’, ‘;’, ‘asm’ or ‘__attribute__’ before ‘operator’
./include/wx/log.h:432: error: expected ‘=’, ‘,’, ‘;’, ‘asm’ or ‘__attribute__’ before ‘wxLogPassThrough’
./include/wx/string.h:1494: error: expected ‘=’, ‘,’, ‘;’, ‘asm’ or ‘__attribute__’ before ‘operator’
./include/wx/string.h:1495: error: expected ‘=’, ‘,’, ‘;’, ‘asm’ or ‘__attribute__’ before ‘operator’
./include/wx/string.h:1496: error: expected ‘=’, ‘,’, ‘;’, ‘asm’ or ‘__attribute__’ before ‘operator’
./include/wx/string.h:1497: error: expected ‘=’, ‘,’, ‘;’, ‘asm’ or ‘__attribute__’ before ‘operator’
In file included from ./include/wx/string.h:1508,
                 from ./include/wx/memory.h:20,
                 from ./include/wx/object.h:25,
                 from ./include/wx/wx.h:16,
                 from ./include/wx/wxprec.h:54:
./include/wx/iosfwrap.h:18:21: warning: ./include/wx/log.h:544: error: conflicting types for ‘wxVLogSysError’
./include/wx/log.h:540: error: previous declaration of ‘wxVLogSysError’ was here
iosfwd: No such file or directory./include/wx/log.h:540: error: previous declaration of ‘wxLogSysError’ was here
In file included from ./include/wx/memory.h:20,
                 from ./include/wx/object.h:25,
                 from ./include/wx/wx.h:16,
                 from ./include/wx/wxprec.h:54:
./include/wx/string.h:1510: error: expected ‘=’, ‘,’, ‘;’, ‘asm’ or ‘__attribute__’ before ‘:’ token
./include/wx/log.h: In function ‘wxVLogDebug’:../include/wx/log.h:564: error: parameter name omitted
./include/wx/log.h:564: error: parameter name omitted
./include/wx/log.h: In function ‘wxLogDebug’:
./include/wx/log.h:565: error: parameter name omitted
In file included from ./include/wx/memory.h:21,
                 from ./include/wx/object.h:25,
                 from ./include/wx/wx.h:16,
                 from ./include/wx/wxprec.h:54:
./include/wx/msgout.h:38: error: expected ‘=’, ‘,’, ‘;’, ‘asm’ or ‘__attribute__’ before ‘wxMessageOutput’
./include/wx/log.h: In function ‘wxVLogTrace’:
./include/wx/msgout.h:65: error: expected ‘=’, ‘./include/wx/log.h:566: error: parameter name omitted
./include/wx/log.h:566: error: parameter name omitted
./include/wx/msgout.h:79: error: expected ‘=’, ‘,’, ‘;’, ‘asm’ or ‘__attribute__’ before ‘wxMessageOutputStderr’
./include/wx/msgout.h:93: error: expected ‘=’,./include/wx/log.h:567: error: parameter name omitted
./include/wx/log.h:567: error: parameter name omitted
./include/wx/msgout.h:107: error: expected ‘=’, ‘,’, ‘;’, ‘asm’ or ‘__attribute__’ before ‘wxMessageOutputDebug’
./include/wx/log.h: At top level:
./include/wx/log.h:568: error: conflicting types for ‘wxVLogTrace’
./include/wx/log.h:566: error: previous definition of ‘wxVLogTrace’ was here
./include/wx/log.h: In function ‘wxVLogTrace’:
./include/wx/log.h:568: error: parameter name omitted
./include/wx/log.h:568: error: parameter name omitted
./include/wx/log.h:568: error: parameter name omitted
./include/wx/log.h: At top level:
./include/wx/log.h:569: error: conflicting types for ‘wxLogTrace’
./include/wx/log.h:567: error: previous definition of ‘wxLogTrace’ was here
./include/wx/log.h: In function ‘wxLogTrace’:
./include/wx/log.h:569: error: parameter name omitted
./include/wx/log.h:569: error: parameter name omitted
./include/wx/log.h: At top level:
./include/wx/log.h:575: warning: type defaults to ‘int’ in declaration of ‘wxString’
./include/wx/log.h:575: error: expected ‘;’, ‘,’ or ‘)’ before ‘&’ token
In file included from ./include/wx/wx.h:16,
                 from ./include/wx/wxprec.h:54:
./include/wx/object.h:27: error: expected ‘=’, ‘,’, ‘;’, ‘asm’ or ‘__attribute__’ before ‘wxObject’
./include/wx/object.h:50: error: expected ‘=’, ‘,’, ‘;’, ‘asm’ or ‘__attribute__’ before ‘wxClassInfo’./include/wx/log.h: In function ‘wxLogApiError’:../include/wx/log.h:600: error: parameter name omitted
./include/wx/object.h:52: error: expected ‘=’, â€
./include/wx/object.h:58: error: expected ‘=’, ‘,’, ‘;’, ‘asm’ or ‘__attribute__’ before ‘*’ token
./include/wx/log.h: In function ‘wxLogLastError’:
./include/wx/log.h:601: error: parameter name omitted
./include/wx/object.h:148: error: expected ‘=’, ‘,’, ‘;’, ‘asm’ or ‘__attribute__’ before ‘*’ token
./include/wx/object.h:151: error: expected ‘=’, ‘,’, ‘;’, ‘asm’ or ‘__attribute__’ before ‘:’ token
./include/wx/object.h:152: error: expected ‘=’, ‘,’, ‘;’, ‘asm’ or ‘__attribute__’ before ‘:’ token
./include/wx/object.h:400: error: expected ‘=’, ‘,’, ‘;’, ‘asm’ or ‘__attribute__’ before ‘wxObject’
./include/wx/object.h:505: error: expected ‘=’, ‘,’, ‘;’, ‘asm’ or ‘__attribute__’ before ‘wxObjectRefData’
./include/wx/object.h:520: error: expected ‘=’, ‘,’, ‘;’, ‘asm’ or ‘__attribute__’ before ‘*’ tokenIn file included from ./include/wx/clntdata.h:21,
                 from ./include/wx/event.h:28,
                 from ./include/wx/wx.h:23,
                 from ./include/wx/wxprec.h:54:
./include/wx/hashmap.h: At top level:
./include/wx/hashmap.h:55: error: expected specifier-qualifier-list before ‘_wxHashTable_NodeBase’
./include/wx/hashmap.h:65: error: expected ‘=’, ‘,’, ‘;’, ‘asm’ or ‘__attribute__’ before ‘_wxHashTableBase2’
In file included from ./include/wx/wx.h:17,
                 from ./include/wx/wxprec.h:54:
./include/wx/dynarray.h:72: error: expected identifier or ‘(’ before string constant
./include/wx/hashmap.h:440: error: expected ‘=’, ‘,’, ‘;’, ‘asm’ or ‘__attribute__’ before ‘never_grow’
./include/wx/hashmap.h:441: error: expected ‘=’, ‘,’, ‘;’, ‘asm’ or ‘__attribute__’ before ‘never_shrink’
./include/wx/hashmap.h:442: error: expected ‘=’, ‘,’, ‘;’, ‘asm’ or ‘__attribute__’ before ‘grow_lf70’
./include/wx/hashmap.h:483: error: expected ‘=’, ‘,’, ‘;’, ‘asm’ or ‘__attribute__’ before ‘wxIntegerHash’
./include/wx/hashmap.h:499: error: expected ‘=’, ‘,’, ‘;’, ‘asm’ or ‘__attribute__’ before ‘wxIntegerEqual’
./include/wx/hashmap.h:514: error: expected ‘=’, ‘,’, ‘;’, ‘asm’ or ‘__attribute__’ before ‘wxPointerHash’
./include/wx/hashmap.h:528: error: expected ‘=’, ‘,’, ‘;’, ‘asm’ or ‘__attribute__’ before ‘wxPointerEqual’
./include/wx/hashmap.h:538: error: expected ‘=’, ‘,’, ‘;’, ‘asm’ or ‘__attribute__’ before ‘wxStringHash’
./include/wx/hashmap.h:556: error: expected ‘=’, ‘,’, ‘;’, ‘asm’ or ‘__attribute__’ before ‘wxStringEqual’
./include/wx/hashmap.h:684: error: expected ‘=’, ‘,’, ‘;’, ‘asm’ or ‘__attribute__’ before ‘wxLongToLongHashMap_wxImplementation_Pair’
./include/wx/hashmap.h:684: error: expected ‘=’, ‘,’, ‘;’, ‘asm’ or ‘__attribute__’ before ‘wxLongToLongHashMap_wxImplementation_KeyEx’
./include/wx/hashmap.h:684: error: expected ‘=’, ‘,’, ‘;’, ‘asm’ or ‘__attribute__’ before ‘wxLongToLongHashMap_wxImplementation_HashTable’
./include/wx/dynarray.h:809: error: expected ‘=’, ‘,’, ‘;’, ‘asm’ or ‘__attribute__’ before ‘wxBaseArrayPtrVoid’
./include/wx/hashmap.h:684: error: expected ‘=’, ‘,’, ‘;’, ‘asm’ or ‘__attribute__’ before ‘wxLongToLongHashMap’
./include/wx/dynarray.h:811: error: expected ‘=’, ‘,’, ‘;’, ‘asm’ or ‘__attribute__’ before ‘wxBaseArrayShort’
In file included from ./include/wx/event.h:28,
                 from ./include/wx/wx.h:23,
                 from ./include/wx/wxprec.h:54:
./include/wx/clntdata.h:26: error: expected ‘=’, ‘,’, ‘;’, ‘asm’ or ‘__attribute__’ before ‘wxShadowObjectMethods_wxImplementation_Pair’
./include/wx/clntdata.h:26: error: expected ‘=’, ‘,’, ‘;’, ‘asm’ or ‘__attribute__’ before ‘wxShadowObjectMethods_wxImplementation_KeyEx’
./include/wx/dynarray.h:813: error: expected ‘=’, ‘,’, ‘;’, ‘asm’ or ‘__attribute__’ before ‘wxBaseArrayLong’
./include/wx/dynarray.h:814: error: expected ‘=’, ‘,’, ‘;’, ‘asm’ or ‘__attribute__’ before ‘wxBaseArraySizeT’
./include/wx/clntdata.h:26: error: expected ‘=’, ‘,’, ‘;’, ‘asm’ or ‘__attribute__’ before ‘wxShadowObjectMethods’
./include/wx/dynarray.h:815: error: expected ‘=’, ‘,’, ‘;’, ‘asm’ or ‘__attribute__’ before ‘wxBaseArrayDouble’
./include/wx/clntdata.h:31: error: expected ‘=’, ‘,’, ‘;’, ‘asm’ or ‘__attribute__’ before ‘wxShadowObjectFields_wxImplementation_Pair’
./include/wx/clntdata.h:31: error: expected ‘=’, ‘,’, ‘;’, ‘asm’ or ‘__attribute__’ before ‘wxShadowObjectFields_wxImplementation_KeyEx’
./include/wx/clntdata.h:31: error: expected ‘=’, ‘,’, ‘;’, ‘asm’ or ‘__attribute__’ before ‘wxShadowObjectFields_wxImplementation_HashTable’
./include/wx/clntdata.h:31: error: expected ‘=’, ‘,’, ‘;’, ‘asm’ or ‘__attribute__’ before ‘wxShadowObjectFields’
./include/wx/clntdata.h:37: error: expected ‘=’, ‘,’, ‘;’, ‘asm’ or ‘__attribute__’ before ‘wxShadowObject’
./include/wx/dynarray.h:963: error: ‘wxBaseArrayShort’ undeclared here (not in a function)
./include/wx/dynarray.h:963: error: expected ‘)’ before ‘:’ token
./include/wx/dynarray.h:963: error: bit-field ‘TypeTooBigToBeStoredInwxBaseArrayShort’ width not an integer constant
./include/wx/clntdata.h:105: error: expected ‘=’, ‘,’, ‘;’, ‘asm’ or ‘__attribute__’ before ‘wxClientData’
./include/wx/clntdata.h:112: error: expected ‘=’, ‘,’, ‘;’, ‘asm’ or ‘__attribute__’ before ‘wxStringClientData’
./include/wx/dynarray.h:963: error: expected ‘=’, ‘,’, ‘;’, ‘asm’ or ‘__attribute__’ before ‘wxArrayShort’
./include/wx/clntdata.h:133: error: expected ‘=’, ‘,’, ‘;’, ‘asm’ or ‘__attribute__’ before ‘wxClientDataContainer’
In file included from ./include/wx/clntdata.h:173,
                 from ./include/wx/event.h:28,
                 from ./include/wx/wx.h:23,
                 from ./include/wx/wxprec.h:54:
./include/wx/vector.h:16: error: expected ‘=’, ‘,’, ‘;’, ‘asm’ or ‘__attribute__’ before ‘wxVectorBase’
./include/wx/dynarray.h:964: error: ‘wxBaseArrayInt’ undeclared here (not in a function)
./include/wx/dynarray.h:964: error: expected ‘)’ before ‘:’ token
./include/wx/dynarray.h:964: error: bit-field ‘TypeTooBigToBeStoredInwxBaseArrayInt’ width not an integer constant
./include/wx/dynarray.h:964: error: expected ‘=’, ‘,’, ‘;’, ‘asm’ or ‘__attribute__’ before ‘wxArrayInt’
In file included from ./include/wx/event.h:28,
                 from ./include/wx/wx.h:23,
                 from ./include/wx/wxprec.h:54:
./include/wx/clntdata.h:177: error: expected specifier-qualifier-list before ‘wxClientDataDictionaryPair’
./include/wx/clntdata.h:183: error: expected ‘=’, ‘,’, ‘;’, ‘asm’ or ‘__attribute__’ before ‘wxClientDataDictionaryPairVector’
./include/wx/clntdata.h:195: error: expected ‘=’, ‘,’, ‘;’, ‘asm’ or ‘__attribute__’ before ‘wxClientDataDictionary’
./include/wx/dynarray.h:965: error: ‘wxBaseArrayLong’ undeclared here (not in a function)
./include/wx/dynarray.h:965: error: expected ‘)’ before ‘:’ token
./include/wx/dynarray.h:965: error: bit-field ‘TypeTooBigToBeStoredInwxBaseArrayLong’ width not an integer constant
./include/wx/dynarray.h:965: error: expected ‘=’, ‘,’, ‘;’, ‘asm’ or ‘__attribute__’ before ‘wxArrayLong’
In file included from ./include/wx/event.h:35,
                 from ./include/wx/wx.h:23,
                 from ./include/wx/wxprec.h:54:
./include/wx/thread.h:117: error: expected ‘=’, ‘,’, ‘;’, ‘asm’ or ‘__attribute__’ before ‘wxThreadHelper’
./include/wx/thread.h:118: error: expected ‘=’, ‘,’, ‘;’, ‘asm’ or ‘__attribute__’ before ‘wxConditionInternal’
./include/wx/thread.h:119: error: expected ‘=’, ‘,’, ‘;’, ‘asm’ or ‘__attribute__’ before ‘wxMutexInternal’
./include/wx/thread.h:120: error: expected ‘=’, ‘,’, ‘;’, ‘asm’ or ‘__attribute__’ before ‘wxSemaphoreInternal’
./include/wx/dynarray.h:966: error: ‘wxBaseArrayPtrVoid’ undeclared here (not in a function)
./include/wx/dynarray.h:966: error: expected ‘)’ before ‘:’ token
./include/wx/dynarray.h:966: error: bit-field ‘TypeTooBigToBeStoredInwxBaseArrayPtrVoid’ width not an integer constant
./include/wx/thread.h:175: error: expected ‘=’, ‘,’, ‘;’, ‘asm’ or ‘__attribute__’ before ‘wxMutexLocker’
./include/wx/dynarray.h:966: error: expected ‘=’, ‘,’, ‘;’, ‘asm’ or ‘__attribute__’ before ‘wxArrayPtrVoid’
./include/wx/thread.h:224: error: expected ‘=’, ‘,’, ‘;’, ‘asm’ or ‘__attribute__’ before ‘wxCriticalSection’
./include/wx/thread.h:273: error: expected ‘=’, ‘,’, ‘;’, ‘asm’ or ‘__attribute__’ before ‘:’ token
./include/wx/thread.h:274: error: expected ‘=’, ‘,’, ‘;’, ‘asm’ or ‘__attribute__’ before ‘:’ token
./include/wx/thread.h:276: error: expected ‘=’, ‘,’, ‘;’, ‘asm’ or ‘__attribute__’ before ‘:’ token
./include/wx/thread.h:277: error: expected ‘=’, ‘,’, ‘;’, ‘asm’ or ‘__attribute__’ before ‘:’ token
./include/wx/thread.h:285: error: expected ‘=’, ‘,’, ‘;’, ‘asm’ or ‘__attribute__’ before ‘wxCriticalSectionLocker’
./include/wx/thread.h:310: error: expected ‘=’, ‘,’, ‘;’, ‘asm’ or ‘__attribute__’ before ‘wxCondition’
./include/wx/thread.h:372: error: expected ‘=’, ‘,’, ‘;’, ‘asm’ or ‘__attribute__’ before ‘wxSemaphore’
./include/wx/thread.h:427: error: expected ‘=’, ‘,’, ‘;’, ‘asm’ or ‘__attribute__’ before ‘wxThread’
In file included from ./include/wx/wx.h:18,
                 from ./include/wx/wxprec.h:54:
./include/wx/list.h:57: error: expected identifier or ‘(’ before string constant
./include/wx/list.h:62: error: expected ‘=’, ‘,’, ‘;’, ‘asm’ or ‘__attribute__’ before ‘wxObjectListNode’
./include/wx/list.h:63: error: expected ‘=’, ‘,’, ‘;’, ‘asm’ or ‘__attribute__’ before ‘wxNode’
./include/wx/thread.h:592: error: expected ‘=’, ‘,’, ‘;’, ‘asm’ or ‘__attribute__’ before ‘wxThreadHelperThread’
./include/wx/thread.h:620: error: expected ‘=’, ‘,’, ‘;’, ‘asm’ or ‘__attribute__’ before ‘wxThreadHelper’
./include/wx/thread.h:662: error: expected ‘=’, ‘,’, ‘;’, ‘asm’ or ‘__attribute__’ before ‘:’ token
./include/wx/thread.h:685: error: expected ‘=’, ‘,’, ‘;’, ‘asm’ or ‘__attribute__’ before ‘wxIsMainThread’
./include/wx/thread.h:728: error: expected ‘=’, ‘,’, ‘;’, ‘asm’ or ‘__attribute__’ before ‘wxMutexGuiLocker’
In file included from ./include/wx/wx.h:23,
                 from ./include/wx/wxprec.h:54:
./include/wx/event.h:43: error: expected ‘=’, ‘,’, ‘;’, ‘asm’ or ‘__attribute__’ before ‘wxList’
./include/wx/event.h:52: error: expected ‘=’, ‘,’, ‘;’, ‘asm’ or ‘__attribute__’ before ‘wxEvtHandler’
./include/wx/list.h:350: error: expected ‘=’, ‘,’, ‘;’, ‘asm’ or ‘__attribute__’ before ‘wxListKey’
./include/wx/list.h:391: error: expected ‘=’, ‘,’, ‘;’, ‘asm’ or ‘__attribute__’ before ‘wxDefaultListKey’
./include/wx/list.h:393: error: expected ‘=’, ‘,’, ‘;’, ‘asm’ or ‘__attribute__’ before ‘wxListBase’
./include/wx/list.h:395: error: expected ‘=’, ‘,’, ‘;’, ‘asm’ or ‘__attribute__’ before ‘wxNodeBase’
./include/wx/list.h:455: error: expected ‘=’, ‘,’, ‘;’, ‘asm’ or ‘__attribute__’ before ‘wxList’
./include/wx/list.h:457: error: expected ‘=’, ‘,’, ‘;’, ‘asm’ or ‘__attribute__’ before ‘wxListBase’
./include/wx/event.h:337: error: expected ‘=’, ‘,’, ‘;’, ‘asm’ or ‘__attribute__’ before ‘wxEvent’
./include/wx/event.h:433: error: expected ‘=’, ‘,’, ‘;’, ‘asm’ or ‘__attribute__’ before ‘wxPropagationDisabler’
./include/wx/event.h:456: error: expected ‘=’, ‘,’, ‘;’, ‘asm’ or ‘__attribute__’ before ‘wxPropagateOnce’
./include/wx/list.h:1098: error: expected ‘=’, ‘,’, ‘;’, ‘asm’ or ‘__attribute__’ before ‘*’ token
./include/wx/list.h:1099: error: expected ‘=’, ‘,’, ‘;’, ‘asm’ or ‘__attribute__’ before ‘*’ token
./include/wx/list.h:1100: error: expected ‘=’, ‘,’, ‘;’, ‘asm’ or ‘__attribute__’ before ‘*’ token
./include/wx/list.h:1106: error: expected ‘=’, ‘,’, ‘;’, ‘asm’ or ‘__attribute__’ before ‘:’ token
./include/wx/list.h:1107: error: expected ‘=’, ‘,’, ‘;’, ‘asm’ or ‘__attribute__’ before ‘*’ token
./include/wx/list.h:1108: error: expected ‘=’, ‘,’, ‘;’, ‘asm’ or ‘__attribute__’ before ‘*’ token
./include/wx/list.h:1109: error: expected ‘=’, ‘,’, ‘;’, ‘asm’ or ‘__attribute__’ before ‘*’ token
./include/wx/list.h:1110: error: expected ‘=’, ‘,’, ‘;’, ‘asm’ or ‘__attribute__’ before ‘:’ token
./include/wx/list.h:1121: warning: type defaults to ‘int’ in declaration of ‘wxObject’
./include/wx/list.h:1121: error: expected ‘;’, ‘,’ or ‘)’ before ‘*’ token
./include/wx/list.h:1121: error: expected ‘=’, ‘,’, ‘;’, ‘asm’ or ‘__attribute__’ before ‘wxObjectListNode’
./include/wx/list.h:1121: error: expected ‘=’, ‘,’, ‘;’, ‘asm’ or ‘__attribute__’ before ‘wxObjectList’
./include/wx/list.h:1124: error: expected ‘=’, ‘,’, ‘;’, ‘asm’ or ‘__attribute__’ before ‘wxList’
./include/wx/list.h:1161: error: expected ‘=’, ‘,’, ‘;’, ‘asm’ or ‘__attribute__’ before ‘wxStringListNode’
./include/wx/list.h:1161: error: expected ‘=’, ‘,’, ‘;’, ‘asm’ or ‘__attribute__’ before ‘wxStringListBase’
./include/wx/event.h:2128: error: expected ‘)’ before ‘:’ token
./include/wx/event.h:2153: error: expected specifier-qualifier-list before ‘private’
./include/wx/event.h:2185: error: expected identifier or ‘(’ before ‘:’ token
./include/wx/event.h:2206: error: expected identifier or ‘(’ before ‘:’ token
./include/wx/list.h:1163: error: expected ‘=’, ‘,’, ‘;’, ‘asm’ or ‘__attribute__’ before ‘wxStringList’
./include/wx/event.h:2236: error: expected ‘:’, ‘,’, ‘;’, ‘}’ or ‘__attribute__’ before ‘*’ token
./include/wx/event.h:2244: error: expected ‘=’, ‘,’, ‘;’, ‘asm’ or ‘__attribute__’ before ‘*’ token
./include/wx/event.h:2244: error: ‘_wxArraywxEventTableEntryPointerArray’ undeclared here (not in a function)
./include/wx/event.h:2244: error: expected ‘)’ before ‘:’ token
./include/wx/event.h:2244: error: bit-field ‘TypeTooBigToBeStoredInwxBaseArrayPtrVoid’ width not an integer constant
In file included from ./include/wx/wx.h:19,
                 from ./include/wx/wxprec.h:54:
./include/wx/hash.h:56: error: expected ‘=’, ‘,’, ‘;’, ‘asm’ or ‘__attribute__’ before ‘wxHashTableBase’
./include/wx/event.h:2244: error: expected ‘)’ before ‘*’ token
./include/wx/event.h:2244: error: expected ‘=’, ‘,’, ‘;’, ‘asm’ or ‘__attribute__’ before ‘wxEventTableEntryPointerArray’
./include/wx/hash.h:240: error: expected ‘=’, ‘,’, ‘;’, ‘asm’ or ‘__attribute__’ before ‘wxHashTableLong’
./include/wx/hash.h:278: error: expected ‘=’, ‘,’, ‘;’, ‘asm’ or ‘__attribute__’ before ‘wxStringHashTable’./include/wx/event.h:2246: error: expected ‘=’, ‘,’, ‘;’, ‘asm’ or ‘__attribute__’ before ‘wxEventHashTable’
./include/wx/event.h:2305: error: expected ‘=’, ‘,’, ‘;’, ‘asm’ or ‘__attribute__’ before ‘wxEvtHandler’
./include/wx/hash.h:418: error: expected ‘=’, ‘,’, ‘;’, ‘asm’ or ‘__attribute__’ before ‘wxHashTable’
./include/wx/event.h:2485: error: expected ‘)’ before ‘*’ token
./include/wx/event.h:2492: error: expected ‘)’ before ‘:’ token
In file included from ./include/wx/wx.h:21,
                 from ./include/wx/wxprec.h:54:
./include/wx/intl.h:51: error: expected ‘=’, ‘,’, ‘;’, ‘asm’ or ‘__attribute__’ before ‘wxLocale’
./include/wx/intl.h:52: error: expected ‘=’, ‘,’, ‘;’, ‘asm’ or ‘__attribute__’ before ‘wxLanguageInfoArray’
./include/wx/intl.h:53: error: expected ‘=’, ‘,’, ‘;’, ‘asm’ or ‘__attribute__’ before ‘wxMsgCatalog’
./include/wx/intl.h:317: error: expected specifier-qualifier-list before ‘wxString’
./include/wx/intl.h:368: error: expected ‘=’, ‘,’, ‘;’, ‘asm’ or ‘__attribute__’ before ‘wxLocale’
./include/wx/event.h:2922: error: expected ‘=’, ‘,’, ‘;’, ‘asm’ or ‘__attribute__’ before ‘*’ token
./include/wx/event.h:2924: error: expected ‘=’, ‘,’, ‘;’, ‘asm’ or ‘__attribute__’ before ‘*’ token
./include/wx/intl.h:552: error: expected ‘=’, ‘,’, ‘;’, ‘asm’ or ‘__attribute__’ before ‘*’ token
./include/wx/intl.h: In function ‘wxGetTranslation’:
./include/wx/intl.h:557: error: ‘wxLocale’ undeclared (first use in this function)
./include/wx/intl.h:557: error: (Each undeclared identifier is reported only once
./include/wx/intl.h:557: error: for each function it appears in.)
./include/wx/intl.h:557: error: ‘pLoc’ undeclared (first use in this function)
./include/wx/intl.h:557: warning: implicit declaration of function ‘wxGetLocale’
./include/wx/intl.h: At top level:
./include/wx/intl.h:565: error: conflicting types for ‘wxGetTranslation’
./include/wx/intl.h:556: error: previous definition of ‘wxGetTranslation’ was here
./include/wx/intl.h: In function ‘wxGetTranslation’:
./include/wx/intl.h:566: error: ‘wxLocale’ undeclared (first use in this function)./include/wx/init.h:45: error: expected ‘;’, ‘,’ or ‘)’ before ‘&’ token./include/wx/intl.h:566: error: ‘pLoc’ undeclared (first use in this function)
./include/wx/init.h:63: error: expected ‘=’, ‘,’, ‘;’, ‘asm’ or ‘__attribute__’ before ‘wxInitialize’
./include/wx/init.h:71: error: expected ‘=’, ‘,’, ‘;’, ‘asm’ or ‘__attribute__’ before ‘wxInitializer’
In file included from ./include/wx/wx.h:24,
                 from ./include/wx/wxprec.h:54:
./include/wx/app.h:31: error: expected ‘=’, ‘,’, ‘;’, ‘asm’ or ‘__attribute__’ before ‘wxAppConsole’
./include/wx/app.h:32: error: expected ‘=’, ‘,’, ‘;’, ‘asm’ or ‘__attribute__’ before ‘wxAppTraits’
./include/wx/app.h:33: error: expected ‘=’, ‘,’, ‘;’, ‘asm’ or ‘__attribute__’ before ‘wxCmdLineParser’
./include/wx/app.h:34: error: expected ‘=’, ‘,’, ‘;’, ‘asm’ or ‘__attribute__’ before ‘wxLog’
./include/wx/app.h:35: error: expected ‘=’, ‘,’, ‘;’, ‘asm’ or ‘__attribute__’ before ‘wxMessageOutput’
./include/wx/app.h:44: error: expected ‘=’, ‘,’, ‘;’, ‘asm’ or ‘__attribute__’ before ‘wxEventLoop’
./include/wx/app.h:52: error: expected ‘=’, ‘,’, ‘;’, ‘asm’ or ‘__attribute__’ before ‘*’ token
./include/wx/app.h:68: error: expected ‘=’, ‘,’, ‘;’, ‘asm’ or ‘__attribute__’ before ‘wxAppConsole’
./include/wx/app.h:582: error: expected ‘=’, ‘,’, ‘;’, ‘asm’ or ‘__attribute__’ before ‘wxApp’
./include/wx/app.h:611: error: expected ‘=’, ‘,’, ‘;’, ‘asm’ or ‘__attribute__’ before ‘wxYield’
./include/wx/app.h:624: error: expected ‘=’, ‘,’, ‘;’, ‘asm’ or ‘__attribute__’ before ‘wxAppInitializer’
In file included from ./include/wx/wx.h:22,
                 from ./include/wx/wxprec.h:54:
./include/wx/log.h: At top level:
./include/wx/log.h:76: error: expected ‘=’, ‘,’, ‘;’, ‘asm’ or ‘__attribute__’ before ‘wxTextCtrl’
./include/wx/log.h:77: error: expected ‘=’, ‘,’, ‘;’, ‘asm’ or ‘__attribute__’ before ‘wxLogFrame’
./include/wx/log.h:78: error: expected ‘=’, ‘,’, ‘;’, ‘asm’ or ‘__attribute__’ before ‘wxFrame’
./include/wx/log.h:79: error: expected ‘=’, ‘,’, ‘;’, ‘asm’ or ‘__attribute__’ before ‘wxWindow’
In file included from ./include/wx/wx.h:22,
                 from ./include/wx/wxprec.h:54:
./include/wx/log.h:122: error: expected ‘=’, ‘,’, ‘;’, ‘asm’ or ‘__attribute__’ before ‘wxLog’
./include/wx/log.h:294: error: expected ‘=’, ‘,’, ‘;’, ‘asm’ or ‘__attribute__’ before ‘wxLogBuffer’
./include/wx/log.h:319: error: expected ‘=’, ‘,’, ‘;’, ‘asm’ or ‘__attribute__’ before ‘wxLogStderr’
./include/wx/log.h:337: error: expected ‘=’, ‘,’, ‘;’, ‘asm’ or ‘__attribute__’ before ‘wxLogStream’
./include/wx/log.h:373: error: expected ‘=’, ‘,’, ‘;’, ‘asm’ or ‘__attribute__’ before ‘wxLogNull’
./include/wx/log.h:392: error: expected ‘=’, ‘,’, ‘;’, ‘asm’ or ‘__attribute__’ before ‘wxLogChain’
./include/wx/log.h:432: error: expected ‘=’, ‘,’, ‘;’, ‘asm’ or ‘__attribute__’ before ‘wxLogPassThrough’
In file included from ./include/wx/log.h:443,
                 from ./include/wx/wx.h:22,
                 from ./include/wx/wxprec.h:54:
./include/wx/generic/logg.h:30: error: expected ‘=’, ‘,’, ‘;’, ‘asm’ or ‘__attribute__’ before ‘wxLogTextCtrl’
./include/wx/generic/logg.h:53: error: expected ‘=’, ‘,’, ‘;’, ‘asm’ or ‘__attribute__’ before ‘wxLogGui’
./include/wx/generic/logg.h:88: error: expected ‘=’, ‘,’, ‘;’, ‘asm’ or ‘__attribute__’ before ‘wxLogWindow’
In file included from ./include/wx/wx.h:22,
                 from ./include/wx/wxprec.h:54:
./include/wx/log.h:463: error: expected ‘;’, ‘,’ or ‘)’ before ‘=’ token
./include/wx/log.h:533: error: expected ‘=’, ‘,’, ‘;’, ‘asm’ or ‘__attribute__’ before ‘wxFrame’
./include/wx/log.h:535: error: expected ‘)’ before ‘*’ token
./include/wx/log.h:535: error: expected ‘)’ before ‘*’ token
./include/wx/log.h:544: error: conflicting types for ‘wxVLogSysError’
./include/wx/log.h:540: error: previous declaration of ‘wxVLogSysError’ was here
./include/wx/log.h:544: error: conflicting types for ‘wxLogSysError’
./include/wx/log.h:540: error: previous declaration of ‘wxLogSysError’ was here
./include/wx/log.h: In function ‘wxVLogDebug’:
./include/wx/log.h:564: error: parameter name omitted
./include/wx/log.h:564: error: parameter name omitted
./include/wx/log.h: In function ‘wxLogDebug’:
./include/wx/log.h:565: error: parameter name omitted
./include/wx/log.h: In function ‘wxVLogTrace’:
./include/wx/log.h:566: error: parameter name omitted
./include/wx/log.h:566: error: parameter name omitted
./include/wx/log.h:566: error: parameter name omitted
./include/wx/log.h: In function ‘wxLogTrace’:
./include/wx/log.h:567: error: parameter name omitted
./include/wx/log.h:567: error: parameter name omitted
./include/wx/log.h: At top level:
./include/wx/log.h:568: error: conflicting types for ‘wxVLogTrace’
./include/wx/log.h:566: error: previous definition of ‘wxVLogTrace’ was here
./include/wx/log.h: In function ‘wxVLogTrace’:
./include/wx/log.h:568: error: parameter name omitted
./include/wx/log.h:568: error: parameter name omitted
./include/wx/log.h:568: error: parameter name omitted
./include/wx/log.h: At top level:
./include/wx/log.h:569: error: conflicting types for ‘wxLogTrace’
./include/wx/log.h:567: error: previous definition of ‘wxLogTrace’ was here
./include/wx/log.h: In function ‘wxLogTrace’:
./include/wx/log.h:569: error: parameter name omitted
./include/wx/log.h:569: error: parameter name omitted
./include/wx/log.h: At top level:
./include/wx/log.h:575: warning: type defaults to ‘int’ in declaration of ‘wxString’
./include/wx/log.h:575: error: expected ‘;’, ‘,’ or ‘)’ before ‘&’ token
./include/wx/log.h: In function ‘wxLogApiError’:
./include/wx/log.h:600: error: parameter name omitted
./include/wx/log.h:600: error: parameter name omitted
./include/wx/log.h: In function ‘wxLogLastError’:
./include/wx/log.h:601: error: parameter name omitted
In file included from ./include/wx/clntdata.h:21,
                 from ./include/wx/event.h:28,
                 from ./include/wx/wx.h:23,
                 from ./include/wx/wxprec.h:54:
./include/wx/hashmap.h: At top level:
./include/wx/hashmap.h:55: error: expected specifier-qualifier-list before ‘_wxHashTable_NodeBase’
./include/wx/hashmap.h:65: error: expected ‘=’, ‘,’, ‘;’, ‘asm’ or ‘__attribute__’ before ‘_wxHashTableBase2’
./include/wx/hashmap.h:440: error: expected ‘=’, ‘,’, ‘;’, ‘asm’ or ‘__attribute__’ before ‘never_grow’
./include/wx/hashmap.h:441: error: expected ‘=’, ‘,’, ‘;’, ‘asm’ or ‘__attribute__’ before ‘never_shrink’
./include/wx/hashmap.h:442: error: expected ‘=’, ‘,’, ‘;’, ‘asm’ or ‘__attribute__’ before ‘grow_lf70’
./include/wx/hashmap.h:483: error: expected ‘=’, ‘,’, ‘;’, ‘asm’ or ‘__attribute__’ before ‘wxIntegerHash’
./include/wx/hashmap.h:499: error: expected ‘=’, ‘,’, ‘;’, ‘asm’ or ‘__attribute__’ before ‘wxIntegerEqual’
./include/wx/hashmap.h:514: error: expected ‘=’, ‘,’, ‘;’, ‘asm’ or ‘__attribute__’ before ‘wxPointerHash’
./include/wx/hashmap.h:528: error: expected ‘=’, ‘,’, ‘;’, ‘asm’ or ‘__attribute__’ before ‘wxPointerEqual’
./include/wx/hashmap.h:538: error: expected ‘=’, ‘,’, ‘;’, ‘asm’ or ‘__attribute__’ before ‘wxStringHash’
./include/wx/hashmap.h:556: error: expected ‘=’, ‘,’, ‘;’, ‘asm’ or ‘__attribute__’ before ‘wxStringEqual’
./include/wx/hashmap.h:684: error: expected ‘=’, ‘,’, ‘;’, ‘asm’ or ‘__attribute__’ before ‘wxLongToLongHashMap_wxImplementation_Pair’
./include/wx/hashmap.h:684: error: expected ‘=’, ‘,’, ‘;’, ‘asm’ or ‘__attribute__’ before ‘wxLongToLongHashMap_wxImplementation_KeyEx’
./include/wx/hashmap.h:684: error: expected ‘=’, ‘,’, ‘;’, ‘asm’ or ‘__attribute__’ before ‘wxLongToLongHashMap_wxImplementation_HashTable’
./include/wx/hashmap.h:684: error: expected ‘=’, ‘,’, ‘;’, ‘asm’ or ‘__attribute__’ before ‘wxLongToLongHashMap’
In file included from ./include/wx/event.h:28,
                 from ./include/wx/wx.h:23,
                 from ./include/wx/wxprec.h:54:
./include/wx/clntdata.h:26: error: expected ‘=’, ‘,’, ‘;’, ‘asm’ or ‘__attribute__’ before ‘wxShadowObjectMethods_wxImplementation_Pair’
./include/wx/clntdata.h:26: error: expected ‘=’, ‘,’, ‘;’, ‘asm’ or ‘__attribute__’ before ‘wxShadowObjectMethods_wxImplementation_KeyEx’
./include/wx/clntdata.h:26: error: expected ‘=’, ‘,’, ‘;’, ‘asm’ or ‘__attribute__’ before ‘wxShadowObjectMethods_wxImplementation_HashTable’
./include/wx/clntdata.h:26: error: expected ‘=’, ‘,’, ‘;’, ‘asm’ or ‘__attribute__’ before ‘wxShadowObjectMethods’
./include/wx/clntdata.h:31: error: expected ‘=’, ‘,’, ‘;’, ‘asm’ or ‘__attribute__’ before ‘wxShadowObjectFields_wxImplementation_Pair’
./include/wx/clntdata.h:31: error: expected ‘=’, ‘,’, ‘;’, ‘asm’ or ‘__attribute__’ before ‘wxShadowObjectFields_wxImplementation_KeyEx’
./include/wx/clntdata.h:31: error: expected ‘=’, ‘,’, ‘;’, ‘asm’ or ‘__attribute__’ before ‘wxShadowObjectFields_wxImplementation_HashTable’
./include/wx/clntdata.h:31: error: expected ‘=’, ‘,’, ‘;’, ‘asm’ or ‘__attribute__’ before ‘wxShadowObjectFields’
./include/wx/clntdata.h:37: error: expected ‘=’, ‘,’, ‘;’, ‘asm’ or ‘__attribute__’ before ‘wxShadowObject’
./include/wx/clntdata.h:105: error: expected ‘=’, ‘,’, ‘;’, ‘asm’ or ‘__attribute__’ before ‘wxClientData’
./include/wx/clntdata.h:112: error: expected ‘=’, ‘,’, ‘;’, ‘asm’ or ‘__attribute__’ before ‘wxStringClientData’
./include/wx/clntdata.h:133: error: expected ‘=’, ‘,’, ‘;’, ‘asm’ or ‘__attribute__’ before ‘wxClientDataContainer’
In file included from ./include/wx/clntdata.h:173,
                 from ./include/wx/event.h:28,
                 from ./include/wx/wx.h:23,
                 from ./include/wx/wxprec.h:54:
./include/wx/vector.h:16: error: expected ‘=’, ‘,’, ‘;’, ‘asm’ or ‘__attribute__’ before ‘wxVectorBase’
In file included from ./include/wx/event.h:28,
                 from ./include/wx/wx.h:23,
                 from ./include/wx/wxprec.h:54:
./include/wx/clntdata.h:177: error: expected specifier-qualifier-list before ‘wxClientDataDictionaryPair’
./include/wx/clntdata.h:183: error: expected ‘=’, ‘,’, ‘;’, ‘asm’ or ‘__attribute__’ before ‘wxClientDataDictionaryPairVector’
./include/wx/clntdata.h:195: error: expected ‘=’, ‘,’, ‘;’, ‘asm’ or ‘__attribute__’ before ‘wxClientDataDictionary’
In file included from ./include/wx/event.h:31,
                 from ./include/wx/wx.h:23,
                 from ./include/wx/wxprec.h:54:
./include/wx/gdicmn.h:33: error: expected ‘=’, ‘,’, ‘;’, ‘asm’ or ‘__attribute__’ before ‘wxBitmap’
./include/wx/gdicmn.h:34: error: expected ‘=’, ‘,’, ‘;’, ‘asm’ or ‘__attribute__’ before ‘wxBrush’
./include/wx/gdicmn.h:35: error: expected ‘=’, ‘,’, ‘;’, ‘asm’ or ‘__attribute__’ before ‘wxColour’
./include/wx/gdicmn.h:36: error: expected ‘=’, ‘,’, ‘;’, ‘asm’ or ‘__attribute__’ before ‘wxCursor’
./include/wx/gdicmn.h:37: error: expected ‘=’, ‘,’, ‘;’, ‘asm’ or ‘__attribute__’ before ‘wxFont’
./include/wx/gdicmn.h:38: error: expected ‘=’, ‘,’, ‘;’, ‘asm’ or ‘__attribute__’ before ‘wxIcon’
./include/wx/gdicmn.h:39: error: expected ‘=’, ‘,’, ‘;’, ‘asm’ or ‘__attribute__’ before ‘wxPalette’
./include/wx/gdicmn.h:40: error: expected ‘=’, ‘,’, ‘;’, ‘asm’ or ‘__attribute__’ before ‘wxPen’
./include/wx/gdicmn.h:41: error: expected ‘=’, ‘,’, ‘;’, ‘asm’ or ‘__attribute__’ before ‘wxRegion’
./include/wx/gdicmn.h:42: error: expected ‘=’, ‘,’, ‘;’, ‘asm’ or ‘__attribute__’ before ‘wxString’
./include/wx/gdicmn.h:205: error: expected ‘=’, ‘,’, ‘;’, ‘asm’ or ‘__attribute__’ before ‘wxSize’
./include/wx/gdicmn.h:264: error: expected ‘=’, ‘,’, ‘;’, ‘asm’ or ‘__attribute__’ before ‘wxRealPoint’
./include/wx/gdicmn.h:280: error: expected ‘=’, ‘,’, ‘;’, ‘asm’ or ‘__attribute__’ before ‘wxPoint’
./include/wx/gdicmn.h:312: error: expected ‘=’, ‘,’, ‘;’, ‘asm’ or ‘__attribute__’ before ‘wxRect’
./include/wx/gdicmn.h:440: error: expected ‘=’, ‘,’, ‘;’, ‘asm’ or ‘__attribute__’ before ‘wxPenList’
./include/wx/gdicmn.h:451: error: expected ‘=’, ‘,’, ‘;’, ‘asm’ or ‘__attribute__’ before ‘wxBrushList’
./include/wx/gdicmn.h:462: error: expected ‘=’, ‘,’, ‘;’, ‘asm’ or ‘__attribute__’ before ‘wxFontList’
./include/wx/gdicmn.h:476: error: expected ‘=’, ‘,’, ‘;’, ‘asm’ or ‘__attribute__’ before ‘wxStringToColourHashMap_wxImplementation_Pair’
./include/wx/gdicmn.h:476: error: expected ‘=’, ‘,’, ‘;’, ‘asm’ or ‘__attribute__’ before ‘wxStringToColourHashMap_wxImplementation_KeyEx’
./include/wx/gdicmn.h:476: error: expected ‘=’, ‘,’, ‘;’, ‘asm’ or ‘__attribute__’ before ‘wxStringToColourHashMap_wxImplementation_HashTable’
./include/wx/gdicmn.h:476: error: expected ‘=’, ‘,’, ‘;’, ‘asm’ or ‘__attribute__’ before ‘wxStringToColourHashMap’
./include/wx/gdicmn.h:478: error: expected ‘=’, ‘,’, ‘;’, ‘asm’ or ‘__attribute__’ before ‘wxColourDatabase’
./include/wx/gdicmn.h:509: error: expected ‘=’, ‘,’, ‘;’, ‘asm’ or ‘__attribute__’ before ‘wxBitmapList’
./include/wx/gdicmn.h:519: error: expected ‘=’, ‘,’, ‘;’, ‘asm’ or ‘__attribute__’ before ‘wxResourceCache’
./include/wx/gdicmn.h:534: error: expected ‘=’, ‘,’, ‘;’, ‘asm’ or ‘__attribute__’ before ‘*’ token
./include/wx/gdicmn.h:535: error: expected ‘=’, ‘,’, ‘;’, ‘asm’ or ‘__attribute__’ before ‘*’ token
./include/wx/gdicmn.h:536: error: expected ‘=’, ‘,’, ‘;’, ‘asm’ or ‘__attribute__’ before ‘*’ token
./include/wx/gdicmn.h:537: error: expected ‘=’, ‘,’, ‘;’, ‘asm’ or ‘__attribute__’ before ‘*’ token
./include/wx/gdicmn.h:540: error: expected ‘=’, ‘,’, ‘;’, ‘asm’ or ‘__attribute__’ before ‘*’ token
./include/wx/gdicmn.h:541: error: expected ‘=’, ‘,’, ‘;’, ‘asm’ or ‘__attribute__’ before ‘*’ token
./include/wx/gdicmn.h:542: error: expected ‘=’, ‘,’, ‘;’, ‘asm’ or ‘__attribute__’ before ‘*’ token
./include/wx/gdicmn.h:543: error: expected ‘=’, ‘,’, ‘;’, ‘asm’ or ‘__attribute__’ before ‘*’ token
./include/wx/gdicmn.h:545: error: expected ‘=’, ‘,’, ‘;’, ‘asm’ or ‘__attribute__’ before ‘*’ token
./include/wx/gdicmn.h:546: error: expected ‘=’, ‘,’, ‘;’, ‘asm’ or ‘__attribute__’ before ‘*’ token
./include/wx/gdicmn.h:547: error: expected ‘=’, ‘,’, ‘;’, ‘asm’ or ‘__attribute__’ before ‘*’ token
./include/wx/gdicmn.h:548: error: expected ‘=’, ‘,’, ‘;’, ‘asm’ or ‘__attribute__’ before ‘*’ token
./include/wx/gdicmn.h:549: error: expected ‘=’, ‘,’, ‘;’, ‘asm’ or ‘__attribute__’ before ‘*’ token
./include/wx/gdicmn.h:550: error: expected ‘=’, ‘,’, ‘;’, ‘asm’ or ‘__attribute__’ before ‘*’ token
./include/wx/gdicmn.h:551: error: expected ‘=’, ‘,’, ‘;’, ‘asm’ or ‘__attribute__’ before ‘*’ token
./include/wx/gdicmn.h:552: error: expected ‘=’, ‘,’, ‘;’, ‘asm’ or ‘__attribute__’ before ‘*’ token
./include/wx/gdicmn.h:553: error: expected ‘=’, ‘,’, ‘;’, ‘asm’ or ‘__attribute__’ before ‘*’ token
./include/wx/gdicmn.h:554: error: expected ‘=’, ‘,’, ‘;’, ‘asm’ or ‘__attribute__’ before ‘*’ token
./include/wx/gdicmn.h:556: error: expected ‘=’, ‘,’, ‘;’, ‘asm’ or ‘__attribute__’ before ‘*’ token
./include/wx/gdicmn.h:557: error: expected ‘=’, ‘,’, ‘;’, ‘asm’ or ‘__attribute__’ before ‘*’ token
./include/wx/gdicmn.h:558: error: expected ‘=’, ‘,’, ‘;’, ‘asm’ or ‘__attribute__’ before ‘*’ token
./include/wx/gdicmn.h:559: error: expected ‘=’, ‘,’, ‘;’, ‘asm’ or ‘__attribute__’ before ‘*’ token
./include/wx/gdicmn.h:560: error: expected ‘=’, ‘,’, ‘;’, ‘asm’ or ‘__attribute__’ before ‘*’ token
./include/wx/gdicmn.h:561: error: expected ‘=’, ‘,’, ‘;’, ‘asm’ or ‘__attribute__’ before ‘*’ token
./include/wx/gdicmn.h:562: error: expected ‘=’, ‘,’, ‘;’, ‘asm’ or ‘__attribute__’ before ‘*’ token
./include/wx/gdicmn.h:563: error: expected ‘=’, ‘,’, ‘;’, ‘asm’ or ‘__attribute__’ before ‘*’ token
./include/wx/gdicmn.h:564: error: expected ‘=’, ‘,’, ‘;’, ‘asm’ or ‘__attribute__’ before ‘*’ token
./include/wx/gdicmn.h:565: error: expected ‘=’, ‘,’, ‘;’, ‘asm’ or ‘__attribute__’ before ‘*’ token
./include/wx/gdicmn.h:567: error: expected ‘=’, ‘,’, ‘;’, ‘asm’ or ‘__attribute__’ before ‘*’ token
./include/wx/gdicmn.h:568: error: expected ‘=’, ‘,’, ‘;’, ‘asm’ or ‘__attribute__’ before ‘*’ token
./include/wx/gdicmn.h:569: error: expected ‘=’, ‘,’, ‘;’, ‘asm’ or ‘__attribute__’ before ‘*’ token
./include/wx/gdicmn.h:570: error: expected ‘=’, ‘,’, ‘;’, ‘asm’ or ‘__attribute__’ before ‘*’ token
./include/wx/gdicmn.h:571: error: expected ‘=’, ‘,’, ‘;’, ‘asm’ or ‘__attribute__’ before ‘*’ token
./include/wx/gdicmn.h:572: error: expected ‘=’, ‘,’, ‘;’, ‘asm’ or ‘__attribute__’ before ‘*’ token
./include/wx/gdicmn.h:573: error: expected ‘=’, ‘,’, ‘;’, ‘asm’ or ‘__attribute__’ before ‘*’ token
./include/wx/gdicmn.h:576: error: expected ‘=’, ‘,’, ‘;’, ‘asm’ or ‘__attribute__’ before ‘wxNullBitmap’
./include/wx/gdicmn.h:577: error: expected ‘=’, ‘,’, ‘;’, ‘asm’ or ‘__attribute__’ before ‘wxNullIcon’
./include/wx/gdicmn.h:578: error: expected ‘=’, ‘,’, ‘;’, ‘asm’ or ‘__attribute__’ before ‘wxNullCursor’
./include/wx/gdicmn.h:579: error: expected ‘=’, ‘,’, ‘;’, ‘asm’ or ‘__attribute__’ before ‘wxNullPen’
./include/wx/gdicmn.h:580: error: expected ‘=’, ‘,’, ‘;’, ‘asm’ or ‘__attribute__’ before ‘wxNullBrush’
./include/wx/gdicmn.h:581: error: expected ‘=’, ‘,’, ‘;’, ‘asm’ or ‘__attribute__’ before ‘wxNullPalette’
./include/wx/gdicmn.h:582: error: expected ‘=’, ‘,’, ‘;’, ‘asm’ or ‘__attribute__’ before ‘wxNullFont’
./include/wx/gdicmn.h:583: error: expected ‘=’, ‘,’, ‘;’, ‘asm’ or ‘__attribute__’ before ‘wxNullColour’
./include/wx/gdicmn.h:586: error: expected ‘=’, ‘,’, ‘;’, ‘asm’ or ‘__attribute__’ before ‘*’ token
./include/wx/gdicmn.h:587: error: expected ‘=’, ‘,’, ‘;’, ‘asm’ or ‘__attribute__’ before ‘*’ token
./include/wx/gdicmn.h:588: error: expected ‘=’, ‘,’, ‘;’, ‘asm’ or ‘__attribute__’ before ‘*’ token
./include/wx/gdicmn.h:590: error: expected ‘=’, ‘,’, ‘;’, ‘asm’ or ‘__attribute__’ before ‘*’ token
In file included from ./include/wx/utils.h:32,
                 from ./include/wx/wx.h:25,
                 from ./include/wx/wxpr./include/wx/gdicmn.h:595: error: expected ‘=’, ‘,’, ‘;’, ‘asm’ or ‘__attribute__’ before ‘wxDefaultPosition’
./include/wx/filefn.h:373: error: expected ‘=’, ‘,’, ‘;’, ‘asm’ or ‘__attribute__’ before ‘wxDirExists’./include/wx/gdicmn.h:598: error: expected ‘=’, ‘,’, ‘;’, ‘asm’ or ‘__attribute__’ before ‘wxPendingDelete’
./include/wx/filefn.h:375: error: expected ‘=’, ‘,’, ‘;’, ‘asm’ or ‘__attribute__’ before ‘wxIsAbsolutePath’
./include/wx/filefn.h:379: error: expected ‘=’, ‘,’, ‘;’, ‘asm’ or ‘__attribute__’ before ‘wxFileNameFromPath’
./include/wx/filefn.h:382: error: expected ‘=’, ‘,’, ‘;’, ‘asm’ or ‘__attribute__’ before ‘wxPathOnly’
./include/wx/filefn.h:385: error: expected ‘=’, ‘,’, ‘;’, ‘asm’ or ‘__attribute__’ before ‘wxRealPath’
./include/wx/filefn.h:393: error: expected ‘)’ before ‘&’ token
./include/wx/filefn.h:396: warning: type defaults to ‘int’ in declaration of ‘wxString’
./include/wx/filefn.h:396: error: expected ‘;’, ‘,’ or ‘)’ before ‘&’ token
./include/wx/gdicmn.h:619: error: expected ‘=’, ‘,’, ‘;’, ‘asm’ or ‘__attribute__’ before ‘wxGetDisplaySize’
./include/wx/filefn.h:401: error: expected ‘=’, ‘,’, ‘;’, ‘asm’ or ‘__attribute__’ before ‘wxExpandPath’
./include/wx/filefn.h:406: warning: type defaults to ‘int’ in declaration of ‘wxString’
./include/wx/filefn.h:406: error: expected ‘;’, ‘,’ or ‘)’ before ‘&’ token
./include/wx/filefn.h:414: warning: type defaults to ‘int’ in declaration of ‘wxString’
./include/wx/filefn.h:414: error: expected ‘;’, ‘,’ or ‘)’ before ‘&’ token
./include/wx/gdicmn.h:625: error: expected ‘=’, ‘,’, ‘;’, ‘asm’ or ‘__attribute__’ before ‘wxGetClientDisplay
./include/wx/filefn.h:421: error: expected ‘=’, ‘,’, ‘;’, ‘asm’ or ‘__attribute__’ before ‘wxFindNextFile’../include/wx/filefn.h:424: error: expected ‘=’, ‘,’, ‘;’, ‘asm’ or ‘__attribute__’ before ‘wxIsWild’
./include/wx/filefn.h:429: error: expected ‘=’, ‘,’, ‘;’, ‘asm’ or ‘__attribute__’ before ‘wxMatchWild’
./include/wx/filefn.h:432: error: expected ‘=’, ‘,’, ‘;’, ‘asm’ or ‘__attribute__’ before ‘wxConcatFiles’
./include/wx/filefn.h:435: error: expected ‘=’, ‘,’, ‘;’, ‘asm’ or ‘__attribute__’ before ‘wxCopyFile’
./include/wx/filefn.h:439: error: expected ‘=’, ‘,’, ‘;’, ‘asm’ or ‘__attribute__’ before ‘wxRemoveFile’
./include/wx/filefn.h:442: error: expected ‘=’, ‘,’, ‘;’, ‘asm’ or ‘__attribute__’ before ‘wxRenameFile’
./include/wx/filefn.h:449: error: expected ‘;’, ‘,’ or ‘)’ before ‘=’ token
./include/wx/filefn.h:452: error: expected ‘=’, ‘,’, ‘;’, ‘asm’ or ‘__attribute__’ before ‘wxGetCwd’
./include/wx/filefn.h:455: error: expected ‘=’, ‘,’, ‘;’, ‘asm’ or ‘__attribute__’ before ‘wxSetWorkingDirectory’
./include/wx/filefn.h:458: error: expected ‘=’, ‘,’, ‘;’, ‘asm’ or ‘__attribute__’ before ‘wxMkdir’
./include/wx/filefn.h:461: error: expected ‘=’, ‘,’, ‘;’, ‘asm’ or ‘__attribute__’ before ‘wxRmdir’
./include/wx/filefn.h:464: error: expected ‘=’, ‘,’, ‘;’, ‘asm’ or ‘__attribute__’ before ‘wxGetFileKind’
./include/wx/filefn.h:465: error: expected ‘=’, ‘,’, ‘;’, ‘asm’ or ‘__attribute__’ before ‘wxGetFileKind’
./include/wx/filefn.h:470: error: expected ‘=’, ‘,’, ‘;’, ‘asm’ or ‘__attribute__’ before ‘wxPathExists’
./include/wx/filefn.h:471: error: expected ‘=’, ‘,’, ‘;’, ‘asm’ or ‘__attribute__’ before ‘wxPathExists’
./include/wx/filefn.h:523: error: expected ‘=’, ‘,’, ‘;’, ‘asm’ or ‘__attribute__’ before ‘wxIsPathSeparator’
./include/wx/filefn.h:534: error: expected ‘=’, ‘,’, ‘;’, ‘asm’ or ‘__attribute__’ before ‘wxEndsWithPathSeparator’
./include/wx/filefn.h:539: error: expected declaration specifiers or ‘...’ before ‘wxString’
./include/wx/filefn.h:540: error: expected declaration specifiers or ‘...’ before ‘wxString’
./include/wx/filefn.h:541: error: expected declaration specifiers or ‘...’ before ‘wxString’
./include/wx/filefn.h:544: error: expected ‘=’, ‘,’, ‘;’, ‘asm’ or ‘__attribute__’ before ‘wxFindFileInPath’
./include/wx/filefn.h:548: error: expected ‘=’, ‘,’, ‘;’, ‘asm’ or ‘__attribute__’ before ‘wxGetOSDirectory’
./include/wx/filefn.h:551: warning: type defaults to ‘int’ in declaration of ‘wxString’
./include/wx/filefn.h:551: error: expected ‘;’, ‘,’ or ‘)’ before ‘&’ token
./include/wx/filefn.h:558: warning: type defaults to ‘int’ in declaration of ‘wxString’
./include/wx/filefn.h:558: error: expected ‘;’, ‘,’ or ‘)’ before ‘&’ token
./include/wx/filefn.h:567: error: expected ‘=’, ‘,’, ‘;’, ‘asm’ or ‘__attribute__’ before ‘wxUmaskChanger’
./include/wx/filefn.h:600: error: expected ‘=’, ‘,’, ‘;’, ‘asm’ or ‘__attribute__’ before ‘wxPathList’
In file included from ./include/wx/wx.h:25,
                 from ./include/wx/wxprec.h:54:
./include/wx/utils.h:34: error: expected ‘=’, ‘,’, ‘;’, ‘asm’ or ‘__attribute__’ before ‘wxArrayString’
In file included from ./include/wx/utils.h:38,
                 from ./include/wx/wx.h:25,
                 from ./include/wx/wxprec.h:54:
./include/wx/longlong.h:85: error: expected ‘=’, ‘,’, ‘;’, ‘asm’ or ‘__attribute__’ before ‘wxLongLongNative’
./include/wx/longlong.h:86: error: expected ‘=’, ‘,’, ‘;’, ‘asm’ or ‘__attribute__’ before ‘wxULongLongNative’
./include/wx/longlong.h:87: error: expected ‘=’, ‘,’, ‘;’, ‘asm’ or ‘__attribute__’ before ‘wxLongLong’
./include/wx/longlong.h:88: error: expected ‘=’, ‘,’, ‘;’, ‘asm’ or ‘__attribute__’ before ‘wxULongLong’
In file included from ./include/wx/utils.h:38,
                 from ./include/wx/wx.h:25,
                 from ./include/wx/wxprec.h:54:
./include/wx/longlong.h:103: error: expected ‘=’, ‘,’, ‘;’, ‘asm’ or ‘__attribute__’ before ‘wxLongLongNative’
./include/wx/longlong.h:321: error: expected ‘=’, ‘,’, ‘;’, ‘asm’ or ‘__attribute__’ before ‘wxULongLongNative’
./include/wx/longlong.h:912: error: expected ‘=’, ‘,’, ‘;’, ‘asm’ or ‘__attribute__’ before ‘operator’
./include/wx/longlong.h:913: error: expected ‘=’, ‘,’, ‘;’, ‘asm’ or ‘__attribute__’ before ‘operator’
./include/wx/longlong.h:914: error: expected ‘=’, ‘,’, ‘;’, ‘asm’ or ‘__attribute__’ before ‘operator’
./include/wx/longlong.h:915: error: expected ‘=’, ‘,’, ‘;’, ‘asm’ or ‘__attribute__’ before ‘operator’
./include/wx/longlong.h:916: error: expected ‘=’, ‘,’, ‘;’, ‘asm’ or ‘__attribute__’ before ‘operator’
./include/wx/longlong.h:917: error: expected ‘=’, ‘,’, ‘;’, ‘asm’ or ‘__attribute__’ before ‘operator’
./include/wx/longlong.h:919: error: expected ‘=’, ‘,’, ‘;’, ‘asm’ or ‘__attribute__’ before ‘operator’
./include/wx/longlong.h:920: error: expected ‘=’, ‘,’, ‘;’, ‘asm’ or ‘__attribute__’ before ‘operator’
./include/wx/longlong.h:925: error: expected ‘=’, ‘,’, ‘;’, ‘asm’ or ‘__attribute__’ before ‘operator’
./include/wx/longlong.h:926: error: expected ‘=’, ‘,’, ‘;’, ‘asm’ or ‘__attribute__’ before ‘operator’
./include/wx/longlong.h:927: error: expected ‘=’, ‘,’, ‘;’, ‘asm’ or ‘__attribute__’ before ‘operator’
./include/wx/longlong.h:928: error: expected ‘=’, ‘,’, ‘;’, ‘asm’ or ‘__attribute__’ before ‘operator’
./include/wx/longlong.h:929: error: expected ‘=’, ‘,’, ‘;’, ‘asm’ or ‘__attribute__’ before ‘operator’
./include/wx/longlong.h:930: error: expected ‘=’, ‘,’, ‘;’, ‘asm’ or ‘__attribute__’ before ‘operator’
./include/wx/longlong.h:932: error: expected ‘=’, ‘,’, ‘;’, ‘asm’ or ‘__attribute__’ before ‘operator’
./include/wx/longlong.h:934: error: expected ‘=’, ‘,’, ‘;’, ‘asm’ or ‘__attribute__’ before ‘operator’
In file included from ./include/wx/wx.h:25,
                 from ./include/wx/wxprec.h:54:
./include/wx/utils.h:51: error: expected ‘=’, ‘,’, ‘;’, ‘asm’ or ‘__attribute__’ before ‘wxProcess’
./include/wx/utils.h:52: error: expected ‘=’, ‘,’, ‘;’, ‘asm’ or ‘__attribute__’ before ‘wxFrame’
./include/wx/utils.h:53: error: expected ‘=’, ‘,’, ‘;’, ‘asm’ or ‘__attribute__’ before ‘wxWindow’
./include/wx/utils.h:54: error: expected ‘=’, ‘,’, ‘;’, ‘asm’ or ‘__attribute__’ before ‘wxWindowList’
./include/wx/utils.h:55: error: expected ‘=’, ‘,’, ‘;’, ‘asm’ or ‘__attribute__’ before ‘wxPoint’
./include/wx/utils.h:101: error: expected ‘=’, ‘,’, ‘;’, ‘asm’ or ‘__attribute__’ before ‘wxGetOsDescription’
./include/wx/utils.h:104: error: expected ‘;’, ‘,’ or ‘)’ before ‘=’ token
./include/wx/utils.h:108: error: expected ‘=’, ‘,’, ‘;’, ‘asm’ or ‘__attribute__’ before ‘wxNow’
./include/wx/utils.h:113: error: expected ‘=’, ‘,’, ‘;’, ‘asm’ or ‘__attribute__’ before ‘wxGetDataDir’
./include/wx/utils.h:155: error: expected ‘;’, ‘,’ or ‘)’ before ‘=’ token
./include/wx/utils.h:157: error: expected ‘;’, ‘,’ or ‘)’ before ‘=’ token
./include/wx/utils.h:166: warning: type defaults to ‘int’ in declaration of ‘wxString’
./include/wx/utils.h:166: error: expected ‘;’, ‘,’ or ‘)’ before ‘&’ token
./include/wx/utils.h:170: error: expected ‘=’, ‘,’, ‘;’, ‘asm’ or ‘__attribute__’ before ‘wxDecToHex’
./include/wx/utils.h:206: error: expected ‘;’, ‘,’ or ‘)’ before ‘=’ token
./include/wx/utils.h:208: warning: type defaults to ‘int’ in declaration of ‘wxString’
./include/wx/utils.h:208: error: expected ‘;’, ‘,’ or ‘)’ before ‘&’ token
./include/wx/utils.h:213: warning: type defaults to ‘int’ in declaration of ‘wxString’
./include/wx/utils.h:213: error: expected ‘;’, ‘,’ or ‘)’ before ‘&’ token
./include/wx/utils.h:218: warning: type defaults to ‘int’ in declaration of ‘wxString’
./include/wx/utils.h:218: error: expected ‘;’, ‘,’ or ‘)’ before ‘&’ token
./include/wx/utils.h:268: error: expected ‘=’, ‘,’, ‘;’, ‘asm’ or ‘__attribute__’ before ‘wxShutdown’
./include/wx/utils.h:277: error: expected ‘=’, ‘,’, ‘;’, ‘asm’ or ‘__attribute__’ before ‘wxGetPowerType’
./include/wx/utils.h:288: error: expected ‘=’, ‘,’, ‘;’, ‘asm’ or ‘__attribute__’ before ‘wxGetBatteryState’
./include/wx/utils.h:295: error: expected declaration specifiers or ‘...’ before ‘wxSignal’
./include/wx/utils.h:296: error: expected declaration specifiers or ‘...’ before ‘wxKillError’
./include/wx/utils.h:297: error: expected ‘;’, ‘,’ or ‘)’ before ‘=’ token
./include/wx/utils.h:301: error: expected ‘=’, ‘,’, ‘;’, ‘asm’ or ‘__attribute__’ before ‘wxShell’
./include/wx/utils.h:305: error: expected ‘=’, ‘,’, ‘;’, ‘asm’ or ‘__attribute__’ before ‘wxShell’
./include/wx/utils.h:328: error: expected ‘=’, ‘,’, ‘;’, ‘asm’ or ‘__attribute__’ before ‘wxHandleFatalExceptions’
./include/wx/utils.h:334: error: expected ‘=’, ‘,’, ‘;’, ‘asm’ or ‘__attribute__’ before ‘wxLaunchDefaultBrowser’
./include/wx/utils.h:343: error: expected ‘=’, ‘,’, ‘;’, ‘asm’ or ‘__attribute__’ before ‘wxGetEnv’
./include/wx/utils.h:346: error: expected ‘=’, ‘,’, ‘;’, ‘asm’ or ‘__attribute__’ before ‘wxSetEnv’
./include/wx/utils.h:349: error: expected ‘=’, ‘,’, ‘;’, ‘asm’ or ‘__attribute__’ before ‘wxUnsetEnv’
./include/wx/utils.h:358: error: expected ‘=’, ‘,’, ‘;’, ‘asm’ or ‘__attribute__’ before ‘wxGetEmailAddress’
./include/wx/utils.h:359: error: expected ‘=’, ‘,’, ‘;’, ‘asm’ or ‘__attribute__’ before ‘wxGetEmailAddress’
./include/wx/utils.h:362: error: expected ‘=’, ‘,’, ‘;’, ‘asm’ or ‘__attribute__’ before ‘wxGetHostName’
./include/wx/utils.h:363: error: expected ‘=’, ‘,’, ‘;’, ‘asm’ or ‘__attribute__’ before ‘wxGetHostName’
./include/wx/utils.h:366: error: expected ‘=’, ‘,’, ‘;’, ‘asm’ or ‘__attribute__’ before ‘wxGetFullHostName’
./include/wx/utils.h:367: error: expected ‘=’, ‘,’, ‘;’, ‘asm’ or ‘__attribute__’ before ‘wxGetFullHostName’
./include/wx/utils.h:370: error: expected ‘=’, ‘,’, ‘;’, ‘asm’ or ‘__attribute__’ before ‘wxGetUserId’
./include/wx/utils.h:371: error: expected ‘=’, ‘,’, ‘;’, ‘asm’ or ‘__attribute__’ before ‘wxGetUserId’
./include/wx/utils.h:374: error: expected ‘=’, ‘,’, ‘;’, ‘asm’ or ‘__attribute__’ before ‘wxGetUserName’
./include/wx/utils.h:375: error: expected ‘=’, ‘,’, ‘;’, ‘asm’ or ‘__attribute__’ before ‘wxGetUserName’
./include/wx/utils.h:378: error: expected ‘=’, ‘,’, ‘;’, ‘asm’ or ‘__attribute__’ before ‘wxGetHomeDir’
./include/wx/utils.h:379: error: expected ‘)’ before ‘*’ token
./include/wx/utils.h:386: warning: type defaults to ‘int’ in declaration of ‘wxString’
./include/wx/utils.h:386: error: expected ‘;’, ‘,’ or ‘)’ before ‘&’ token
./include/wx/utils.h:390: error: expected ‘=’, ‘,’, ‘;’, ‘asm’ or ‘__attribute__’ before ‘wxGetDiskSpace’
./include/wx/utils.h:556: error: expected ‘=’, ‘,’, ‘;’, ‘asm’ or ‘__attribute__’ before ‘wxYield’
./include/wx/utils.h:559: error: expected ‘=’, ‘,’, ‘;’, ‘asm’ or ‘__attribute__’ before ‘wxYieldIfNeeded’
In file included from ./include/wx/string.h:55,
                 from ./include/wx/memory.h:20,
                 from ./include/wx/object.h:25,
                 from ./include/wx/wx.h:16,
                 from ./include/wx/wxprec.h:54:
./include/wx/buffer.h:96: error: expected ‘=’, ‘,’, ‘;’, ‘asm’ or ‘__attribute__’ before ‘wxCharBuffer’
./include/wx/buffer.h:100: error: expected ‘=’, ‘,’, ‘;’, ‘asm’ or ‘__attribute__’ before ‘wxWCharBuffer’
./include/wx/buffer.h:123: error: expected ‘=’, ‘,’, ‘;’, ‘asm’ or ‘__attribute__’ before ‘wxMemoryBufferData’
./include/wx/buffer.h:180: error: expected ‘=’, ‘,’, ‘;’, ‘asm’ or ‘__attribute__’ before ‘wxMemoryBuffer’
In file included from ./include/wx/string.h:56,
                 from ./include/wx/memory.h:20,
                 from ./include/wx/object.h:25,
                 from ./include/wx/wx.h:16,
                 from ./include/wx/wxprec.h:54:
./include/wx/strconv.h:39: error: expected ‘=’, ‘,’, ‘;’, ‘asm’ or ‘__attribute__’ before ‘wxMBConv’
./include/wx/strconv.h:82: error: expected ‘=’, ‘,’, ‘;’, ‘asm’ or ‘__attribute__’ before ‘wxMBConvLibc’
./include/wx/strconv.h:98: error: expected ‘=’, ‘,’, ‘;’, ‘asm’ or ‘__attribute__’ before ‘wxConvBrokenFileNames’
./include/wx/strconv.h:118: error: expected ‘=’, ‘,’, ‘;’, ‘asm’ or ‘__attribute__’ before ‘wxMBConvUTF7’
./include/wx/strconv.h:129: error: expected ‘=’, ‘,’, ‘;’, ‘asm’ or ‘__attribute__’ before ‘wxMBConvUTF8’
./include/wx/strconv.h:150: error: expected ‘=’, ‘,’, ‘;’, ‘asm’ or ‘__attribute__’ before ‘wxMBConvUTF16LE’
./include/wx/strconv.h:161: error: expected ‘=’, ‘,’, ‘;’, ‘asm’ or ‘__attribute__’ before ‘wxMBConvUTF16BE’
./include/wx/strconv.h:172: error: expected ‘=’, ‘,’, ‘;’, ‘asm’ or ‘__attribute__’ before ‘wxMBConvUTF32LE’
./include/wx/strconv.h:183: error: expected ‘=’, ‘,’, ‘;’, ‘asm’ or ‘__attribute__’ before ‘wxMBConvUTF32BE’
In file included from ./include/wx/string.h:56,
                 from ./include/wx/memory.h:20,
                 from ./include/wx/object.h:25,
                 from ./include/wx/wx.h:16,
                 from ./include/wx/wxprec.h:54:
./include/wx/strconv.h:196: error: expected ‘=’, ‘,’, ‘;’, ‘asm’ or ‘__attribute__’ before ‘wxCSConv’
./include/wx/strconv.h:246: error: expected ‘=’, ‘,’, ‘;’, ‘asm’ or ‘__attribute__’ before ‘&’ token
./include/wx/strconv.h:249: error: expected ‘=’, ‘,’, ‘;’, ‘asm’ or ‘__attribute__’ before ‘&’ token
./include/wx/strconv.h:250: error: expected ‘=’, ‘,’, ‘;’, ‘asm’ or ‘__attribute__’ before ‘&’ token
./include/wx/strconv.h:251: error: expected ‘=’, ‘,’, ‘;’, ‘asm’ or ‘__attribute__’ before ‘&’ token
./include/wx/strconv.h:260: error: expected ‘=’, ‘,’, ‘;’, ‘asm’ or ‘__attribute__’ before ‘*’ token
./include/wx/strconv.h:267: error: expected ‘=’, ‘,’, ‘;’, ‘asm’ or ‘__attribute__’ before ‘*’ token
./include/wx/strconv.h:270: error: expected ‘=’, ‘,’, ‘;’, ‘asm’ or ‘__attribute__’ before ‘&’ token
./include/wx/strconv.h:281: error: expected ‘=’, ‘,’, ‘;’, ‘asm’ or ‘__attribute__’ before ‘wxMBConvUTF16’
./include/wx/strconv.h:282: error: expected ‘=’, ‘,’, ‘;’, ‘asm’ or ‘__attribute__’ before ‘wxMBConvUTF32’
In file included from ./include/wx/memory.h:20,
                 from ./include/wx/object.h:25,
                 from ./include/wx/wx.h:16,
                 from ./include/wx/wxprec.h:54:
./include/wx/string.h:58: error: expected ‘=’, ‘,’, ‘;’, ‘asm’ or ‘__attribute__’ before ‘wxString’
./include/wx/string.h:98: error: expected ‘=’, ‘,’, ‘;’, ‘asm’ or ‘__attribute__’ before ‘IsEmpty’
In file included from ./include/wx/memory.h:20,
                 from ./include/wx/object.h:25,
                 from ./include/wx/wx.h:16,
                 from ./include/wx/wxprec.h:54:
./include/wx/string.h:170:18: warning: string: No such file or directory
In file included from ./include/wx/memory.h:20,
                 from ./include/wx/object.h:25,
                 from ./include/wx/wx.h:16,
                 from ./include/wx/wxprec.h:54:
./include/wx/string.h:180: error: expected ‘=’, ‘,’, ‘;’, ‘asm’ or ‘__attribute__’ before ‘:’ token
./include/wx/string.h:217: error: expected ‘:’, ‘,’, ‘;’, ‘}’ or ‘__attribute__’ before ‘const’
./include/wx/string.h:246: error: expected ‘=’, ‘,’, ‘;’, ‘asm’ or ‘__attribute__’ before ‘wxStringBase’
./include/wx/string.h:610: error: expected ‘=’, ‘,’, ‘;’, ‘asm’ or ‘__attribute__’ before ‘wxString’
In file included from ./include/wx/string.h:1291,
                 from ./include/wx/memory.h:20,
                 from ./include/wx/object.h:25,
                 from ./include/wx/wx.h:16,
                 from ./include/wx/wxprec.h:54:
./include/wx/arrstr.h:18: error: expected ‘)’ before ‘*’ token
./include/wx/arrstr.h:19: error: expected ‘)’ before ‘*’ token
./include/wx/arrstr.h:98: error: expected ‘=’, ‘,’, ‘;’, ‘asm’ or ‘__attribute__’ before ‘wxArrayString’
./include/wx/arrstr.h:336: error: expected ‘=’, ‘,’, ‘;’, ‘asm’ or ‘__attribute__’ before ‘wxSortedArrayString’
./include/wx/arrstr.h:349: error: expected ‘=’, ‘,’, ‘;’, ‘asm’ or ‘__attribute__’ before ‘wxCArrayString’
In file included from ./include/wx/memory.h:20,
                 from ./include/wx/object.h:25,
                 from ./include/wx/wx.h:16,
                 from ./include/wx/wxprec.h:54:
./include/wx/string.h:1299: error: expected ‘=’, ‘,’, ‘;’, ‘asm’ or ‘__attribute__’ before ‘&’ token
./include/wx/string.h:1364: error: expected ‘=’, ‘,’, ‘;’, ‘asm’ or ‘__attribute__’ before ‘wxStringBuffer’
./include/wx/string.h:1382: error: expected ‘=’, ‘,’, ‘;’, ‘asm’ or ‘__attribute__’ before ‘wxStringBufferLength’
./include/wx/string.h:1421: error: expected ‘=’, ‘,’, ‘;’, ‘asm’ or ‘__attribute__’ before ‘operator’
./include/wx/string.h:1423: error: expected ‘=’, ‘,’, ‘;’, ‘asm’ or ‘__attribute__’ before ‘operator’
./include/wx/string.h:1425: error: expected ‘=’, ‘,’, ‘;’, ‘asm’ or ‘__attribute__’ before ‘operator’
./include/wx/string.h:1427: error: expected ‘=’, ‘,’, ‘;’, ‘asm’ or ‘__attribute__’ before ‘operator’
./include/wx/string.h:1429: error: expected ‘=’, ‘,’, ‘;’, ‘asm’ or ‘__attribute__’ before ‘operator’
./include/wx/string.h:1431: error: expected ‘=’, ‘,’, ‘;’, ‘asm’ or ‘__attribute__’ before ‘operator’
./include/wx/string.h:1433: error: expected ‘=’, ‘,’, ‘;’, ‘asm’ or ‘__attribute__’ before ‘operator’
./include/wx/string.h:1435: error: expected ‘=’, ‘,’, ‘;’, ‘asm’ or ‘__attribute__’ before ‘operator’
./include/wx/string.h:1437: error: expected ‘=’, ‘,’, ‘;’, ‘asm’ or ‘__attribute__’ before ‘operator’
./include/wx/string.h:1439: error: expected ‘=’, ‘,’, ‘;’, ‘asm’ or ‘__attribute__’ before ‘operator’
./include/wx/string.h:1441: error: expected ‘=’, ‘,’, ‘;’, ‘asm’ or ‘__attribute__’ before ‘operator’
./include/wx/string.h:1443: error: expected ‘=’, ‘,’, ‘;’, ‘asm’ or ‘__attribute__’ before ‘operator’
./include/wx/string.h:1445: error: expected ‘=’, ‘,’, ‘;’, ‘asm’ or ‘__attribute__’ before ‘operator’
./include/wx/string.h:1447: error: expected ‘=’, ‘,’, ‘;’, ‘asm’ or ‘__attribute__’ before ‘operator’
./include/wx/string.h:1449: error: expected ‘=’, ‘,’, ‘;’, ‘asm’ or ‘__attribute__’ before ‘operator’
./include/wx/string.h:1451: error: expected ‘=’, ‘,’, ‘;’, ‘asm’ or ‘__attribute__’ before ‘operator’
./include/wx/string.h:1453: error: expected ‘=’, ‘,’, ‘;’, ‘asm’ or ‘__attribute__’ before ‘operator’
./include/wx/string.h:1455: error: expected ‘=’, ‘,’, ‘;’, ‘asm’ or ‘__attribute__’ before ‘operator’
./include/wx/string.h:1468: error: expected ‘=’, ‘,’, ‘;’, ‘asm’ or ‘__attribute__’ before ‘operator’
./include/wx/string.h:1470: error: expected ‘=’, ‘,’, ‘;’, ‘asm’ or ‘__attribute__’ before ‘operator’
./include/wx/string.h:1472: error: expected ‘=’, ‘,’, ‘;’, ‘asm’ or ‘__attribute__’ before ‘operator’
./include/wx/string.h:1474: error: expected ‘=’, ‘,’, ‘;’, ‘asm’ or ‘__attribute__’ before ‘operator’
./include/wx/string.h:1484: error: expected ‘=’, ‘,’, ‘;’, ‘asm’ or ‘__attribute__’ before ‘operator’
./include/wx/string.h:1486: error: expected ‘=’, ‘,’, ‘;’, ‘asm’ or ‘__attribute__’ before ‘operator’
./include/wx/string.h:1494: error: expected ‘=’, ‘,’, ‘;’, ‘asm’ or ‘__attribute__’ before ‘operator’
./include/wx/string.h:1495: error: expected ‘=’, ‘,’, ‘;’, ‘asm’ or ‘__attribute__’ before ‘operator’
./include/wx/string.h:1496: error: expected ‘=’, ‘,’, ‘;’, ‘asm’ or ‘__attribute__’ before ‘operator’
./include/wx/string.h:1497: error: expected ‘=’, ‘,’, ‘;’, ‘asm’ or ‘__attribute__’ before ‘operator’
In file included from ./include/wx/string.h:1508,
                 from ./include/wx/memory.h:20,
                 from ./include/wx/object.h:25,
                 from ./include/wx/wx.h:16,
                 from ./include/wx/wxprec.h:54:
./include/wx/iosfwrap.h:18:21: warning: iosfwd: No such file or directory
In file included from ./include/wx/memory.h:20,
                 from ./include/wx/object.h:25,
                 from ./include/wx/wx.h:16,
                 from ./include/wx/wxprec.h:54:
./include/wx/string.h:1510: error: expected ‘=’, ‘,’, ‘;’, ‘asm’ or ‘__attribute__’ before ‘:’ token
./include/wx/string.h:1511: error: expected ‘=’, ‘,’, ‘;’, ‘asm’ or ‘__attribute__’ before ‘:’ token
In file included from ./include/wx/memory.h:21,
                 from ./include/wx/object.h:25,
                 from ./include/wx/wx.h:16,
                 from ./include/wx/wxprec.h:54:
./include/wx/msgout.h:38: error: expected ‘=’, ‘,’, ‘;’, ‘asm’ or ‘__attribute__’ before ‘wxMessageOutput’
./include/wx/msgout.h:65: error: expected ‘=’, ‘,’, ‘;’, ‘asm’ or ‘__attribute__’ before ‘wxMessageOutputBest’
./include/wx/msgout.h:79: error: expected ‘=’, ‘,’, ‘;’, ‘asm’ or ‘__attribute__’ before ‘wxMessageOutputStderr’
./include/wx/msgout.h:107: error: expected ‘=’, ‘,’, ‘;’, ‘asm’ or ‘__attribute__’ before ‘wxMessageOutputDebug’
./include/wx/msgout.h:119: error: expected ‘=’, ‘,’, ‘;’, ‘asm’ or ‘__attribute__’ before ‘wxMessageOutputLog’
In file included from ./include/wx/wx.h:16,
                 from ./include/wx/wxprec.h:54:
./include/wx/object.h:27: error: expected ‘=’, ‘,’, ‘;’, ‘asm’ or ‘__attribute__’ before ‘wxObject’
./include/wx/object.h:50: error: expected ‘=’, ‘,’, ‘;’, ‘asm’ or ‘__attribute__’ before ‘wxClassInfo’
./include/wx/object.h:51: error: expected ‘=’, ‘,’, ‘;’, ‘asm’ or ‘__attribute__’ before ‘wxHashTable’
./include/wx/object.h:52: error: expected ‘=’, ‘,’, ‘;’, ‘asm’ or ‘__attribute__’ before ‘wxObjectRefData’
./include/wx/object.h:58: error: expected ‘=’, ‘,’, ‘;’, ‘asm’ or ‘__attribute__’ before ‘*’ token
./include/wx/object.h:60: error: expected ‘=’, ‘,’, ‘;’, ‘asm’ or ‘__attribute__’ before ‘wxClassInfo’
./include/wx/object.h:148: error: expected ‘=’, ‘,’, ‘;’, ‘asm’ or ‘__attribute__’ before ‘*’ token
./include/wx/object.h:151: error: expected ‘=’, ‘,’, ‘;’, ‘asm’ or ‘__attribute__’ before ‘:’ token
./include/wx/object.h:152: error: expected ‘=’, ‘,’, ‘;’, ‘asm’ or ‘__attribute__’ before ‘:’ token
./include/wx/object.h:400: error: expected ‘=’, ‘,’, ‘;’, ‘asm’ or ‘__attribute__’ before ‘wxObject’
./include/wx/object.h:505: error: expected ‘=’, ‘,’, ‘;’, ‘asm’ or ‘__attribute__’ before ‘wxObjectRefData’
./include/wx/object.h:520: error: expected ‘=’, ‘,’, ‘;’, ‘asm’ or ‘__attribute__’ before ‘*’ token
In file included from ./include/wx/wx.h:17,
                 from ./include/wx/wxprec.h:54:
./include/wx/dynarray.h:72: error: expected identifier or ‘(’ before string constant
./include/wx/dynarray.h:809: error: expected ‘=’, ‘,’, ‘;’, ‘asm’ or ‘__attribute__’ before ‘wxBaseArrayPtrVoid’
./include/wx/dynarray.h:811: error: expected ‘=’, ‘,’, ‘;’, ‘asm’ or ‘__attribute__’ before ‘wxBaseArrayShort’
./include/wx/dynarray.h:812: error: expected ‘=’, ‘,’, ‘;’, ‘asm’ or ‘__attribute__’ before ‘wxBaseArrayInt’
./include/wx/dynarray.h:813: error: expected ‘=’, ‘,’, ‘;’, ‘asm’ or ‘__attribute__’ before ‘wxBaseArrayLong’
./include/wx/dynarray.h:814: error: expected ‘=’, ‘,’, ‘;’, ‘asm’ or ‘__attribute__’ before ‘wxBaseArraySizeT’
./include/wx/dynarray.h:815: error: expected ‘=’, ‘,’, ‘;’, ‘asm’ or ‘__attribute__’ before ‘wxBaseArrayDouble’
./include/wx/dynarray.h:963: error: ‘wxBaseArrayShort’ undeclared here (not in a function)
./include/wx/dynarray.h:963: error: expected ‘)’ before ‘:’ token
./include/wx/dynarray.h:963: error: bit-field ‘TypeTooBigToBeStoredInwxBaseArrayShort’ width not an integer constant
./include/wx/dynarray.h:963: error: expected ‘=’, ‘,’, ‘;’, ‘asm’ or ‘__attribute__’ before ‘wxArrayShort’
./include/wx/dynarray.h:964: error: ‘wxBaseArrayInt’ undeclared here (not in a function)
./include/wx/dynarray.h:964: error: expected ‘)’ before ‘:’ token
./include/wx/dynarray.h:964: error: bit-field ‘TypeTooBigToBeStoredInwxBaseArrayInt’ width not an integer constant
./include/wx/dynarray.h:964: error: expected ‘=’, ‘,’, ‘;’, ‘asm’ or ‘__attribute__’ before ‘wxArrayInt’
./include/wx/dynarray.h:965: error: ‘wxBaseArrayLong’ undeclared here (not in a function)
./include/wx/dynarray.h:965: error: expected ‘)’ before ‘:’ token
./include/wx/dynarray.h:965: error: bit-field ‘TypeTooBigToBeStoredInwxBaseArrayLong’ width not an integer constant
./include/wx/dynarray.h:965: error: expected ‘=’, ‘,’, ‘;’, ‘asm’ or ‘__attribute__’ before ‘wxArrayLong’
./include/wx/dynarray.h:966: error: ‘wxBaseArrayPtrVoid’ undeclared here (not in a function)
./include/wx/dynarray.h:966: error: expected ‘)’ before ‘:’ token
./include/wx/dynarray.h:966: error: bit-field ‘TypeTooBigToBeStoredInwxBaseArrayPtrVoid’ width not an integer constant
./include/wx/dynarray.h:966: error: expected ‘=’, ‘,’, ‘;’, ‘asm’ or ‘__attribute__’ before ‘wxArrayPtrVoid’
In file included from ./include/wx/wx.h:18,
                 from ./include/wx/wxprec.h:54:
./include/wx/list.h:57: error: expected identifier or ‘(’ before string constant
./include/wx/list.h:62: error: expected ‘=’, ‘,’, ‘;’, ‘asm’ or ‘__attribute__’ before ‘wxObjectListNode’
./include/wx/list.h:63: error: expected ‘=’, ‘,’, ‘;’, ‘asm’ or ‘__attribute__’ before ‘wxNode’
./include/wx/list.h:350: error: expected ‘=’, ‘,’, ‘;’, ‘asm’ or ‘__attribute__’ before ‘wxListKey’
./include/wx/list.h:391: error: expected ‘=’, ‘,’, ‘;’, ‘asm’ or ‘__attribute__’ before ‘wxDefaultListKey’
./include/wx/list.h:393: error: expected ‘=’, ‘,’, ‘;’, ‘asm’ or ‘__attribute__’ before ‘wxListBase’
./include/wx/list.h:395: error: expected ‘=’, ‘,’, ‘;’, ‘asm’ or ‘__attribute__’ before ‘wxNodeBase’
./include/wx/list.h:455: error: expected ‘=’, ‘,’, ‘;’, ‘asm’ or ‘__attribute__’ before ‘wxList’
./include/wx/list.h:457: error: expected ‘=’, ‘,’, ‘;’, ‘asm’ or ‘__attribute__’ before ‘wxListBase’
./include/wx/list.h:1098: error: expected ‘=’, ‘,’, ‘;’, ‘asm’ or ‘__attribute__’ before ‘*’ token
./include/wx/list.h:1099: error: expected ‘=’, ‘,’, ‘;’, ‘asm’ or ‘__attribute__’ before ‘*’ token
./include/wx/list.h:1100: error: expected ‘=’, ‘,’, ‘;’, ‘asm’ or ‘__attribute__’ before ‘*’ token
./include/wx/list.h:1106: error: expected ‘=’, ‘,’, ‘;’, ‘asm’ or ‘__attribute__’ before ‘:’ token
./include/wx/list.h:1107: error: expected ‘=’, ‘,’, ‘;’, ‘asm’ or ‘__attribute__’ before ‘*’ token
./include/wx/list.h:1108: error: expected ‘=’, ‘,’, ‘;’, ‘asm’ or ‘__attribute__’ before ‘*’ token
./include/wx/list.h:1109: error: expected ‘=’, ‘,’, ‘;’, ‘asm’ or ‘__attribute__’ before ‘*’ token
./include/wx/list.h:1110: error: expected ‘=’, ‘,’, ‘;’, ‘asm’ or ‘__attribute__’ before ‘:’ token
./include/wx/list.h:1121: warning: type defaults to ‘int’ in declaration of ‘wxObject’
./include/wx/list.h:1121: error: expected ‘;’, ‘,’ or ‘)’ before ‘*’ token
./include/wx/list.h:1121: error: expected ‘=’, ‘,’, ‘;’, ‘asm’ or ‘__attribute__’ before ‘wxObjectListNode’
./include/wx/list.h:1121: error: expected ‘=’, ‘,’, ‘;’, ‘asm’ or ‘__attribute__’ before ‘wxObjectList’
./include/wx/list.h:1124: error: expected ‘=’, ‘,’, ‘;’, ‘asm’ or ‘__attribute__’ before ‘wxList’
./include/wx/list.h:1161: error: expected ‘=’, ‘,’, ‘;’, ‘asm’ or ‘__attribute__’ before ‘wxStringListNode’
./include/wx/list.h:1161: error: expected ‘=’, ‘,’, ‘;’, ‘asm’ or ‘__attribute__’ before ‘wxStringListBase’
./include/wx/list.h:1163: error: expected ‘=’, ‘,’, ‘;’, ‘asm’ or ‘__attribute__’ before ‘wxStringList’
In file included from ./include/wx/wx.h:19,
                 from ./include/wx/wxprec.h:54:
./include/wx/hash.h:56: error: expected ‘=’, ‘,’, ‘;’, ‘asm’ or ‘__attribute__’ before ‘wxHashTableBase’
./include/wx/hash.h:240: error: expected ‘=’, ‘,’, ‘;’, ‘asm’ or ‘__attribute__’ before ‘wxHashTableLong’
./include/wx/hash.h:278: error: expected ‘=’, ‘,’, ‘;’, ‘asm’ or ‘__attribute__’ before ‘wxStringHashTable’
./include/wx/hash.h:418: error: expected ‘=’, ‘,’, ‘;’, ‘asm’ or ‘__attribute__’ before ‘wxHashTable’
In file included from ./include/wx/wx.h:21,
                 from ./include/wx/wxprec.h:54:
./include/wx/intl.h:51: error: expected ‘=’, ‘,’, ‘;’, ‘asm’ or ‘__attribute__’ before ‘wxLocale’
./include/wx/intl.h:52: error: expected ‘=’, ‘,’, ‘;’, ‘asm’ or ‘__attribute__’ before ‘wxLanguageInfoArray’
./include/wx/intl.h:53: error: expected ‘=’, ‘,’, ‘;’, ‘asm’ or ‘__attribute__’ before ‘wxMsgCatalog’
./include/wx/intl.h:317: error: expected specifier-qualifier-list before ‘wxString’
./include/wx/intl.h:368: error: expected ‘=’, ‘,’, ‘;’, ‘asm’ or ‘__attribute__’ before ‘wxLocale’
./include/wx/intl.h:552: error: expected ‘=’, ‘,’, ‘;’, ‘asm’ or ‘__attribute__’ before ‘*’ token
./include/wx/intl.h: In function ‘wxGetTranslation’:
./include/wx/intl.h:557: error: ‘wxLocale’ undeclared (first use in this function)
./include/wx/intl.h:557: error: (Each undeclared identifier is reported only once
./include/wx/intl.h:557: error: for each function it appears in.)
./include/wx/intl.h:557: error: ‘pLoc’ undeclared (first use in this function)
./include/wx/intl.h:557: warning: implicit declaration of function ‘wxGetLocale’
./include/wx/intl.h: At top level:
./include/wx/intl.h:565: error: conflicting types for ‘wxGetTranslation’
./include/wx/intl.h:556: error: previous definition of ‘wxGetTranslation’ was here
./include/wx/intl.h: In function ‘wxGetTranslation’:
./include/wx/intl.h:566: error: ‘wxLocale’ undeclared (first use in this function)
./include/wx/intl.h:566: error: ‘pLoc’ undeclared (first use in this function)
In file included from ./include/wx/wx.h:22,
                 from ./include/wx/wxprec.h:54:
./include/wx/log.h: At top level:
./include/wx/log.h:122: error: expected ‘=’, ‘,’, ‘;’, ‘asm’ or ‘__attribute__’ before ‘wxLog’
./include/wx/log.h:294: error: expected ‘=’, ‘,’, ‘;’, ‘asm’ or ‘__attribute__’ before ‘wxLogBuffer’
./include/wx/log.h:319: error: expected ‘=’, ‘,’, ‘;’, ‘asm’ or ‘__attribute__’ before ‘wxLogStderr’
./include/wx/log.h:337: error: expected ‘=’, ‘,’, ‘;’, ‘asm’ or ‘__attribute__’ before ‘wxLogStream’
./include/wx/log.h:373: error: expected ‘=’, ‘,’, ‘;’, ‘asm’ or ‘__attribute__’ before ‘wxLogNull’
./include/wx/log.h:392: error: expected ‘=’, ‘,’, ‘;’, ‘asm’ or ‘__attribute__’ before ‘wxLogChain’
./include/wx/log.h:432: error: expected ‘=’, ‘,’, ‘;’, ‘asm’ or ‘__attribute__’ before ‘wxLogPassThrough’
./include/wx/log.h:463: error: expected ‘;’, ‘,’ or ‘)’ before ‘=’ token
./include/wx/log.h:544: error: conflicting types for ‘wxVLogSysError’
./include/wx/log.h:540: error: previous declaration of ‘wxVLogSysError’ was here
./include/wx/log.h:544: error: conflicting types for ‘wxLogSysError’
./include/wx/log.h:540: error: previous declaration of ‘wxLogSysError’ was here
./include/wx/log.h: In function ‘wxVLogDebug’:
./include/wx/log.h:564: error: parameter name omitted
./include/wx/log.h:564: error: parameter name omitted
./include/wx/log.h: In function ‘wxLogDebug’:
./include/wx/log.h:565: error: parameter name omitted
./include/wx/log.h: In function ‘wxVLogTrace’:
./include/wx/log.h:566: error: parameter name omitted
./include/wx/log.h:566: error: parameter name omitted
./include/wx/log.h:566: error: parameter name omitted
./include/wx/log.h: In function ‘wxLogTrace’:
./include/wx/log.h:567: error: parameter name omitted
./include/wx/log.h:567: error: parameter name omitted
./include/wx/log.h: At top level:
./include/wx/log.h:568: error: conflicting types for ‘wxVLogTrace’
./include/wx/log.h:566: error: previous definition of ‘wxVLogTrace’ was here
./include/wx/log.h: In function ‘wxVLogTrace’:
./include/wx/log.h:568: error: parameter name omitted
./include/wx/log.h:568: error: parameter name omitted
./include/wx/log.h:568: error: parameter name omitted
./include/wx/log.h: At top level:
./include/wx/log.h:569: error: conflicting types for ‘wxLogTrace’
./include/wx/log.h:567: error: previous definition of ‘wxLogTrace’ was here
./include/wx/log.h: In function ‘wxLogTrace’:
./include/wx/log.h:569: error: parameter name omitted
./include/wx/log.h:569: error: parameter name omitted
./include/wx/log.h: At top level:
./include/wx/log.h:575: warning: type defaults to ‘int’ in declaration of ‘wxString’
./include/wx/log.h:575: error: expected ‘;’, ‘,’ or ‘)’ before ‘&’ token
./include/wx/log.h: In function ‘wxLogApiError’:
./include/wx/log.h:600: error: parameter name omitted
./include/wx/log.h:600: error: parameter name omitted
./include/wx/log.h: In function ‘wxLogLastError’:
./include/wx/log.h:601: error: parameter name omitted
In file included from ./include/wx/clntdata.h:21,
                 from ./include/wx/event.h:28,
                 from ./include/wx/wx.h:23,
                 from ./include/wx/wxprec.h:54:
./include/wx/hashmap.h: At top level:
./include/wx/hashmap.h:55: error: expected specifier-qualifier-list before ‘_wxHashTable_NodeBase’
./include/wx/hashmap.h:65: error: expected ‘=’, ‘,’, ‘;’, ‘asm’ or ‘__attribute__’ before ‘_wxHashTableBase2’
./include/wx/hashmap.h:440: error: expected ‘=’, ‘,’, ‘;’, ‘asm’ or ‘__attribute__’ before ‘never_grow’
./include/wx/hashmap.h:441: error: expected ‘=’, ‘,’, ‘;’, ‘asm’ or ‘__attribute__’ before ‘never_shrink’
./include/wx/hashmap.h:442: error: expected ‘=’, ‘,’, ‘;’, ‘asm’ or ‘__attribute__’ before ‘grow_lf70’
./include/wx/hashmap.h:483: error: expected ‘=’, ‘,’, ‘;’, ‘asm’ or ‘__attribute__’ before ‘wxIntegerHash’
./include/wx/hashmap.h:499: error: expected ‘=’, ‘,’, ‘;’, ‘asm’ or ‘__attribute__’ before ‘wxIntegerEqual’
./include/wx/hashmap.h:514: error: expected ‘=’, ‘,’, ‘;’, ‘asm’ or ‘__attribute__’ before ‘wxPointerHash’
./include/wx/hashmap.h:528: error: expected ‘=’, ‘,’, ‘;’, ‘asm’ or ‘__attribute__’ before ‘wxPointerEqual’
./include/wx/hashmap.h:538: error: expected ‘=’, ‘,’, ‘;’, ‘asm’ or ‘__attribute__’ before ‘wxStringHash’
./include/wx/hashmap.h:556: error: expected ‘=’, ‘,’, ‘;’, ‘asm’ or ‘__attribute__’ before ‘wxStringEqual’
./include/wx/hashmap.h:684: error: expected ‘=’, ‘,’, ‘;’, ‘asm’ or ‘__attribute__’ before ‘wxLongToLongHashMap_wxImplementation_Pair’
./include/wx/hashmap.h:684: error: expected ‘=’, ‘,’, ‘;’, ‘asm’ or ‘__attribute__’ before ‘wxLongToLongHashMap_wxImplementation_KeyEx’
./include/wx/hashmap.h:684: error: expected ‘=’, ‘,’, ‘;’, ‘asm’ or ‘__attribute__’ before ‘wxLongToLongHashMap_wxImplementation_HashTable’
./include/wx/hashmap.h:684: error: expected ‘=’, ‘,’, ‘;’, ‘asm’ or ‘__attribute__’ before ‘wxLongToLongHashMap’
In file included from ./include/wx/event.h:28,
                 from ./include/wx/wx.h:23,
                 from ./include/wx/wxprec.h:54:
./include/wx/clntdata.h:26: error: expected ‘=’, ‘,’, ‘;’, ‘asm’ or ‘__attribute__’ before ‘wxShadowObjectMethods_wxImplementation_Pair’
./include/wx/clntdata.h:26: error: expected ‘=’, ‘,’, ‘;’, ‘asm’ or ‘__attribute__’ before ‘wxShadowObjectMethods_wxImplementation_KeyEx’
./include/wx/clntdata.h:26: error: expected ‘=’, ‘,’, ‘;’, ‘asm’ or ‘__attribute__’ before ‘wxShadowObjectMethods_wxImplementation_HashTable’
./include/wx/clntdata.h:26: error: expected ‘=’, ‘,’, ‘;’, ‘asm’ or ‘__attribute__’ before ‘wxShadowObjectMethods’
./include/wx/clntdata.h:31: error: expected ‘=’, ‘,’, ‘;’, ‘asm’ or ‘__attribute__’ before ‘wxShadowObjectFields_wxImplementation_Pair’
./include/wx/clntdata.h:31: error: expected ‘=’, ‘,’, ‘;’, ‘asm’ or ‘__attribute__’ before ‘wxShadowObjectFields_wxImplementation_KeyEx’
./include/wx/clntdata.h:31: error: expected ‘=’, ‘,’, ‘;’, ‘asm’ or ‘__attribute__’ before ‘wxShadowObjectFields_wxImplementation_HashTable’
./include/wx/clntdata.h:31: error: expected ‘=’, ‘,’, ‘;’, ‘asm’ or ‘__attribute__’ before ‘wxShadowObjectFields’
./include/wx/clntdata.h:37: error: expected ‘=’, ‘,’, ‘;’, ‘asm’ or ‘__attribute__’ before ‘wxShadowObject’
./include/wx/clntdata.h:105: error: expected ‘=’, ‘,’, ‘;’, ‘asm’ or ‘__attribute__’ before ‘wxClientData’
./include/wx/clntdata.h:112: error: expected ‘=’, ‘,’, ‘;’, ‘asm’ or ‘__attribute__’ before ‘wxStringClientData’
./include/wx/clntdata.h:133: error: expected ‘=’, ‘,’, ‘;’, ‘asm’ or ‘__attribute__’ before ‘wxClientDataContainer’
In file included from ./include/wx/clntdata.h:173,
                 from ./include/wx/event.h:28,
                 from ./include/wx/wx.h:23,
                 from ./include/wx/wxprec.h:54:
./include/wx/vector.h:16: error: expected ‘=’, ‘,’, ‘;’, ‘asm’ or ‘__attribute__’ before ‘wxVectorBase’
In file included from ./include/wx/event.h:28,
                 from ./include/wx/wx.h:23,
                 from ./include/wx/wxprec.h:54:
./include/wx/clntdata.h:177: error: expected specifier-qualifier-list before ‘wxClientDataDictionaryPair’
./include/wx/clntdata.h:183: error: expected ‘=’, ‘,’, ‘;’, ‘asm’ or ‘__attribute__’ before ‘wxClientDataDictionaryPairVector’
./include/wx/clntdata.h:195: error: expected ‘=’, ‘,’, ‘;’, ‘asm’ or ‘__attribute__’ before ‘wxClientDataDictionary’
In file included from ./include/wx/event.h:35,
                 from ./include/wx/wx.h:23,
                 from ./include/wx/wxprec.h:54:
./include/wx/thread.h:117: error: expected ‘=’, ‘,’, ‘;’, ‘asm’ or ‘__attribute__’ before ‘wxThreadHelper’
./include/wx/thread.h:118: error: expected ‘=’, ‘,’, ‘;’, ‘asm’ or ‘__attribute__’ before ‘wxConditionInternal’
./include/wx/thread.h:119: error: expected ‘=’, ‘,’, ‘;’, ‘asm’ or ‘__attribute__’ before ‘wxMutexInternal’
./include/wx/thread.h:120: error: expected ‘=’, ‘,’, ‘;’, ‘asm’ or ‘__attribute__’ before ‘wxSemaphoreInternal’
./include/wx/thread.h:121: error: expected ‘=’, ‘,’, ‘;’, ‘asm’ or ‘__attribute__’ before ‘wxThreadInternal’
./include/wx/thread.h:132: error: expected ‘=’, ‘,’, ‘;’, ‘asm’ or ‘__attribute__’ before ‘wxMutex’
./include/wx/thread.h:175: error: expected ‘=’, ‘,’, ‘;’, ‘asm’ or ‘__attribute__’ before ‘wxMutexLocker’
./include/wx/thread.h:224: error: expected ‘=’, ‘,’, ‘;’, ‘asm’ or ‘__attribute__’ before ‘wxCriticalSection’
./include/wx/thread.h:273: error: expected ‘=’, ‘,’, ‘;’, ‘asm’ or ‘__attribute__’ before ‘:’ token
./include/wx/thread.h:274: error: expected ‘=’, ‘,’, ‘;’, ‘asm’ or ‘__attribute__’ before ‘:’ token
./include/wx/thread.h:276: error: expected ‘=’, ‘,’, ‘;’, ‘asm’ or ‘__attribute__’ before ‘:’ token
./include/wx/thread.h:277: error: expected ‘=’, ‘,’, ‘;’, ‘asm’ or ‘__attribute__’ before ‘:’ token
./include/wx/thread.h:285: error: expected ‘=’, ‘,’, ‘;’, ‘asm’ or ‘__attribute__’ before ‘wxCriticalSectionLocker’
./include/wx/thread.h:310: error: expected ‘=’, ‘,’, ‘;’, ‘asm’ or ‘__attribute__’ before ‘wxCondition’
./include/wx/thread.h:372: error: expected ‘=’, ‘,’, ‘;’, ‘asm’ or ‘__attribute__’ before ‘wxSemaphore’
./include/wx/thread.h:427: error: expected ‘=’, ‘,’, ‘;’, ‘asm’ or ‘__attribute__’ before ‘wxThread’
./include/wx/thread.h:592: error: expected ‘=’, ‘,’, ‘;’, ‘asm’ or ‘__attribute__’ before ‘wxThreadHelperThread’
./include/wx/thread.h:620: error: expected ‘=’, ‘,’, ‘;’, ‘asm’ or ‘__attribute__’ before ‘wxThreadHelper’
./include/wx/thread.h:662: error: expected ‘=’, ‘,’, ‘;’, ‘asm’ or ‘__attribute__’ before ‘:’ token
./include/wx/thread.h:685: error: expected ‘=’, ‘,’, ‘;’, ‘asm’ or ‘__attribute__’ before ‘wxIsMainThread’
./include/wx/thread.h:728: error: expected ‘=’, ‘,’, ‘;’, ‘asm’ or ‘__attribute__’ before ‘wxMutexGuiLocker’
In file included from ./include/wx/wx.h:23,
                 from ./include/wx/wxprec.h:54:
./include/wx/event.h:43: error: expected ‘=’, ‘,’, ‘;’, ‘asm’ or ‘__attribute__’ before ‘wxList’
./include/wx/event.h:52: error: expected ‘=’, ‘,’, ‘;’, ‘asm’ or ‘__attribute__’ before ‘wxEvtHandler’
./include/wx/event.h:337: error: expected ‘=’, ‘,’, ‘;’, ‘asm’ or ‘__attribute__’ before ‘wxEvent’
./include/wx/event.h:433: error: expected ‘=’, ‘,’, ‘;’, ‘asm’ or ‘__attribute__’ before ‘wxPropagationDisabler’
./include/wx/event.h:456: error: expected ‘=’, ‘,’, ‘;’, ‘asm’ or ‘__attribute__’ before ‘wxPropagateOnce’
./include/wx/event.h:2128: error: expected ‘)’ before ‘:’ token
./include/wx/event.h:2153: error: expected specifier-qualifier-list before ‘private’
./include/wx/event.h:2185: error: expected identifier or ‘(’ before ‘:’ token
./include/wx/event.h:2206: error: expected identifier or ‘(’ before ‘:’ token
./include/wx/event.h:2236: error: expected ‘:’, ‘,’, ‘;’, ‘}’ or ‘__attribute__’ before ‘*’ token
./include/wx/event.h:2244: error: expected ‘=’, ‘,’, ‘;’, ‘asm’ or ‘__attribute__’ before ‘*’ token
./include/wx/event.h:2244: error: ‘_wxArraywxEventTableEntryPointerArray’ undeclared here (not in a function)
./include/wx/event.h:2244: error: expected ‘)’ before ‘:’ token
./include/wx/event.h:2244: error: bit-field ‘TypeTooBigToBeStoredInwxBaseArrayPtrVoid’ width not an integer constant
./include/wx/event.h:2244: error: expected ‘)’ before ‘*’ token
./include/wx/event.h:2244: error: expected ‘=’, ‘,’, ‘;’, ‘asm’ or ‘__attribute__’ before ‘wxEventTableEntryPointerArray’
./include/wx/event.h:2246: error: expected ‘=’, ‘,’, ‘;’, ‘asm’ or ‘__attribute__’ before ‘wxEventHashTable’
./include/wx/event.h:2305: error: expected ‘=’, ‘,’, ‘;’, ‘asm’ or ‘__attribute__’ before ‘wxEvtHandler’
./include/wx/event.h:2485: error: expected ‘)’ before ‘*’ token
./include/wx/event.h:2492: error: expected ‘)’ before ‘:’ token
./include/wx/event.h:2922: error: expected ‘=’, ‘,’, ‘;’, ‘asm’ or ‘__attribute__’ before ‘*’ token
./include/wx/event.h:2924: error: expected ‘=’, ‘,’, ‘;’, ‘asm’ or ‘__attribute__’ before ‘*’ token
In file included from ./include/wx/app.h:28,
                 from ./include/wx/wx.h:24,
                 from ./include/wx/wxprec.h:54:
./include/wx/build.h:132: error: expected ‘=’, ‘,’, ‘;’, ‘asm’ or ‘__attribute__’ before ‘wxBuildOptions’
In file included from ./include/wx/app.h:29,
                 from ./include/wx/wx.h:24,
                 from ./include/wx/wxprec.h:54:
./include/wx/init.h:29: error: expected ‘=’, ‘,’, ‘;’, ‘asm’ or ‘__attribute__’ before ‘wxEntryStart’
./include/wx/init.h:45: error: expected ‘;’, ‘,’ or ‘)’ before ‘&’ token
./include/wx/init.h:63: error: expected ‘=’, ‘,’, ‘;’, ‘asm’ or ‘__attribute__’ before ‘wxInitialize’
./include/wx/init.h:71: error: expected ‘=’, ‘,’, ‘;’, ‘asm’ or ‘__attribute__’ before ‘wxInitializer’
In file included from ./include/wx/wx.h:24,
                 from ./include/wx/wxprec.h:54:
./include/wx/app.h:31: error: expected ‘=’, ‘,’, ‘;’, ‘asm’ or ‘__attribute__’ before ‘wxAppConsole’
./include/wx/app.h:32: error: expected ‘=’, ‘,’, ‘;’, ‘asm’ or ‘__attribute__’ before ‘wxAppTraits’
./include/wx/app.h:33: error: expected ‘=’, ‘,’, ‘;’, ‘asm’ or ‘__attribute__’ before ‘wxCmdLineParser’
./include/wx/app.h:34: error: expected ‘=’, ‘,’, ‘;’, ‘asm’ or ‘__attribute__’ before ‘wxLog’
./include/wx/app.h:35: error: expected ‘=’, ‘,’, ‘;’, ‘asm’ or ‘__attribute__’ before ‘wxMessageOutput’
./include/wx/app.h:44: error: expected ‘=’, ‘,’, ‘;’, ‘asm’ or ‘__attribute__’ before ‘wxEventLoop’
./include/wx/app.h:52: error: expected ‘=’, ‘,’, ‘;’, ‘asm’ or ‘__attribute__’ before ‘*’ token
./include/wx/app.h:68: error: expected ‘=’, ‘,’, ‘;’, ‘asm’ or ‘__attribute__’ before ‘wxAppConsole’
./include/wx/app.h:582: error: expected ‘=’, ‘,’, ‘;’, ‘asm’ or ‘__attribute__’ before ‘wxApp’
./include/wx/app.h:611: error: expected ‘=’, ‘,’, ‘;’, ‘asm’ or ‘__attribute__’ before ‘wxYield’
./include/wx/app.h:624: error: expected ‘=’, ‘,’, ‘;’, ‘asm’ or ‘__attribute__’ before ‘wxAppInitializer’
In file included from ./include/wx/utils.h:32,
                 from ./include/wx/wx.h:25,
                 from ./include/wx/wxprec.h:54:
./include/wx/filefn.h:370: error: expected ‘=’, ‘,’, ‘;’, ‘asm’ or ‘__attribute__’ before ‘wxFileExists’
./include/wx/filefn.h:373: error: expected ‘=’, ‘,’, ‘;’, ‘asm’ or ‘__attribute__’ before ‘wxDirExists’
./include/wx/filefn.h:375: error: expected ‘=’, ‘,’, ‘;’, ‘asm’ or ‘__attribute__’ before ‘wxIsAbsolutePath’
./include/wx/filefn.h:379: error: expected ‘=’, ‘,’, ‘;’, ‘asm’ or ‘__attribute__’ before ‘wxFileNameFromPath’
./include/wx/filefn.h:382: error: expected ‘=’, ‘,’, ‘;’, ‘asm’ or ‘__attribute__’ before ‘wxPathOnly’
./include/wx/filefn.h:385: error: expected ‘=’, ‘,’, ‘;’, ‘asm’ or ‘__attribute__’ before ‘wxRealPath’
./include/wx/filefn.h:393: error: expected ‘)’ before ‘&’ token
./include/wx/filefn.h:396: warning: type defaults to ‘int’ in declaration of ‘wxString’
./include/wx/filefn.h:396: error: expected ‘;’, ‘,’ or ‘)’ before ‘&’ token
./include/wx/filefn.h:397: error: expected ‘=’, ‘,’, ‘;’, ‘asm’ or ‘__attribute__’ before ‘wxGetTempFileName’
./include/wx/filefn.h:401: error: expected ‘=’, ‘,’, ‘;’, ‘asm’ or ‘__attribute__’ before ‘wxExpandPath’
./include/wx/filefn.h:406: warning: type defaults to ‘int’ in declaration of ‘wxString’
./include/wx/filefn.h:406: error: expected ‘;’, ‘,’ or ‘)’ before ‘&’ token
./include/wx/filefn.h:414: warning: type defaults to ‘int’ in declaration of ‘wxString’
./include/wx/filefn.h:414: error: expected ‘;’, ‘,’ or ‘)’ before ‘&’ token
./include/wx/filefn.h:420: error: expected ‘=’, ‘,’, ‘;’, ‘asm’ or ‘__attribute__’ before ‘wxFindFirstFile’
./include/wx/filefn.h:421: error: expected ‘=’, ‘,’, ‘;’, ‘asm’ or ‘__attribute__’ before ‘wxFindNextFile’
./include/wx/filefn.h:424: error: expected ‘=’, ‘,’, ‘;’, ‘asm’ or ‘__attribute__’ before ‘wxIsWild’
./include/wx/filefn.h:429: error: expected ‘=’, ‘,’, ‘;’, ‘asm’ or ‘__attribute__’ before ‘wxMatchWild’
./include/wx/filefn.h:432: error: expected ‘=’, ‘,’, ‘;’, ‘asm’ or ‘__attribute__’ before ‘wxConcatFiles’
./include/wx/filefn.h:435: error: expected ‘=’, ‘,’, ‘;’, ‘asm’ or ‘__attribute__’ before ‘wxCopyFile’
./include/wx/filefn.h:439: error: expected ‘=’, ‘,’, ‘;’, ‘asm’ or ‘__attribute__’ before ‘wxRemoveFile’
./include/wx/filefn.h:442: error: expected ‘=’, ‘,’, ‘;’, ‘asm’ or ‘__attribute__’ before ‘wxRenameFile’
./include/wx/filefn.h:449: error: expected ‘;’, ‘,’ or ‘)’ before ‘=’ token
./include/wx/filefn.h:452: error: expected ‘=’, ‘,’, ‘;’, ‘asm’ or ‘__attribute__’ before ‘wxGetCwd’
./include/wx/filefn.h:455: error: expected ‘=’, ‘,’, ‘;’, ‘asm’ or ‘__attribute__’ before ‘wxSetWorkingDirectory’
./include/wx/filefn.h:458: error: expected ‘=’, ‘,’, ‘;’, ‘asm’ or ‘__attribute__’ before ‘wxMkdir’
./include/wx/filefn.h:461: error: expected ‘=’, ‘,’, ‘;’, ‘asm’ or ‘__attribute__’ before ‘wxRmdir’
./include/wx/filefn.h:464: error: expected ‘=’, ‘,’, ‘;’, ‘asm’ or ‘__attribute__’ before ‘wxGetFileKind’
./include/wx/filefn.h:465: error: expected ‘=’, ‘,’, ‘;’, ‘asm’ or ‘__attribute__’ before ‘wxGetFileKind’
./include/wx/filefn.h:470: error: expected ‘=’, ‘,’, ‘;’, ‘asm’ or ‘__attribute__’ before ‘wxPathExists’
./include/wx/filefn.h:471: error: expected ‘=’, ‘,’, ‘;’, ‘asm’ or ‘__attribute__’ before ‘wxPathExists’
./include/wx/filefn.h:523: error: expected ‘=’, ‘,’, ‘;’, ‘asm’ or ‘__attribute__’ before ‘wxIsPathSeparator’
./include/wx/filefn.h:534: error: expected ‘=’, ‘,’, ‘;’, ‘asm’ or ‘__attribute__’ before ‘wxEndsWithPathSeparator’
./include/wx/filefn.h:539: error: expected declaration specifiers or ‘...’ before ‘wxString’
./include/wx/filefn.h:540: error: expected declaration specifiers or ‘...’ before ‘wxString’
./include/wx/filefn.h:541: error: expected declaration specifiers or ‘...’ before ‘wxString’
./include/wx/filefn.h:544: error: expected ‘=’, ‘,’, ‘;’, ‘asm’ or ‘__attribute__’ before ‘wxFindFileInPath’
./include/wx/filefn.h:548: error: expected ‘=’, ‘,’, ‘;’, ‘asm’ or ‘__attribute__’ before ‘wxGetOSDirectory’
./include/wx/filefn.h:551: warning: type defaults to ‘int’ in declaration of ‘wxString’
./include/wx/filefn.h:551: error: expected ‘;’, ‘,’ or ‘)’ before ‘&’ token
./include/wx/filefn.h:558: warning: type defaults to ‘int’ in declaration of ‘wxString’
./include/wx/filefn.h:558: error: expected ‘;’, ‘,’ or ‘)’ before ‘&’ token
./include/wx/filefn.h:567: error: expected ‘=’, ‘,’, ‘;’, ‘asm’ or ‘__attribute__’ before ‘wxUmaskChanger’
./include/wx/filefn.h:600: error: expected ‘=’, ‘,’, ‘;’, ‘asm’ or ‘__attribute__’ before ‘wxPathList’
In file included from ./include/wx/wx.h:25,
                 from ./include/wx/wxprec.h:54:
./include/wx/utils.h:34: error: expected ‘=’, ‘,’, ‘;’, ‘asm’ or ‘__attribute__’ before ‘wxArrayString’
In file included from ./include/wx/utils.h:38,
                 from ./include/wx/wx.h:25,
                 from ./include/wx/wxprec.h:54:
./include/wx/longlong.h:85: error: expected ‘=’, ‘,’, ‘;’, ‘asm’ or ‘__attribute__’ before ‘wxLongLongNative’
./include/wx/longlong.h:86: error: expected ‘=’, ‘,’, ‘;’, ‘asm’ or ‘__attribute__’ before ‘wxULongLongNative’
./include/wx/longlong.h:87: error: expected ‘=’, ‘,’, ‘;’, ‘asm’ or ‘__attribute__’ before ‘wxLongLong’
./include/wx/longlong.h:88: error: expected ‘=’, ‘,’, ‘;’, ‘asm’ or ‘__attribute__’ before ‘wxULongLong’
In file included from ./include/wx/utils.h:38,
                 from ./include/wx/wx.h:25,
                 from ./include/wx/wxprec.h:54:
./include/wx/longlong.h:103: error: expected ‘=’, ‘,’, ‘;’, ‘asm’ or ‘__attribute__’ before ‘wxLongLongNative’
./include/wx/longlong.h:321: error: expected ‘=’, ‘,’, ‘;’, ‘asm’ or ‘__attribute__’ before ‘wxULongLongNative’
./include/wx/longlong.h:912: error: expected ‘=’, ‘,’, ‘;’, ‘asm’ or ‘__attribute__’ before ‘operator’
./include/wx/longlong.h:913: error: expected ‘=’, ‘,’, ‘;’, ‘asm’ or ‘__attribute__’ before ‘operator’
./include/wx/longlong.h:914: error: expected ‘=’, ‘,’, ‘;’, ‘asm’ or ‘__attribute__’ before ‘operator’
./include/wx/longlong.h:915: error: expected ‘=’, ‘,’, ‘;’, ‘asm’ or ‘__attribute__’ before ‘operator’
./include/wx/longlong.h:916: error: expected ‘=’, ‘,’, ‘;’, ‘asm’ or ‘__attribute__’ before ‘operator’
./include/wx/longlong.h:917: error: expected ‘=’, ‘,’, ‘;’, ‘asm’ or ‘__attribute__’ before ‘operator’
./include/wx/longlong.h:919: error: expected ‘=’, ‘,’, ‘;’, ‘asm’ or ‘__attribute__’ before ‘operator’
./include/wx/longlong.h:920: error: expected ‘=’, ‘,’, ‘;’, ‘asm’ or ‘__attribute__’ before ‘operator’
./include/wx/longlong.h:925: error: expected ‘=’, ‘,’, ‘;’, ‘asm’ or ‘__attribute__’ before ‘operator’
./include/wx/longlong.h:926: error: expected ‘=’, ‘,’, ‘;’, ‘asm’ or ‘__attribute__’ before ‘operator’
./include/wx/longlong.h:927: error: expected ‘=’, ‘,’, ‘;’, ‘asm’ or ‘__attribute__’ before ‘operator’
./include/wx/longlong.h:928: error: expected ‘=’, ‘,’, ‘;’, ‘asm’ or ‘__attribute__’ before ‘operator’
./include/wx/longlong.h:929: error: expected ‘=’, ‘,’, ‘;’, ‘asm’ or ‘__attribute__’ before ‘operator’
./include/wx/longlong.h:930: error: expected ‘=’, ‘,’, ‘;’, ‘asm’ or ‘__attribute__’ before ‘operator’
./include/wx/longlong.h:932: error: expected ‘=’, ‘,’, ‘;’, ‘asm’ or ‘__attribute__’ before ‘operator’
./include/wx/longlong.h:934: error: expected ‘=’, ‘,’, ‘;’, ‘asm’ or ‘__attribute__’ before ‘operator’
In file included from ./include/wx/wx.h:25,
                 from ./include/wx/wxprec.h:54:
./include/wx/utils.h:51: error: expected ‘=’, ‘,’, ‘;’, ‘asm’ or ‘__attribute__’ before ‘wxProcess’
./include/wx/utils.h:52: error: expected ‘=’, ‘,’, ‘;’, ‘asm’ or ‘__attribute__’ before ‘wxFrame’
./include/wx/utils.h:53: error: expected ‘=’, ‘,’, ‘;’, ‘asm’ or ‘__attribute__’ before ‘wxWindow’
./include/wx/utils.h:54: error: expected ‘=’, ‘,’, ‘;’, ‘asm’ or ‘__attribute__’ before ‘wxWindowList’
./include/wx/utils.h:55: error: expected ‘=’, ‘,’, ‘;’, ‘asm’ or ‘__attribute__’ before ‘wxPoint’
./include/wx/utils.h:101: error: expected ‘=’, ‘,’, ‘;’, ‘asm’ or ‘__attribute__’ before ‘wxGetOsDescription’
./include/wx/utils.h:104: error: expected ‘;’, ‘,’ or ‘)’ before ‘=’ token
./include/wx/utils.h:108: error: expected ‘=’, ‘,’, ‘;’, ‘asm’ or ‘__attribute__’ before ‘wxNow’
./include/wx/utils.h:113: error: expected ‘=’, ‘,’, ‘;’, ‘asm’ or ‘__attribute__’ before ‘wxGetDataDir’
./include/wx/utils.h:155: error: expected ‘;’, ‘,’ or ‘)’ before ‘=’ token
./include/wx/utils.h:157: error: expected ‘;’, ‘,’ or ‘)’ before ‘=’ token
./include/wx/utils.h:166: warning: type defaults to ‘int’ in declaration of ‘wxString’
./include/wx/utils.h:166: error: expected ‘;’, ‘,’ or ‘)’ before ‘&’ token
./include/wx/utils.h:170: error: expected ‘=’, ‘,’, ‘;’, ‘asm’ or ‘__attribute__’ before ‘wxDecToHex’
./include/wx/utils.h:206: error: expected ‘;’, ‘,’ or ‘)’ before ‘=’ token
./include/wx/utils.h:208: warning: type defaults to ‘int’ in declaration of ‘wxString’
./include/wx/utils.h:208: error: expected ‘;’, ‘,’ or ‘)’ before ‘&’ token
./include/wx/utils.h:213: warning: type defaults to ‘int’ in declaration of ‘wxString’
./include/wx/utils.h:213: error: expected ‘;’, ‘,’ or ‘)’ before ‘&’ token
./include/wx/utils.h:218: warning: type defaults to ‘int’ in declaration of ‘wxString’
./include/wx/utils.h:218: error: expected ‘;’, ‘,’ or ‘)’ before ‘&’ token
./include/wx/utils.h:268: error: expected ‘=’, ‘,’, ‘;’, ‘asm’ or ‘__attribute__’ before ‘wxShutdown’
./include/wx/utils.h:277: error: expected ‘=’, ‘,’, ‘;’, ‘asm’ or ‘__attribute__’ before ‘wxGetPowerType’
./include/wx/utils.h:288: error: expected ‘=’, ‘,’, ‘;’, ‘asm’ or ‘__attribute__’ before ‘wxGetBatteryState’
./include/wx/utils.h:295: error: expected declaration specifiers or ‘...’ before ‘wxSignal’
./include/wx/utils.h:296: error: expected declaration specifiers or ‘...’ before ‘wxKillError’
./include/wx/utils.h:297: error: expected ‘;’, ‘,’ or ‘)’ before ‘=’ token
./include/wx/utils.h:301: error: expected ‘=’, ‘,’, ‘;’, ‘asm’ or ‘__attribute__’ before ‘wxShell’
./include/wx/utils.h:305: error: expected ‘=’, ‘,’, ‘;’, ‘asm’ or ‘__attribute__’ before ‘wxShell’
./include/wx/utils.h:328: error: expected ‘=’, ‘,’, ‘;’, ‘asm’ or ‘__attribute__’ before ‘wxHandleFatalExceptions’
./include/wx/utils.h:334: error: expected ‘=’, ‘,’, ‘;’, ‘asm’ or ‘__attribute__’ before ‘wxLaunchDefaultBrowser’
./include/wx/utils.h:343: error: expected ‘=’, ‘,’, ‘;’, ‘asm’ or ‘__attribute__’ before ‘wxGetEnv’
./include/wx/utils.h:346: error: expected ‘=’, ‘,’, ‘;’, ‘asm’ or ‘__attribute__’ before ‘wxSetEnv’
./include/wx/utils.h:349: error: expected ‘=’, ‘,’, ‘;’, ‘asm’ or ‘__attribute__’ before ‘wxUnsetEnv’
./include/wx/utils.h:358: error: expected ‘=’, ‘,’, ‘;’, ‘asm’ or ‘__attribute__’ before ‘wxGetEmailAddress’
./include/wx/utils.h:359: error: expected ‘=’, ‘,’, ‘;’, ‘asm’ or ‘__attribute__’ before ‘wxGetEmailAddress’
./include/wx/utils.h:362: error: expected ‘=’, ‘,’, ‘;’, ‘asm’ or ‘__attribute__’ before ‘wxGetHostName’
./include/wx/utils.h:363: error: expected ‘=’, ‘,’, ‘;’, ‘asm’ or ‘__attribute__’ before ‘wxGetHostName’
./include/wx/utils.h:366: error: expected ‘=’, ‘,’, ‘;’, ‘asm’ or ‘__attribute__’ before ‘wxGetFullHostName’
./include/wx/utils.h:367: error: expected ‘=’, ‘,’, ‘;’, ‘asm’ or ‘__attribute__’ before ‘wxGetFullHostName’
./include/wx/utils.h:370: error: expected ‘=’, ‘,’, ‘;’, ‘asm’ or ‘__attribute__’ before ‘wxGetUserId’
./include/wx/utils.h:371: error: expected ‘=’, ‘,’, ‘;’, ‘asm’ or ‘__attribute__’ before ‘wxGetUserId’
./include/wx/utils.h:374: error: expected ‘=’, ‘,’, ‘;’, ‘asm’ or ‘__attribute__’ before ‘wxGetUserName’
./include/wx/utils.h:375: error: expected ‘=’, ‘,’, ‘;’, ‘asm’ or ‘__attribute__’ before ‘wxGetUserName’
./include/wx/utils.h:378: error: expected ‘=’, ‘,’, ‘;’, ‘asm’ or ‘__attribute__’ before ‘wxGetHomeDir’
./include/wx/utils.h:379: error: expected ‘)’ before ‘*’ token
./include/wx/utils.h:386: warning: type defaults to ‘int’ in declaration of ‘wxString’
./include/wx/utils.h:386: error: expected ‘;’, ‘,’ or ‘)’ before ‘&’ token
./include/wx/utils.h:390: error: expected ‘=’, ‘,’, ‘;’, ‘asm’ or ‘__attribute__’ before ‘wxGetDiskSpace’
./include/wx/utils.h:556: error: expected ‘=’, ‘,’, ‘;’, ‘asm’ or ‘__attribute__’ before ‘wxYield’
./include/wx/utils.h:559: error: expected ‘=’, ‘,’, ‘;’, ‘asm’ or ‘__attribute__’ before ‘wxYieldIfNeeded’
In file included from ./include/wx/wx.h:26,
                 from ./include/wx/wxprec.h:54:
./include/wx/stream.h:28: error: expected ‘=’, ‘,’, ‘;’, ‘asm’ or ‘__attribute__’ before ‘wxStreamBase’
./include/wx/stream.h:29: error: expected ‘=’, ‘,’, ‘;’, ‘asm’ or ‘__attribute__’ before ‘wxInputStream’
./include/wx/stream.h:30: error: expected ‘=’, ‘,’, ‘;’, ‘asm’ or ‘__attribute__’ before ‘wxOutputStream’
./include/wx/stream.h:32: error: expected ‘=’, ‘,’, ‘;’, ‘asm’ or ‘__attribute__’ before ‘&’ token
./include/wx/stream.h:33: error: expected ‘=’, ‘,’, ‘;’, ‘asm’ or ‘__attribute__’ before ‘&’ token
./include/wx/stream.h:35: error: expected ‘=’, ‘,’, ‘;’, ‘asm’ or ‘__attribute__’ before ‘&’ token
./include/wx/stream.h:70: error: expected ‘=’, ‘,’, ‘;’, ‘asm’ or ‘__attribute__’ before ‘wxStreamBase’
./include/wx/stream.h:125: error: expected ‘=’, ‘,’, ‘;’, ‘asm’ or ‘__attribute__’ before ‘wxInputStream’
./include/wx/stream.h:259: error: expected ‘=’, ‘,’, ‘;’, ‘asm’ or ‘__attribute__’ before ‘wxOutputStream’
./include/wx/stream.h:298: error: expected ‘=’, ‘,’, ‘;’, ‘asm’ or ‘__attribute__’ before ‘wxCountingOutputStream’
./include/wx/stream.h:320: error: expected ‘=’, ‘,’, ‘;’, ‘asm’ or ‘__attribute__’ before ‘wxFilterInputStream’
./include/wx/stream.h:339: error: expected ‘=’, ‘,’, ‘;’, ‘asm’ or ‘__attribute__’ before ‘wxFilterOutputStream’
./include/wx/stream.h:365: error: expected ‘=’, ‘,’, ‘;’, ‘asm’ or ‘__attribute__’ before ‘wxStreamBuffer’
./include/wx/stream.h:483: error: expected ‘=’, ‘,’, ‘;’, ‘asm’ or ‘__attribute__’ before ‘wxBufferedInputStream’
./include/wx/stream.h:520: error: expected ‘=’, ‘,’, ‘;’, ‘asm’ or ‘__attribute__’ before ‘wxBufferedOutputStream’
In file included from ./include/wx/stream.h:26,
                 from ./include/wx/image.h:24,
                 from ./include/wx/gtk/cursor.h:23,
                 from ./include/wx/cursor.h:24,
                 from ./include/wx/event.h:32,
                 from ./include/wx/wx.h:23,
                 from ./include/wx/wxprec.h:54:
./include/wx/filefn.h:370: error: expected ‘=’, ‘,’, ‘;’, ‘asm’ or ‘__attribute__’ before ‘wxFileExists’In file included from ./include/wx/wx.h:26,
                 from ./include/wx/wxprec.h:54:
./include/wx/stream.h:28: error: expected ‘=’, ‘,’, ‘;’, ‘asm’ or ‘__attribute__’ before ‘wxStreamBase’
./include/wx/filefn.h:421: error: expected ‘=’, ‘,’, ‘;’, ‘asm’ or ‘__attribute__’ before ‘wxFindNextFile’
./include/wx/stream.h:29: error: expected ‘=’, ‘,’, ‘;’, ‘asm’ or ‘__attribute__’ before ‘wxInputStream’./include/wx/filefn.h:424: error: expected ‘=’, ‘,’, ‘;’, ‘asm’ or ‘__attribute__’ before ‘wxIsWild’
./include/wx/filefn.h:429: error: expected ‘=’, ‘,’, ‘;’, ‘asm’ or ‘__attribute__’ before ‘wxMatchWild’
./include/wx/filefn.h:432: error: expected ‘=’, ‘,’, ‘;’, ‘asm’ or ‘__attribute__’ before ‘wxConcatFiles’
./include/wx/stream.h:32: error: expected ‘=’, ‘,’, ‘;’, ‘asm’ or ‘__attribute__’ before ‘&’ token
./include/wx/filefn.h:435: error: expected ‘=’, ‘,’, ‘;’, ‘asm’ or ‘__attribute__’ before ‘wxCopyFile’./include/wx/stream.h:33: error: expected ‘=’, ‘,’, ‘;’, ‘asm’ or ‘__attribute__’ before ‘&’ token
./include/wx/filefn.h:439: error: expected ‘=’, ‘,’, ‘;’, ‘asm’ or ‘__attribute__’ before ‘wxRemoveFile’
./include/wx/stream.h:35: error: expected ‘=’, ‘,’, ‘;’, ‘asm’ or ‘__attribute__’ before ‘&’ token
./include/wx/filefn.h:442: error: expected ‘=’, ‘,’, ‘;’, ‘asm’ or ‘__attribute__’ before ‘wxRenameFile’
./include/wx/filefn.h:449: error: expected ‘;’, ‘,’ or ‘)’ before ‘=’ token
./include/wx/stream.h:70: error: expected ‘=’, ‘,’, ‘;’, ‘asm’ or ‘__attribute__’ before ‘wxStreamBase’./include/wx/filefn.h:455: error: expected ‘=’, ‘,’, ‘;’, ‘asm’ or ‘__attribute__’ before ‘wxSetWorkingDirectory’
./include/wx/filefn.h:458: error: expected ‘=’, ‘,’, ‘;’, ‘asm’ or ‘__attribute__’ before ‘wxMkdir’
./include/wx/filefn.h:461: error: expected ‘=’, ‘,’, ‘;’, ‘asm’ or ‘__attribute__’ before ‘wxRmdir’
./include/wx/filefn.h:464: error: expected ‘=’, ‘,’, ‘;’, ‘asm’ or ‘__attribute__’ before ‘wxGetFileKind’
./include/wx/stream.h:125: error: expected ‘=’, ‘,’, ‘;’, ‘asm’ or ‘__attribute__’ before ‘wxInputStream’
./include/wx/filefn.h:470: error: expected ‘=’, ‘,’, ‘;’, ‘asm’ or ‘__attribute__’ before ‘wxPathExists’
./include/wx/filefn.h:471: error: expected ‘=’, ‘,’, ‘;’, ‘asm’ or ‘__attribute__’ before ‘wxPathExists’
./include/wx/filefn.h:523: error: expected ‘=’, ‘,’, ‘;’, ‘asm’ or ‘__attribute__’ before ‘wxIsPathSeparator’./include/wx/stream.h:259: error: expected ‘=’, ‘,’, ‘;’, ‘asm’ or ‘__attribute__’ before ‘wxOutputStream’
./include/wx/filefn.h:534: error: expected ‘=’, ‘,’, ‘;’, ‘asm’ or ‘__attribute__’ before ‘wxEndsWithPathSeparator’
./include/wx/filefn.h:539: error: expected declaration specifiers or ‘...’ before ‘wxString’
./include/wx/filefn.h:540: error: expected declaration specifiers or ‘...’ before ‘wxString’
./include/wx/filefn.h:541: error: expected declaration specifiers or ‘...’ before ‘wxString’
./include/wx/stream.h:320: error: expected ‘=’, ‘,’, ‘;’, ‘asm’ or ‘__attribute__’ before ‘wxFilterInputStream’./include/wx/filefn.h:544: error: expected ‘=’, ‘,’, ‘;’, ‘asm’ or ‘__attribute__’ before ‘wxFindFileInPath’
./include/wx/stream.h:339: error: expected ‘=’, ‘,’, ‘;’, ‘asm’ or ‘__attribute__’ before ‘wxFilterOutputStrea
./include/wx/filefn.h:551: warning: type defaults to ‘int’ in declaration of ‘wxString’
./include/wx/stream.h:365: error: expected ‘=’, ‘,’, ‘;’, ‘asm’ or ‘__attribute__’ before ‘wxStreamBuffer’
./include/wx/filefn.h:558: warning: type defaults to ‘int’ in declaration of ‘wxString’
./include/wx/filefn.h:558: error: expected ‘;’, ‘,’ or ‘)’ before ‘&’ token
./include/wx/filefn.h:567: error: expected ‘=’, ‘,’, ‘;’, ‘asm’ or ‘__attribute__’ before ‘wxUmaskChanger’
./include/wx/filefn.h:600: error: expected ‘=’, ‘,’, ‘;’, ‘asm’ or ‘__attribute__’ before ‘wxPathList’
./include/wx/stream.h:483: error: expected ‘=’, ‘,’, ‘;’, ‘asm’ or ‘__attribute__’ before ‘wxBufferedInputStream’
In file included from ./include/wx/image.h:24,
                 from ./include/wx/gtk/cursor.h:23,
                 from ./include/wx/cursor.h:24,
                 from ./include/wx/event.h:32,
                 from ./include/wx/wx.h:23,
                 from ./include/wx/wxprec.h:54:
./include/wx/stream.h:28: error: expected ‘=’, ‘,’, ‘;’, ‘asm’ or ‘__attribute__’ before ‘wxStreamBase’
./include/wx/stream.h:29: error: expected ‘=’, ‘,’, ‘;’, ‘asm’ or ‘__attribute__’ before ‘wxInputStream’
./include/wx/stream.h:520: error: expected ‘=’, ‘,’, ‘;’, ‘asm’ or ‘__attribute__’ before ‘wxBufferedOutputStream’./include/wx/stream.h:32: error: expected ‘=’, ‘,’, ‘;’, ‘asm’ or ‘__attribute__’ before ‘&’ token
./include/wx/stream.h:33: error: expected ‘=’, ‘,’, ‘;’, ‘asm’ or ‘__attribute__’ before ‘&’ token
./include/wx/stream.h:35: error: expected ‘=’, ‘,’, ‘;’, ‘asm’ or ‘__attribute__’ before ‘&’ token
./include/wx/stream.h:70: error: expected ‘=’, ‘,’, ‘;’, ‘asm’ or ‘__attribute__’ before ‘wxStreamBase’
./include/wx/stream.h:125: error: expected ‘=’, ‘,’, ‘;’, ‘asm’ or ‘__attribute__’ before ‘wxInputStream’
./include/wx/stream.h:259: error: expected ‘=’, ‘,’, ‘;’, ‘asm’ or ‘__attribute__’ before ‘wxOutputStream’
./include/wx/stream.h:298: error: expected ‘=’, ‘,’, ‘;’, ‘asm’ or ‘__attribute__’ before ‘wxCountingOutputStream’
./include/wx/stream.h:320: error: expected ‘=’, ‘,’, ‘;’, ‘asm’ or ‘__attribute__’ before ‘wxFilterInputStream’
./include/wx/stream.h:339: error: expected ‘=’, ‘,’, ‘;’, ‘asm’ or ‘__attribute__’ before ‘wxFilterOutputStream’
./include/wx/stream.h:365: error: expected ‘=’, ‘,’, ‘;’, ‘asm’ or ‘__attribute__’ before ‘wxStreamBuffer’
./include/wx/stream.h:483: error: expected ‘=’, ‘,’, ‘;’, ‘asm’ or ‘__attribute__’ before ‘wxBufferedInputStream’
./include/wx/stream.h:520: error: expected ‘=’, ‘,’, ‘;’, ‘asm’ or ‘__attribute__’ before ‘wxBufferedOutputStream’
In file included from ./include/wx/gtk/cursor.h:23,
                 from ./include/wx/cursor.h:24,
                 from ./include/wx/event.h:32,
                 from ./include/wx/wx.h:23,
                 from ./include/wx/wxprec.h:54:
./include/wx/image.h:60: error: expected ‘=’, ‘,’, ‘;’, ‘asm’ or ‘__attribute__’ before ‘wxImageHandler’
./include/wx/image.h:61: error: expected ‘=’, ‘,’, ‘;’, ‘asm’ or ‘__attribute__’ before ‘wxImage’
./include/wx/image.h:62: error: expected ‘=’, ‘,’, ‘;’, ‘asm’ or ‘__attribute__’ before ‘wxPalette’
./include/wx/image.h:68: error: expected ‘=’, ‘,’, ‘;’, ‘asm’ or ‘__attribute__’ before ‘wxImageHandler’
./include/wx/image.h:115: error: expected ‘=’, ‘,’, ‘;’, ‘asm’ or ‘__attribute__’ before ‘wxImageHistogramEntry’
./include/wx/image.h:123: error: expected ‘=’, ‘,’, ‘;’, ‘asm’ or ‘__attribute__’ before ‘wxImageHistogramBase_wxImplementation_Pair’
./include/wx/image.h:123: error: expected ‘=’, ‘,’, ‘;’, ‘asm’ or ‘__attribute__’ before ‘wxImageHistogramBase_wxImplementation_KeyEx’
./include/wx/image.h:123: error: expected ‘=’, ‘,’, ‘;’, ‘asm’ or ‘__attribute__’ before ‘wxImageHistogramBase_wxImplementation_HashTable’
./include/wx/image.h:123: error: expected ‘=’, ‘,’, ‘;’, ‘asm’ or ‘__attribute__’ before ‘wxImageHistogramBase’
./include/wx/image.h:127: error: expected ‘=’, ‘,’, ‘;’, ‘asm’ or ‘__attribute__’ before ‘wxImageHistogram’
./include/wx/image.h:157: error: expected ‘=’, ‘,’, ‘;’, ‘asm’ or ‘__attribute__’ before ‘wxImage’
./include/wx/image.h:421: error: expected ‘=’, ‘,’, ‘;’, ‘asm’ or ‘__attribute__’ before ‘wxNullImage’
In file included from ./include/wx/image.h:427,
                 from ./include/wx/gtk/cursor.h:23,
                 from ./include/wx/cursor.h:24,
                 from ./include/wx/event.h:32,
                 from ./include/wx/wx.h:23,
                 from ./include/wx/wxprec.h:54:
./include/wx/imagbmp.h:54: error: expected ‘=’, ‘,’, ‘;’, ‘asm’ or ‘__attribute__’ before ‘wxBMPHandler’
./include/wx/imagbmp.h:88: error: expected ‘=’, ‘,’, ‘;’, ‘asm’ or ‘__attribute__’ before ‘wxICOHandler’
./include/wx/imagbmp.h:116: error: expected ‘=’, ‘,’, ‘;’, ‘asm’ or ‘__attribute__’ before ‘wxCURHandler’
./include/wx/imagbmp.h:142: error: expected ‘=’, ‘,’, ‘;’, ‘asm’ or ‘__attribute__’ before ‘wxANIHandler’
In file included from ./include/wx/image.h:428,
                 from ./include/wx/gtk/cursor.h:23,
                 from ./include/wx/cursor.h:24,
                 from ./include/wx/event.h:32,
                 from ./include/wx/wx.h:23,
                 from ./include/wx/wxprec.h:54:
./include/wx/imagpng.h:37: error: expected ‘=’, ‘,’, ‘;’, ‘asm’ or ‘__attribute__’ before ‘wxPNGHandler’
In file included from ./include/wx/image.h:429,
                 from ./include/wx/gtk/cursor.h:23,
                 from ./include/wx/cursor.h:24,
                 from ./include/wx/event.h:32,
                 from ./include/wx/wx.h:23,
                 from ./include/wx/wxprec.h:54:
./include/wx/imaggif.h:26: error: expected ‘=’, ‘,’, ‘;’, ‘asm’ or ‘__attribute__’ before ‘wxGIFHandler’
In file included from ./include/wx/image.h:430,
                 from ./include/wx/gtk/cursor.h:23,
                 from ./include/wx/cursor.h:24,
                 from ./include/wx/event.h:32,
                 from ./include/wx/wx.h:23,
                 from ./include/wx/wxprec.h:54:
./include/wx/imagpcx.h:25: error: expected ‘=’, ‘,’, ‘;’, ‘asm’ or ‘__attribute__’ before ‘wxPCXHandler’
In file included from ./include/wx/image.h:431,
                 from ./include/wx/gtk/cursor.h:23,
                 from ./include/wx/cursor.h:24,
                 from ./include/wx/event.h:32,
                 from ./include/wx/wx.h:23,
                 from ./include/wx/wxprec.h:54:
./include/wx/imagjpeg.h:27: error: expected ‘=’, ‘,’, ‘;’, ‘asm’ or ‘__attribute__’ before ‘wxJPEGHandler’
In file included from ./include/wx/image.h:432,
                 from ./include/wx/gtk/cursor.h:23,
                 from ./include/wx/cursor.h:24,
                 from ./include/wx/event.h:32,
                 from ./include/wx/wx.h:23,
                 from ./include/wx/wxprec.h:54:
./include/wx/imagtiff.h:33: error: expected ‘=’, ‘,’, ‘;’, ‘asm’ or ‘__attribute__’ before ‘wxTIFFHandler’
In file included from ./include/wx/image.h:433,
                 from ./include/wx/gtk/cursor.h:23,
                 from ./include/wx/cursor.h:24,
                 from ./include/wx/event.h:32,
                 from ./include/wx/wx.h:23,
                 from ./include/wx/wxprec.h:54:
./include/wx/imagpnm.h:24: error: expected ‘=’, ‘,’, ‘;’, ‘asm’ or ‘__attribute__’ before ‘wxPNMHandler’
In file included from ./include/wx/image.h:434,
                 from ./include/wx/gtk/cursor.h:23,
                 from ./include/wx/cursor.h:24,
                 from ./include/wx/event.h:32,
                 from ./include/wx/wx.h:23,
                 from ./include/wx/wxprec.h:54:
./include/wx/imagxpm.h:24: error: expected ‘=’, ‘,’, ‘;’, ‘asm’ or ‘__attribute__’ before ‘wxXPMHandler’
In file included from ./include/wx/cursor.h:24,
                 from ./include/wx/event.h:32,
                 from ./include/wx/wx.h:23,
                 from ./include/wx/wxprec.h:54:
./include/wx/gtk/cursor.h:30: error: expected ‘=’, ‘,’, ‘;’, ‘asm’ or ‘__attribute__’ before ‘wxCursor’
In file included from ./include/wx/cursor.h:37,
                 from ./include/wx/event.h:32,
                 from ./include/wx/wx.h:23,
                 from ./include/wx/wxprec.h:54:
./include/wx/utils.h:34: error: expected ‘=’, ‘,’, ‘;’, ‘asm’ or ‘__attribute__’ before ‘wxArrayString’
In file included from ./include/wx/utils.h:38,
                 from ./include/wx/cursor.h:37,
                 from ./include/wx/event.h:32,
                 from ./include/wx/wx.h:23,
                 from ./include/wx/wxprec.h:54:
./include/wx/longlong.h:85: error: expected ‘=’, ‘,’, ‘;’, ‘asm’ or ‘__attribute__’ before ‘wxLongLongNative’
./include/wx/longlong.h:86: error: expected ‘=’, ‘,’, ‘;’, ‘asm’ or ‘__attribute__’ before ‘wxULongLongNative’
./include/wx/longlong.h:87: error: expected ‘=’, ‘,’, ‘;’, ‘asm’ or ‘__attribute__’ before ‘wxLongLong’
./include/wx/longlong.h:88: error: expected ‘=’, ‘,’, ‘;’, ‘asm’ or ‘__attribute__’ before ‘wxULongLong’
In file included from ./include/wx/utils.h:38,
                 from ./include/wx/cursor.h:37,
                 from ./include/wx/event.h:32,
                 from ./include/wx/wx.h:23,
                 from ./include/wx/wxprec.h:54:
./include/wx/longlong.h:103: error: expected ‘=’, ‘,’, ‘;’, ‘asm’ or ‘__attribute__’ before ‘wxLongLongNative’
./include/wx/longlong.h:321: error: expected ‘=’, ‘,’, ‘;’, ‘asm’ or ‘__attribute__’ before ‘wxULongLongNative’
./include/wx/longlong.h:912: error: expected ‘=’, ‘,’, ‘;’, ‘asm’ or ‘__attribute__’ before ‘operator’
./include/wx/longlong.h:913: error: expected ‘=’, ‘,’, ‘;’, ‘asm’ or ‘__attribute__’ before ‘operator’
./include/wx/longlong.h:914: error: expected ‘=’, ‘,’, ‘;’, ‘asm’ or ‘__attribute__’ before ‘operator’
./include/wx/longlong.h:915: error: expected ‘=’, ‘,’, ‘;’, ‘asm’ or ‘__attribute__’ before ‘operator’
./include/wx/longlong.h:916: error: expected ‘=’, ‘,’, ‘;’, ‘asm’ or ‘__attribute__’ before ‘operator’
./include/wx/longlong.h:917: error: expected ‘=’, ‘,’, ‘;’, ‘asm’ or ‘__attribute__’ before ‘operator’
./include/wx/longlong.h:919: error: expected ‘=’, ‘,’, ‘;’, ‘asm’ or ‘__attribute__’ before ‘operator’
./include/wx/longlong.h:920: error: expected ‘=’, ‘,’, ‘;’, ‘asm’ or ‘__attribute__’ before ‘operator’
./include/wx/longlong.h:925: error: expected ‘=’, ‘,’, ‘;’, ‘asm’ or ‘__attribute__’ before ‘operator’
./include/wx/longlong.h:926: error: expected ‘=’, ‘,’, ‘;’, ‘asm’ or ‘__attribute__’ before ‘operator’
./include/wx/longlong.h:927: error: expected ‘=’, ‘,’, ‘;’, ‘asm’ or ‘__attribute__’ before ‘operator’
./include/wx/longlong.h:928: error: expected ‘=’, ‘,’, ‘;’, ‘asm’ or ‘__attribute__’ before ‘operator’
./include/wx/longlong.h:929: error: expected ‘=’, ‘,’, ‘;’, ‘asm’ or ‘__attribute__’ before ‘operator’
./include/wx/longlong.h:930: error: expected ‘=’, ‘,’, ‘;’, ‘asm’ or ‘__attribute__’ before ‘operator’
./include/wx/longlong.h:932: error: expected ‘=’, ‘,’, ‘;’, ‘asm’ or ‘__attribute__’ before ‘operator’
./include/wx/longlong.h:934: error: expected ‘=’, ‘,’, ‘;’, ‘asm’ or ‘__attribute__’ before ‘operator’
In file included from ./include/wx/cursor.h:37,
                 from ./include/wx/event.h:32,
                 from ./include/wx/wx.h:23,
                 from ./include/wx/wxprec.h:54:
./include/wx/utils.h:51: error: expected ‘=’, ‘,’, ‘;’, ‘asm’ or ‘__attribute__’ before ‘wxProcess’
./include/wx/utils.h:52: error: expected ‘=’, ‘,’, ‘;’, ‘asm’ or ‘__attribute__’ before ‘wxFrame’
./include/wx/utils.h:53: error: expected ‘=’, ‘,’, ‘;’, ‘asm’ or ‘__attribute__’ before ‘wxWindow’
./include/wx/utils.h:54: error: expected ‘=’, ‘,’, ‘;’, ‘asm’ or ‘__attribute__’ before ‘wxWindowList’
./include/wx/utils.h:55: error: expected ‘=’, ‘,’, ‘;’, ‘asm’ or ‘__attribute__’ before ‘wxPoint’
./include/wx/utils.h:101: error: expected ‘=’, ‘,’, ‘;’, ‘asm’ or ‘__attribute__’ before ‘wxGetOsDescription’
./include/wx/utils.h:104: error: expected ‘;’, ‘,’ or ‘)’ before ‘=’ token
./include/wx/utils.h:108: error: expected ‘=’, ‘,’, ‘;’, ‘asm’ or ‘__attribute__’ before ‘wxNow’
./include/wx/utils.h:113: error: expected ‘=’, ‘,’, ‘;’, ‘asm’ or ‘__attribute__’ before ‘wxGetDataDir’
./include/wx/utils.h:121: error: expected ‘=’, ‘,’, ‘;’, ‘asm’ or ‘__attribute__’ before ‘wxGetKeyState’
./include/wx/utils.h:127: error: expected ‘=’, ‘,’, ‘;’, ‘asm’ or ‘__attribute__’ before ‘wxSetDetectableAutoRepeat’
./include/wx/utils.h:155: error: expected ‘;’, ‘,’ or ‘)’ before ‘=’ token
./include/wx/utils.h:157: error: expected ‘;’, ‘,’ or ‘)’ before ‘=’ token
./include/wx/utils.h:166: warning: type defaults to ‘int’ in declaration of ‘wxString’
./include/wx/utils.h:166: error: expected ‘;’, ‘,’ or ‘)’ before ‘&’ token
./include/wx/utils.h:170: error: expected ‘=’, ‘,’, ‘;’, ‘asm’ or ‘__attribute__’ before ‘wxDecToHex’
./include/wx/utils.h:206: error: expected ‘;’, ‘,’ or ‘)’ before ‘=’ token
./include/wx/utils.h:208: warning: type defaults to ‘int’ in declaration of ‘wxString’
./include/wx/utils.h:208: error: expected ‘;’, ‘,’ or ‘)’ before ‘&’ token
./include/wx/utils.h:213: warning: type defaults to ‘int’ in declaration of ‘wxString’
./include/wx/utils.h:213: error: expected ‘;’, ‘,’ or ‘)’ before ‘&’ token
./include/wx/utils.h:218: warning: type defaults to ‘int’ in declaration of ‘wxString’
./include/wx/utils.h:218: error: expected ‘;’, ‘,’ or ‘)’ before ‘&’ token
./include/wx/utils.h:268: error: expected ‘=’, ‘,’, ‘;’, ‘asm’ or ‘__attribute__’ before ‘wxShutdown’
./include/wx/utils.h:277: error: expected ‘=’, ‘,’, ‘;’, ‘asm’ or ‘__attribute__’ before ‘wxGetPowerType’
./include/wx/utils.h:288: error: expected ‘=’, ‘,’, ‘;’, ‘asm’ or ‘__attribute__’ before ‘wxGetBatteryState’
./include/wx/utils.h:295: error: expected declaration specifiers or ‘...’ before ‘wxSignal’
./include/wx/utils.h:296: error: expected declaration specifiers or ‘...’ before ‘wxKillError’
./include/wx/utils.h:297: error: expected ‘;’, ‘,’ or ‘)’ before ‘=’ token
./include/wx/utils.h:301: error: expected ‘=’, ‘,’, ‘;’, ‘asm’ or ‘__attribute__’ before ‘wxShell’
./include/wx/utils.h:305: error: expected ‘=’, ‘,’, ‘;’, ‘asm’ or ‘__attribute__’ before ‘wxShell’
./include/wx/utils.h:328: error: expected ‘=’, ‘,’, ‘;’, ‘asm’ or ‘__attribute__’ before ‘wxHandleFatalExceptions’
./include/wx/utils.h:334: error: expected ‘=’, ‘,’, ‘;’, ‘asm’ or ‘__attribute__’ before ‘wxLaunchDefaultBrowser’
./include/wx/utils.h:343: error: expected ‘=’, ‘,’, ‘;’, ‘asm’ or ‘__attribute__’ before ‘wxGetEnv’
./include/wx/utils.h:346: error: expected ‘=’, ‘,’, ‘;’, ‘asm’ or ‘__attribute__’ before ‘wxSetEnv’
./include/wx/utils.h:349: error: expected ‘=’, ‘,’, ‘;’, ‘asm’ or ‘__attribute__’ before ‘wxUnsetEnv’
./include/wx/utils.h:358: error: expected ‘=’, ‘,’, ‘;’, ‘asm’ or ‘__attribute__’ before ‘wxGetEmailAddress’
./include/wx/utils.h:359: error: expected ‘=’, ‘,’, ‘;’, ‘asm’ or ‘__attribute__’ before ‘wxGetEmailAddress’
./include/wx/utils.h:362: error: expected ‘=’, ‘,’, ‘;’, ‘asm’ or ‘__attribute__’ before ‘wxGetHostName’
./include/wx/utils.h:363: error: expected ‘=’, ‘,’, ‘;’, ‘asm’ or ‘__attribute__’ before ‘wxGetHostName’
./include/wx/utils.h:366: error: expected ‘=’, ‘,’, ‘;’, ‘asm’ or ‘__attribute__’ before ‘wxGetFullHostName’
./include/wx/utils.h:367: error: expected ‘=’, ‘,’, ‘;’, ‘asm’ or ‘__attribute__’ before ‘wxGetFullHostName’
./include/wx/utils.h:370: error: expected ‘=’, ‘,’, ‘;’, ‘asm’ or ‘__attribute__’ before ‘wxGetUserId’
./include/wx/utils.h:371: error: expected ‘=’, ‘,’, ‘;’, ‘asm’ or ‘__attribute__’ before ‘wxGetUserId’
./include/wx/utils.h:374: error: expected ‘=’, ‘,’, ‘;’, ‘asm’ or ‘__attribute__’ before ‘wxGetUserName’
./include/wx/utils.h:375: error: expected ‘=’, ‘,’, ‘;’, ‘asm’ or ‘__attribute__’ before ‘wxGetUserName’
./include/wx/utils.h:378: error: expected ‘=’, ‘,’, ‘;’, ‘asm’ or ‘__attribute__’ before ‘wxGetHomeDir’
./include/wx/utils.h:379: error: expected ‘)’ before ‘*’ token
./include/wx/utils.h:386: warning: type defaults to ‘int’ in declaration of ‘wxString’
./include/wx/utils.h:386: error: expected ‘;’, ‘,’ or ‘)’ before ‘&’ token
./include/wx/utils.h:390: error: expected ‘=’, ‘,’, ‘;’, ‘asm’ or ‘__attribute__’ before ‘wxGetDiskSpace’
./include/wx/utils.h:400: error: expected ‘;’, ‘,’ or ‘)’ before ‘=’ token
./include/wx/utils.h:401: error: expected ‘=’, ‘,’, ‘;’, ‘asm’ or ‘__attribute__’ before ‘wxStripMenuCodes’
./include/wx/utils.h:404: error: expected ‘=’, ‘,’, ‘;’, ‘asm’ or ‘__attribute__’ before ‘wxAcceleratorEntry’
./include/wx/utils.h:405: error: expected ‘=’, ‘,’, ‘;’, ‘asm’ or ‘__attribute__’ before ‘*’ token
./include/wx/utils.h:413: error: expected ‘)’ before ‘*’ token
./include/wx/utils.h:417: error: expected ‘=’, ‘,’, ‘;’, ‘asm’ or ‘__attribute__’ before ‘*’ token
./include/wx/utils.h:418: error: expected ‘=’, ‘,’, ‘;’, ‘asm’ or ‘__attribute__’ before ‘*’ token
./include/wx/utils.h:425: error: expected ‘=’, ‘,’, ‘;’, ‘asm’ or ‘__attribute__’ before ‘*’ token
./include/wx/utils.h:430: error: expected ‘=’, ‘,’, ‘;’, ‘asm’ or ‘__attribute__’ before ‘*’ token
./include/wx/utils.h:437: error: expected ‘=’, ‘,’, ‘;’, ‘asm’ or ‘__attribute__’ before ‘wxSafeYield’
./include/wx/utils.h:440: error: expected ‘)’ before ‘enable’
./include/wx/utils.h:444: error: expected ‘=’, ‘,’, ‘;’, ‘asm’ or ‘__attribute__’ before ‘wxCheckForInterrupt’
./include/wx/utils.h:451: error: expected ‘=’, ‘,’, ‘;’, ‘asm’ or ‘__attribute__’ before ‘wxWindowDisabler’
./include/wx/utils.h:468: error: expected ‘=’, ‘,’, ‘;’, ‘asm’ or ‘__attribute__’ before ‘wxCursor’
./include/wx/utils.h:469: error: expected ‘=’, ‘,’, ‘;’, ‘asm’ or ‘__attribute__’ before ‘*’ token
./include/wx/utils.h:470: error: expected ‘)’ before ‘*’ token
./include/wx/utils.h:476: error: expected ‘=’, ‘,’, ‘;’, ‘asm’ or ‘__attribute__’ before ‘wxIsBusy’
./include/wx/utils.h:479: error: expected ‘=’, ‘,’, ‘;’, ‘asm’ or ‘__attribute__’ before ‘wxBusyCursor’
./include/wx/utils.h:556: error: expected ‘=’, ‘,’, ‘;’, ‘asm’ or ‘__attribute__’ before ‘wxYield’
./include/wx/utils.h:559: error: expected ‘=’, ‘,’, ‘;’, ‘asm’ or ‘__attribute__’ before ‘wxYieldIfNeeded’
In file included from ./include/wx/event.h:32,
                 from ./include/wx/wx.h:23,
                 from ./include/wx/wxprec.h:54:
./include/wx/cursor.h:56: error: expected ‘=’, ‘,’, ‘;’, ‘asm’ or ‘__attribute__’ before ‘wxBusyCursorSuspender’
In file included from ./include/wx/event.h:35,
                 from ./include/wx/wx.h:23,
                 from ./include/wx/wxprec.h:54:
./include/wx/thread.h:117: error: expected ‘=’, ‘,’, ‘;’, ‘asm’ or ‘__attribute__’ before ‘wxThreadHelper’
./include/wx/thread.h:118: error: expected ‘=’, ‘,’, ‘;’, ‘asm’ or ‘__attribute__’ before ‘wxConditionInternal’
./include/wx/thread.h:119: error: expected ‘=’, ‘,’, ‘;’, ‘asm’ or ‘__attribute__’ before ‘wxMutexInternal’
./include/wx/thread.h:120: error: expected ‘=’, ‘,’, ‘;’, ‘asm’ or ‘__attribute__’ before ‘wxSemaphoreInternal’
./include/wx/thread.h:121: error: expected ‘=’, ‘,’, ‘;’, ‘asm’ or ‘__attribute__’ before ‘wxThreadInternal’
./include/wx/thread.h:132: error: expected ‘=’, ‘,’, ‘;’, ‘asm’ or ‘__attribute__’ before ‘wxMutex’
./include/wx/thread.h:175: error: expected ‘=’, ‘,’, ‘;’, ‘asm’ or ‘__attribute__’ before ‘wxMutexLocker’
./include/wx/thread.h:224: error: expected ‘=’, ‘,’, ‘;’, ‘asm’ or ‘__attribute__’ before ‘wxCriticalSection’
./include/wx/thread.h:273: error: expected ‘=’, ‘,’, ‘;’, ‘asm’ or ‘__attribute__’ before ‘:’ token
./include/wx/thread.h:274: error: expected ‘=’, ‘,’, ‘;’, ‘asm’ or ‘__attribute__’ before ‘:’ token
./include/wx/thread.h:276: error: expected ‘=’, ‘,’, ‘;’, ‘asm’ or ‘__attribute__’ before ‘:’ token
./include/wx/thread.h:277: error: expected ‘=’, ‘,’, ‘;’, ‘asm’ or ‘__attribute__’ before ‘:’ token
./include/wx/thread.h:285: error: expected ‘=’, ‘,’, ‘;’, ‘asm’ or ‘__attribute__’ before ‘wxCriticalSectionLocker’
./include/wx/thread.h:310: error: expected ‘=’, ‘,’, ‘;’, ‘asm’ or ‘__attribute__’ before ‘wxCondition’
./include/wx/thread.h:372: error: expected ‘=’, ‘,’, ‘;’, ‘asm’ or ‘__attribute__’ before ‘wxSemaphore’
./include/wx/thread.h:427: error: expected ‘=’, ‘,’, ‘;’, ‘asm’ or ‘__attribute__’ before ‘wxThread’
./include/wx/thread.h:592: error: expected ‘=’, ‘,’, ‘;’, ‘asm’ or ‘__attribute__’ before ‘wxThreadHelperThread’
./include/wx/thread.h:620: error: expected ‘=’, ‘,’, ‘;’, ‘asm’ or ‘__attribute__’ before ‘wxThreadHelper’
./include/wx/thread.h:662: error: expected ‘=’, ‘,’, ‘;’, ‘asm’ or ‘__attribute__’ before ‘:’ token
./include/wx/thread.h:685: error: expected ‘=’, ‘,’, ‘;’, ‘asm’ or ‘__attribute__’ before ‘wxIsMainThread’
./include/wx/thread.h:728: error: expected ‘=’, ‘,’, ‘;’, ‘asm’ or ‘__attribute__’ before ‘wxMutexGuiLocker’
In file included from ./include/wx/wx.h:23,
                 from ./include/wx/wxprec.h:54:
./include/wx/event.h:43: error: expected ‘=’, ‘,’, ‘;’, ‘asm’ or ‘__attribute__’ before ‘wxList’
./include/wx/event.h:46: error: expected ‘=’, ‘,’, ‘;’, ‘asm’ or ‘__attribute__’ before ‘wxDC’
./include/wx/event.h:47: error: expected ‘=’, ‘,’, ‘;’, ‘asm’ or ‘__attribute__’ before ‘wxMenu’
./include/wx/event.h:48: error: expected ‘=’, ‘,’, ‘;’, ‘asm’ or ‘__attribute__’ before ‘wxWindow’
./include/wx/event.h:49: error: expected ‘=’, ‘,’, ‘;’, ‘asm’ or ‘__attribute__’ before ‘wxWindowBase’
./include/wx/event.h:52: error: expected ‘=’, ‘,’, ‘;’, ‘asm’ or ‘__attribute__’ before ‘wxEvtHandler’
./include/wx/event.h:337: error: expected ‘=’, ‘,’, ‘;’, ‘asm’ or ‘__attribute__’ before ‘wxEvent’
./include/wx/event.h:433: error: expected ‘=’, ‘,’, ‘;’, ‘asm’ or ‘__attribute__’ before ‘wxPropagationDisabler’
./include/wx/event.h:456: error: expected ‘=’, ‘,’, ‘;’, ‘asm’ or ‘__attribute__’ before ‘wxPropagateOnce’
./include/wx/event.h:502: error: expected ‘=’, ‘,’, ‘;’, ‘asm’ or ‘__attribute__’ before ‘wxCommandEvent’
./include/wx/event.h:504: error: expected ‘=’, ‘,’, ‘;’, ‘asm’ or ‘__attribute__’ before ‘wxCommandEventStringHelper’
./include/wx/event.h:528: error: expected ‘=’, ‘,’, ‘;’, ‘asm’ or ‘__attribute__’ before ‘wxCommandEvent’
./include/wx/event.h:595: error: expected ‘=’, ‘,’, ‘;’, ‘asm’ or ‘__attribute__’ before ‘:’ token
./include/wx/event.h:600: error: expected ‘=’, ‘,’, ‘;’, ‘asm’ or ‘__attribute__’ before ‘:’ token
./include/wx/event.h:605: error: expected ‘=’, ‘,’, ‘;’, ‘asm’ or ‘__attribute__’ before ‘:’ token
./include/wx/event.h:613: error: expected ‘=’, ‘,’, ‘;’, ‘asm’ or ‘__attribute__’ before ‘wxNotifyEvent’
./include/wx/event.h:656: error: expected ‘=’, ‘,’, ‘;’, ‘asm’ or ‘__attribute__’ before ‘wxScrollEvent’
./include/wx/event.h:686: error: expected ‘=’, ‘,’, ‘;’, ‘asm’ or ‘__attribute__’ before ‘wxScrollWinEvent’
./include/wx/event.h:753: error: expected ‘=’, ‘,’, ‘;’, ‘asm’ or ‘__attribute__’ before ‘wxMouseEvent’
./include/wx/event.h:915: error: expected ‘=’, ‘,’, ‘;’, ‘asm’ or ‘__attribute__’ before ‘wxSetCursorEvent’
./include/wx/event.h:957: error: expected ‘=’, ‘,’, ‘;’, ‘asm’ or ‘__attribute__’ before ‘wxKeyEvent’
./include/wx/event.h:1083: error: expected ‘=’, ‘,’, ‘;’, ‘asm’ or ‘__attribute__’ before ‘wxSizeEvent’
./include/wx/event.h:1121: error: expected ‘=’, ‘,’, ‘;’, ‘asm’ or ‘__attribute__’ before ‘wxMoveEvent’
./include/wx/event.h:1170: error: expected ‘=’, ‘,’, ‘;’, ‘asm’ or ‘__attribute__’ before ‘wxPaintEvent’
./include/wx/event.h:1203: error: expected ‘=’, ‘,’, ‘;’, ‘asm’ or ‘__attribute__’ before ‘wxNcPaintEvent’
./include/wx/event.h:1221: error: expected ‘=’, ‘,’, ‘;’, ‘asm’ or ‘__attribute__’ before ‘wxEraseEvent’
./include/wx/event.h:1255: error: expected ‘=’, ‘,’, ‘;’, ‘asm’ or ‘__attribute__’ before ‘wxFocusEvent’
./include/wx/event.h:1283: error: expected ‘=’, ‘,’, ‘;’, ‘asm’ or ‘__attribute__’ before ‘wxChildFocusEvent’
./include/wx/event.h:1303: error: expected ‘=’, ‘,’, ‘;’, ‘asm’ or ‘__attribute__’ before ‘wxActivateEvent’
./include/wx/event.h:1329: error: expected ‘=’, ‘,’, ‘;’, ‘asm’ or ‘__attribute__’ before ‘wxInitDialogEvent’
./include/wx/event.h:1349: error: expected ‘=’, ‘,’, ‘;’, ‘asm’ or ‘__attribute__’ before ‘wxMenuEvent’
./include/wx/event.h:1384: error: expected ‘=’, ‘,’, ‘;’, ‘asm’ or ‘__attribute__’ before ‘wxCloseEvent’
./include/wx/event.h:1437: error: expected ‘=’, ‘,’, ‘;’, ‘asm’ or ‘__attribute__’ before ‘wxShowEvent’
./include/wx/event.h:1463: error: expected ‘=’, ‘,’, ‘;’, ‘asm’ or ‘__attribute__’ before ‘wxIconizeEvent’
./include/wx/event.h:1488: error: expected ‘=’, ‘,’, ‘;’, ‘asm’ or ‘__attribute__’ before ‘wxMaximizeEvent’
./include/wx/event.h:1526: error: expected ‘=’, ‘,’, ‘;’, ‘asm’ or ‘__attribute__’ before ‘wxJoystickEvent’
./include/wx/event.h:1609: error: expected ‘=’, ‘,’, ‘;’, ‘asm’ or ‘__attribute__’ before ‘wxDropFilesEvent’
./include/wx/event.h:1673: error: expected ‘=’, ‘,’, ‘;’, ‘asm’ or ‘__attribute__’ before ‘wxUpdateUIEvent’
./include/wx/event.h:1752: error: expected ‘=’, ‘,’, ‘;’, ‘asm’ or ‘__attribute__’ before ‘wxSysColourChangedEvent’
./include/wx/event.h:1771: error: expected ‘=’, ‘,’, ‘;’, ‘asm’ or ‘__attribute__’ before ‘wxMouseCaptureChangedEvent’
./include/wx/event.h:1797: error: expected ‘=’, ‘,’, ‘;’, ‘asm’ or ‘__attribute__’ before ‘wxDisplayChangedEvent’
./include/wx/event.h:1814: error: expected ‘=’, ‘,’, ‘;’, ‘asm’ or ‘__attribute__’ before ‘wxPaletteChangedEvent’
./include/wx/event.h:1844: error: expected ‘=’, ‘,’, ‘;’, ‘asm’ or ‘__attribute__’ before ‘wxQueryNewPaletteEvent’
./include/wx/event.h:1874: error: expected ‘=’, ‘,’, ‘;’, ‘asm’ or ‘__attribute__’ before ‘wxNavigationKeyEvent’
./include/wx/event.h:1946: error: expected ‘=’, ‘,’, ‘;’, ‘asm’ or ‘__attribute__’ before ‘wxWindowCreateEvent’
./include/wx/event.h:1959: error: expected ‘=’, ‘,’, ‘;’, ‘asm’ or ‘__attribute__’ before ‘wxWindowDestroyEvent’
./include/wx/event.h:1978: error: expected ‘=’, ‘,’, ‘;’, ‘asm’ or ‘__attribute__’ before ‘wxHelpEvent’
./include/wx/event.h:2025: error: expected ‘=’, ‘,’, ‘;’, ‘asm’ or ‘__attribute__’ before ‘wxContextMenuEvent’
./include/wx/event.h:2071: error: expected ‘=’, ‘,’, ‘;’, ‘asm’ or ‘__attribute__’ before ‘wxIdleEvent’
./include/wx/event.h:2128: error: expected ‘)’ before ‘:’ token
./include/wx/event.h:2153: error: expected specifier-qualifier-list before ‘private’
./include/wx/event.h:2185: error: expected identifier or ‘(’ before ‘:’ token
./include/wx/event.h:2206: error: expected identifier or ‘(’ before ‘:’ token
./include/wx/event.h:2236: error: expected ‘:’, ‘,’, ‘;’, ‘}’ or ‘__attribute__’ before ‘*’ token
./include/wx/event.h:2244: error: expected ‘=’, ‘,’, ‘;’, ‘asm’ or ‘__attribute__’ before ‘*’ token
./include/wx/event.h:2244: error: ‘_wxArraywxEventTableEntryPointerArray’ undeclared here (not in a function)
./include/wx/event.h:2244: error: expected ‘)’ before ‘:’ token
./include/wx/event.h:2244: error: bit-field ‘TypeTooBigToBeStoredInwxBaseArrayPtrVoid’ width not an integer constant
./include/wx/event.h:2244: error: expected ‘)’ before ‘*’ token
./include/wx/event.h:2244: error: expected ‘=’, ‘,’, ‘;’, ‘asm’ or ‘__attribute__’ before ‘wxEventTableEntryPointerArray’
./include/wx/event.h:2246: error: expected ‘=’, ‘,’, ‘;’, ‘asm’ or ‘__attribute__’ before ‘wxEventHashTable’
./include/wx/event.h:2305: error: expected ‘=’, ‘,’, ‘;’, ‘asm’ or ‘__attribute__’ before ‘wxEvtHandler’
./include/wx/event.h:2485: error: expected ‘)’ before ‘*’ token
./include/wx/event.h:2492: error: expected ‘)’ before ‘:’ token
./include/wx/event.h:2499: error: expected ‘)’ before ‘:’ token
./include/wx/event.h:2500: error: expected ‘)’ before ‘:’ token
./include/wx/event.h:2501: error: expected ‘)’ before ‘:’ token
./include/wx/event.h:2502: error: expected ‘)’ before ‘:’ token
./include/wx/event.h:2503: error: expected ‘)’ before ‘:’ token
./include/wx/event.h:2504: error: expected ‘)’ before ‘:’ token
./include/wx/event.h:2505: error: expected ‘)’ before ‘:’ token
./include/wx/event.h:2506: error: expected ‘)’ before ‘:’ token
./include/wx/event.h:2507: error: expected ‘)’ before ‘:’ token
./include/wx/event.h:2508: error: expected ‘)’ before ‘:’ token
./include/wx/event.h:2509: error: expected ‘)’ before ‘:’ token
./include/wx/event.h:2510: error: expected ‘)’ before ‘:’ token
./include/wx/event.h:2511: error: expected ‘)’ before ‘:’ token
./include/wx/event.h:2512: error: expected ‘)’ before ‘:’ token
./include/wx/event.h:2513: error: expected ‘)’ before ‘:’ token
./include/wx/event.h:2514: error: expected ‘)’ before ‘:’ token
./include/wx/event.h:2515: error: expected ‘)’ before ‘:’ token
./include/wx/event.h:2516: error: expected ‘)’ before ‘:’ token
./include/wx/event.h:2517: error: expected ‘)’ before ‘:’ token
./include/wx/event.h:2518: error: expected ‘)’ before ‘:’ token
./include/wx/event.h:2519: error: expected ‘)’ before ‘:’ token
./include/wx/event.h:2520: error: expected ‘)’ before ‘:’ token
./include/wx/event.h:2521: error: expected ‘)’ before ‘:’ token
./include/wx/event.h:2522: error: expected ‘)’ before ‘:’ token
./include/wx/event.h:2523: error: expected ‘)’ before ‘:’ token
./include/wx/event.h:2524: error: expected ‘)’ before ‘:’ token
./include/wx/event.h:2525: error: expected ‘)’ before ‘:’ token
./include/wx/event.h:2526: error: expected ‘)’ before ‘:’ token
./include/wx/event.h:2527: error: expected ‘)’ before ‘:’ token
./include/wx/event.h:2528: error: expected ‘)’ before ‘:’ token
./include/wx/event.h:2529: error: expected ‘)’ before ‘:’ token
./include/wx/event.h:2530: error: expected ‘)’ before ‘:’ token
./include/wx/event.h:2531: error: expected ‘)’ before ‘:’ token
./include/wx/event.h:2532: error: expected ‘)’ before ‘:’ token
./include/wx/event.h:2533: error: expected ‘)’ before ‘:’ token
./include/wx/event.h:2538: error: expected ‘=’, ‘,’, ‘;’, ‘asm’ or ‘__attribute__’ before ‘wxSysColourChangedFunction’
./include/wx/event.h:2539: error: expected ‘=’, ‘,’, ‘;’, ‘asm’ or ‘__attribute__’ before ‘wxDisplayChangedFunction’
./include/wx/event.h:2922: error: expected ‘=’, ‘,’, ‘;’, ‘asm’ or ‘__attribute__’ before ‘*’ token
./include/wx/event.h:2924: error: expected ‘=’, ‘,’, ‘;’, ‘asm’ or ‘__attribute__’ before ‘*’ token
./include/wx/event.h:2935: error: expected ‘=’, ‘,’, ‘;’, ‘asm’ or ‘__attribute__’ before ‘*’ token
distcc[9581] ERROR: compile (null) on localhost failed
make: *** [.pch/wxprec_netdll/wx/wxprec.h.gch] Error 1
make: *** Waiting for unfinished jobs....
In file included from ./include/wx/gdiobj.h:22,
                 from ./include/wx/font.h:25,
                 from ./include/wx/window.h:28,
                 from ./include/wx/app.h:23,
                 from ./include/wx/wx.h:24,
                 from ./include/wx/wxprec.h:54:
./include/wx/gtk/gdiobj.h:20: error: expected ‘=’, ‘,’, ‘;’, ‘asm’ or ‘__attribute__’ before ‘wxGDIObject’
In file included from ./include/wx/window.h:28,
                 from ./include/wx/app.h:23,
                 from ./include/wx/wx.h:24,
                 from ./include/wx/wxprec.h:54:
./include/wx/font.h:31: error: expected ‘=’, ‘,’, ‘;’, ‘asm’ or ‘__attribute__’ before ‘wxFontData’
./include/wx/font.h:32: error: expected ‘=’, ‘,’, ‘;’, ‘asm’ or ‘__attribute__’ before ‘wxFontBase’
./include/wx/font.h:33: error: expected ‘=’, ‘,’, ‘;’, ‘asm’ or ‘__attribute__’ before ‘wxFont’
./include/wx/font.h:34: error: expected ‘=’, ‘,’, ‘;’, ‘asm’ or ‘__attribute__’ before ‘wxSize’
./include/wx/font.h:112: error: expected ‘=’, ‘,’, ‘;’, ‘asm’ or ‘__attribute__’ before ‘wxFontRefData’
./include/wx/font.h:115: error: expected ‘=’, ‘,’, ‘;’, ‘asm’ or ‘__attribute__’ before ‘wxFontBase’
In file included from ./include/wx/font.h:241,
                 from ./include/wx/window.h:28,
                 from ./include/wx/app.h:23,
                 from ./include/wx/wx.h:24,
                 from ./include/wx/wxprec.h:54:
./include/wx/gtk/font.h:23: error: expected ‘=’, ‘,’, ‘;’, ‘asm’ or ‘__attribute__’ before ‘wxDC’
./include/wx/gtk/font.h:24: error: expected ‘=’, ‘,’, ‘;’, ‘asm’ or ‘__attribute__’ before ‘wxPaintDC’
./include/wx/gtk/font.h:25: error: expected ‘=’, ‘,’, ‘;’, ‘asm’ or ‘__attribute__’ before ‘wxWindow’
./include/wx/gtk/font.h:27: error: expected ‘=’, ‘,’, ‘;’, ‘asm’ or ‘__attribute__’ before ‘wxFont’
./include/wx/gtk/font.h:33: error: expected ‘=’, ‘,’, ‘;’, ‘asm’ or ‘__attribute__’ before ‘wxFont’
In file included from ./include/wx/gtk/colour.h:22,
                 from ./include/wx/colour.h:22,
                 from ./include/wx/window.h:29,
                 from ./include/wx/app.h:23,
                 from ./include/wx/wx.h:24,
                 from ./include/wx/wxprec.h:54:
./include/wx/palette.h:23: error: expected ‘=’, ‘,’, ‘;’, ‘asm’ or ‘__attribute__’ before ‘wxPaletteBase’
In file included from ./include/wx/palette.h:39,
                 from ./include/wx/gtk/colour.h:22,
                 from ./include/wx/colour.h:22,
                 from ./include/wx/window.h:29,
                 from ./include/wx/app.h:23,
                 from ./include/wx/wx.h:24,
                 from ./include/wx/wxprec.h:54:
./include/wx/generic/paletteg.h:28: error: expected ‘=’, ‘,’, ‘;’, ‘asm’ or ‘__attribute__’ before ‘wxPalette’
./include/wx/generic/paletteg.h:34: error: expected ‘=’, ‘,’, ‘;’, ‘asm’ or ‘__attribute__’ before ‘wxPalette’
In file included from ./include/wx/colour.h:22,
                 from ./include/wx/window.h:29,
                 from ./include/wx/app.h:23,
                 from ./include/wx/wx.h:24,
                 from ./include/wx/wxprec.h:54:
./include/wx/gtk/colour.h:28: error: expected ‘=’, ‘,’, ‘;’, ‘asm’ or ‘__attribute__’ before ‘wxDC’
./include/wx/gtk/colour.h:29: error: expected ‘=’, ‘,’, ‘;’, ‘asm’ or ‘__attribute__’ before ‘wxPaintDC’
./include/wx/gtk/colour.h:30: error: expected ‘=’, ‘,’, ‘;’, ‘asm’ or ‘__attribute__’ before ‘wxBitmap’
./include/wx/gtk/colour.h:31: error: expected ‘=’, ‘,’, ‘;’, ‘asm’ or ‘__attribute__’ before ‘wxWindow’
./include/wx/gtk/colour.h:33: error: expected ‘=’, ‘,’, ‘;’, ‘asm’ or ‘__attribute__’ before ‘wxColour’
./include/wx/gtk/colour.h:39: error: expected ‘=’, ‘,’, ‘;’, ‘asm’ or ‘__attribute__’ before ‘wxColour’
In file included from ./include/wx/region.h:22,
                 from ./include/wx/window.h:30,
                 from ./include/wx/app.h:23,
                 from ./include/wx/wx.h:24,
                 from ./include/wx/wxprec.h:54:
./include/wx/gtk/region.h:25: error: expected ‘=’, ‘,’, ‘;’, ‘asm’ or ‘__attribute__’ before ‘wxRegion’
./include/wx/gtk/region.h:52: error: expected ‘=’, ‘,’, ‘;’, ‘asm’ or ‘__attribute__’ before ‘wxRegion’
./include/wx/gtk/region.h:165: error: expected ‘=’, ‘,’, ‘;’, ‘asm’ or ‘__attribute__’ before ‘wxRegionIterator’
In file included from ./include/wx/window.h:33,
                 from ./include/wx/app.h:23,
                 from ./include/wx/wx.h:24,
                 from ./include/wx/wxprec.h:54:
./include/wx/validate.h:25: error: expected ‘=’, ‘,’, ‘;’, ‘asm’ or ‘__attribute__’ before ‘wxWindow’
./include/wx/validate.h:26: error: expected ‘=’, ‘,’, ‘;’, ‘asm’ or ‘__attribute__’ before ‘wxWindowBase’
./include/wx/validate.h:40: error: expected ‘=’, ‘,’, ‘;’, ‘asm’ or ‘__attribute__’ before ‘wxValidator’
./include/wx/validate.h:84: error: expected ‘=’, ‘,’, ‘;’, ‘asm’ or ‘__attribute__’ before ‘wxDefaultValidator’
In file included from ./include/wx/window.h:40,
                 from ./include/wx/app.h:23,
                 from ./include/wx/wx.h:24,
                 from ./include/wx/wxprec.h:54:
./include/wx/accel.h:21: error: expected ‘=’, ‘,’, ‘;’, ‘asm’ or ‘__attribute__’ before ‘wxAcceleratorTable’
./include/wx/accel.h:22: error: expected ‘=’, ‘,’, ‘;’, ‘asm’ or ‘__attribute__’ before ‘wxMenuItem’
./include/wx/accel.h:23: error: expected ‘=’, ‘,’, ‘;’, ‘asm’ or ‘__attribute__’ before ‘wxKeyEvent’
./include/wx/accel.h:42: error: expected ‘=’, ‘,’, ‘;’, ‘asm’ or ‘__attribute__’ before ‘wxAcceleratorEntry’
In file included from ./include/wx/gtk/accel.h:15,
                 from ./include/wx/accel.h:122,
                 from ./include/wx/window.h:40,
                 from ./include/wx/app.h:23,
                 from ./include/wx/wx.h:24,
                 from ./include/wx/wxprec.h:54:
./include/wx/generic/accel.h:17: error: expected ‘=’, ‘,’, ‘;’, ‘asm’ or ‘__attribute__’ before ‘wxKeyEvent’
./include/wx/generic/accel.h:23: error: expected ‘=’, ‘,’, ‘;’, ‘asm’ or ‘__attribute__’ before ‘wxAcceleratorTable’
In file included from ./include/wx/window.h:40,
                 from ./include/wx/app.h:23,
                 from ./include/wx/wx.h:24,
                 from ./include/wx/wxprec.h:54:
./include/wx/accel.h:131: error: expected ‘=’, ‘,’, ‘;’, ‘asm’ or ‘__attribute__’ before ‘wxNullAcceleratorTable’
In file included from ./include/wx/app.h:23,
                 from ./include/wx/wx.h:24,
                 from ./include/wx/wxprec.h:54:
./include/wx/window.h:59: error: expected ‘=’, ‘,’, ‘;’, ‘asm’ or ‘__attribute__’ before ‘wxCaret’
./include/wx/window.h:60: error: expected ‘=’, ‘,’, ‘;’, ‘asm’ or ‘__attribute__’ before ‘wxControl’
./include/wx/window.h:61: error: expected ‘=’, ‘,’, ‘;’, ‘asm’ or ‘__attribute__’ before ‘wxCursor’
./include/wx/window.h:62: error: expected ‘=’, ‘,’, ‘;’, ‘asm’ or ‘__attribute__’ before ‘wxDC’
./include/wx/window.h:63: error: expected ‘=’, ‘,’, ‘;’, ‘asm’ or ‘__attribute__’ before ‘wxDropTarget’
./include/wx/window.h:64: error: expected ‘=’, ‘,’, ‘;’, ‘asm’ or ‘__attribute__’ before ‘wxItemResource’
./include/wx/window.h:65: error: expected ‘=’, ‘,’, ‘;’, ‘asm’ or ‘__attribute__’ before ‘wxLayoutConstraints’
./include/wx/window.h:66: error: expected ‘=’, ‘,’, ‘;’, ‘asm’ or ‘__attribute__’ before ‘wxResourceTable’
./include/wx/window.h:67: error: expected ‘=’, ‘,’, ‘;’, ‘asm’ or ‘__attribute__’ before ‘wxSizer’
./include/wx/window.h:68: error: expected ‘=’, ‘,’, ‘;’, ‘asm’ or ‘__attribute__’ before ‘wxToolTip’
./include/wx/window.h:69: error: expected ‘=’, ‘,’, ‘;’, ‘asm’ or ‘__attribute__’ before ‘wxWindowBase’
./include/wx/window.h:70: error: expected ‘=’, ‘,’, ‘;’, ‘asm’ or ‘__attribute__’ before ‘wxWindow’
./include/wx/window.h:84: error: expected specifier-qualifier-list before ‘wxFont’
./include/wx/window.h:113: warning: type defaults to ‘int’ in declaration of ‘wxWindow’
./include/wx/window.h:113: error: expected ‘;’, ‘,’ or ‘)’ before ‘*’ token
./include/wx/window.h:113: error: expected ‘=’, ‘,’, ‘;’, ‘asm’ or ‘__attribute__’ before ‘wxWindowListNode’
./include/wx/window.h:113: error: expected ‘=’, ‘,’, ‘;’, ‘asm’ or ‘__attribute__’ before ‘wxWindowList’
./include/wx/window.h:119: error: expected ‘=’, ‘,’, ‘;’, ‘asm’ or ‘__attribute__’ before ‘wxTopLevelWindows’
./include/wx/window.h:132: error: expected ‘=’, ‘,’, ‘;’, ‘asm’ or ‘__attribute__’ before ‘wxWindowBase’
In file included from ./include/wx/window.h:1361,
                 from ./include/wx/app.h:23,
                 from ./include/wx/wx.h:24,
                 from ./include/wx/wxprec.h:54:
./include/wx/gtk/window.h:26: error: expected ‘=’, ‘,’, ‘;’, ‘asm’ or ‘__attribute__’ before ‘wxWindow’
./include/wx/gtk/window.h:27: error: expected ‘)’ before ‘*’ token
./include/wx/gtk/window.h:33: error: expected ‘=’, ‘,’, ‘;’, ‘asm’ or ‘__attribute__’ before ‘wxWindow’
./include/wx/gtk/window.h:303: error: expected ‘=’, ‘,’, ‘;’, ‘asm’ or ‘__attribute__’ before ‘*’ token
In file included from ./include/wx/app.h:23,
                 from ./include/wx/wx.h:24,
                 from ./include/wx/wxprec.h:54:
./include/wx/window.h:1414: error: expected ‘=’, ‘,’, ‘;’, ‘asm’ or ‘__attribute__’ before ‘*’ token
./include/wx/window.h:1425: error: expected ‘=’, ‘,’, ‘;’, ‘asm’ or ‘__attribute__’ before ‘*’ token
./include/wx/window.h:1428: error: expected ‘=’, ‘,’, ‘;’, ‘asm’ or ‘__attribute__’ before ‘wxGetMousePosition’
./include/wx/window.h:1431: error: expected ‘=’, ‘,’, ‘;’, ‘asm’ or ‘__attribute__’ before ‘*’ token
./include/wx/window.h:1434: error: expected ‘=’, ‘,’, ‘;’, ‘asm’ or ‘__attribute__’ before ‘*’ token
./include/wx/window.h: In function ‘NewControlId’:
./include/wx/window.h:1437: error: ‘wxWindowBase’ undeclared (first use in this function)
./include/wx/window.h:1437: error: expected ‘;’ before ‘:’ token
In file included from ./include/wx/app.h:25,
                 from ./include/wx/wx.h:24,
                 from ./include/wx/wxprec.h:54:
./include/wx/vidmode.h: At top level:
./include/wx/vidmode.h:21: error: expected specifier-qualifier-list before ‘wxVideoMode’
In file included from ./include/wx/app.h:28,
                 from ./include/wx/wx.h:24,
                 from ./include/wx/wxprec.h:54:
./include/wx/build.h:132: error: expected ‘=’, ‘,’, ‘;’, ‘asm’ or ‘__attribute__’ before ‘wxBuildOptions’
In file included from ./include/wx/app.h:29,
                 from ./include/wx/wx.h:24,
                 from ./include/wx/wxprec.h:54:
./include/wx/init.h:29: error: expected ‘=’, ‘,’, ‘;’, ‘asm’ or ‘__attribute__’ before ‘wxEntryStart’
./include/wx/init.h:45: error: expected ‘;’, ‘,’ or ‘)’ before ‘&’ token
./include/wx/init.h:63: error: expected ‘=’, ‘,’, ‘;’, ‘asm’ or ‘__attribute__’ before ‘wxInitialize’
./include/wx/init.h:71: error: expected ‘=’, ‘,’, ‘;’, ‘asm’ or ‘__attribute__’ before ‘wxInitializer’
In file included from ./include/wx/wx.h:24,
                 from ./include/wx/wxprec.h:54:
./include/wx/app.h:31: error: expected ‘=’, ‘,’, ‘;’, ‘asm’ or ‘__attribute__’ before ‘wxAppConsole’
./include/wx/app.h:32: error: expected ‘=’, ‘,’, ‘;’, ‘asm’ or ‘__attribute__’ before ‘wxAppTraits’
./include/wx/app.h:33: error: expected ‘=’, ‘,’, ‘;’, ‘asm’ or ‘__attribute__’ before ‘wxCmdLineParser’
./include/wx/app.h:34: error: expected ‘=’, ‘,’, ‘;’, ‘asm’ or ‘__attribute__’ before ‘wxLog’
./include/wx/app.h:35: error: expected ‘=’, ‘,’, ‘;’, ‘asm’ or ‘__attribute__’ before ‘wxMessageOutput’
./include/wx/app.h:44: error: expected ‘=’, ‘,’, ‘;’, ‘asm’ or ‘__attribute__’ before ‘wxEventLoop’
./include/wx/app.h:52: error: expected ‘=’, ‘,’, ‘;’, ‘asm’ or ‘__attribute__’ before ‘*’ token
./include/wx/app.h:68: error: expected ‘=’, ‘,’, ‘;’, ‘asm’ or ‘__attribute__’ before ‘wxAppConsole’
./include/wx/app.h:339: error: expected ‘=’, ‘,’, ‘;’, ‘asm’ or ‘__attribute__’ before ‘wxAppBase’
In file included from ./include/wx/toplevel.h:26,
                 from ./include/wx/frame.h:23,
                 from ./include/wx/gtk/app.h:17,
                 from ./include/wx/app.h:570,
                 from ./include/wx/wx.h:24,
                 from ./include/wx/wxprec.h:54:
./include/wx/iconbndl.h:23: error: expected ‘=’, ‘,’, ‘;’, ‘asm’ or ‘__attribute__’ before ‘wxIcon’
./include/wx/iconbndl.h:24: error: expected ‘=’, ‘,’, ‘;’, ‘asm’ or ‘__attribute__’ before ‘wxString’
./include/wx/iconbndl.h:26: error: expected ‘=’, ‘,’, ‘;’, ‘asm’ or ‘__attribute__’ before ‘_wxObjArraywxIconArray’
./include/wx/iconbndl.h:26: error: expected ‘)’ before ‘*’ token
./include/wx/iconbndl.h:26: error: expected ‘=’, ‘,’, ‘;’, ‘asm’ or ‘__attribute__’ before ‘wxIconArray’
./include/wx/iconbndl.h:31: error: expected ‘=’, ‘,’, ‘;’, ‘asm’ or ‘__attribute__’ before ‘wxIconBundle’
In file included from ./include/wx/frame.h:23,
                 from ./include/wx/gtk/app.h:17,
                 from ./include/wx/app.h:570,
                 from ./include/wx/wx.h:24,
                 from ./include/wx/wxprec.h:54:
./include/wx/toplevel.h:31: error: expected ‘=’, ‘,’, ‘;’, ‘asm’ or ‘__attribute__’ before ‘wxTopLevelWindowBase’
./include/wx/toplevel.h:118: error: expected ‘=’, ‘,’, ‘;’, ‘asm’ or ‘__attribute__’ before ‘wxTopLevelWindowBase’
In file included from ./include/wx/toplevel.h:265,
                 from ./include/wx/frame.h:23,
                 from ./include/wx/gtk/app.h:17,
                 from ./include/wx/app.h:570,
                 from ./include/wx/wx.h:24,
                 from ./include/wx/wxprec.h:54:
./include/wx/gtk/toplevel.h:23: error: expected ‘=’, ‘,’, ‘;’, ‘asm’ or ‘__attribute__’ before ‘wxTopLevelWindowGTK’
In file included from ./include/wx/frame.h:23,
                 from ./include/wx/gtk/app.h:17,
                 from ./include/wx/app.h:570,
                 from ./include/wx/wx.h:24,
                 from ./include/wx/wxprec.h:54:
./include/wx/toplevel.h:291: error: expected ‘=’, ‘,’, ‘;’, ‘asm’ or ‘__attribute__’ before ‘wxTopLevelWindow’
In file included from ./include/wx/gtk/app.h:17,
                 from ./include/wx/app.h:570,
                 from ./include/wx/wx.h:24,
                 from ./include/wx/wxprec.h:54:
./include/wx/frame.h:30: error: expected ‘=’, ‘,’, ‘;’, ‘asm’ or ‘__attribute__’ before ‘wxFrame’
./include/wx/frame.h:31: error: expected ‘=’, ‘,’, ‘;’, ‘asm’ or ‘__attribute__’ before ‘wxMenuBar’
./include/wx/frame.h:32: error: expected ‘=’, ‘,’, ‘;’, ‘asm’ or ‘__attribute__’ before ‘wxStatusBar’
./include/wx/frame.h:33: error: expected ‘=’, ‘,’, ‘;’, ‘asm’ or ‘__attribute__’ before ‘wxToolBar’
./include/wx/frame.h:57: error: expected ‘=’, ‘,’, ‘;’, ‘asm’ or ‘__attribute__’ before ‘wxFrameBase’
In file included from ./include/wx/frame.h:255,
                 from ./include/wx/gtk/app.h:17,
                 from ./include/wx/app.h:570,
                 from ./include/wx/wx.h:24,
                 from ./include/wx/wxprec.h:54:
./include/wx/gtk/frame.h:22: error: expected ‘=’, ‘,’, ‘;’, ‘asm’ or ‘__attribute__’ before ‘wxMDIChildFrame’
./include/wx/gtk/frame.h:23: error: expected ‘=’, ‘,’, ‘;’, ‘asm’ or ‘__attribute__’ before ‘wxMDIClientWindow’
./include/wx/gtk/frame.h:24: error: expected ‘=’, ‘,’, ‘;’, ‘asm’ or ‘__attribute__’ before ‘wxMenu’
./include/wx/gtk/frame.h:25: error: expected ‘=’, ‘,’, ‘;’, ‘asm’ or ‘__attribute__’ before ‘wxMenuBar’
./include/wx/gtk/frame.h:26: error: expected ‘=’, ‘,’, ‘;’, ‘asm’ or ‘__attribute__’ before ‘wxToolBar’
./include/wx/gtk/frame.h:27: error: expected ‘=’, ‘,’, ‘;’, ‘asm’ or ‘__attribute__’ before ‘wxStatusBar’
./include/wx/gtk/frame.h:33: error: expected ‘=’, ‘,’, ‘;’, ‘asm’ or ‘__attribute__’ before ‘wxFrame’
In file included from ./include/wx/icon.h:15,
                 from ./include/wx/gtk/app.h:18,
                 from ./include/wx/app.h:570,
                 from ./include/wx/wx.h:24,
                 from ./include/wx/wxprec.h:54:
./include/wx/iconloc.h:21: error: expected ‘=’, ‘,’, ‘;’, ‘asm’ or ‘__attribute__’ before ‘wxIconLocationBase’
./include/wx/iconloc.h:71: error: expected ‘=’, ‘,’, ‘;’, ‘asm’ or ‘__attribute__’ before ‘wxIconLocation’
In file included from ./include/wx/gtk/icon.h:20,
                 from ./include/wx/icon.h:24,
                 from ./include/wx/gtk/app.h:18,
                 from ./include/wx/app.h:570,
                 from ./include/wx/wx.h:24,
                 from ./include/wx/wxprec.h:54:
./include/wx/bitmap.h:29: error: expected ‘=’, ‘,’, ‘;’, ‘asm’ or ‘__attribute__’ before ‘wxBitmap’
./include/wx/bitmap.h:30: error: expected ‘=’, ‘,’, ‘;’, ‘asm’ or ‘__attribute__’ before ‘wxBitmapHandler’
./include/wx/bitmap.h:31: error: expected ‘=’, ‘,’, ‘;’, ‘asm’ or ‘__attribute__’ before ‘wxImage’
./include/wx/bitmap.h:32: error: expected ‘=’, ‘,’, ‘;’, ‘asm’ or ‘__attribute__’ before ‘wxMask’
./include/wx/bitmap.h:33: error: expected ‘=’, ‘,’, ‘;’, ‘asm’ or ‘__attribute__’ before ‘wxPalette’
./include/wx/bitmap.h:49: error: expected ‘=’, ‘,’, ‘;’, ‘asm’ or ‘__attribute__’ before ‘wxBitmapHandlerBase’
./include/wx/bitmap.h:83: error: expected ‘=’, ‘,’, ‘;’, ‘asm’ or ‘__attribute__’ before ‘wxBitmapBase’
In file included from ./include/wx/bitmap.h:175,
                 from ./include/wx/gtk/icon.h:20,
                 from ./include/wx/icon.h:24,
                 from ./include/wx/gtk/app.h:18,
                 from ./include/wx/app.h:570,
                 from ./include/wx/wx.h:24,
                 from ./include/wx/wxprec.h:54:
./include/wx/gtk/bitmap.h:28: error: expected ‘=’, ‘,’, ‘;’, ‘asm’ or ‘__attribute__’ before ‘wxPixelDataBase’
./include/wx/gtk/bitmap.h:34: error: expected ‘=’, ‘,’, ‘;’, ‘asm’ or ‘__attribute__’ before ‘wxMask’
./include/wx/gtk/bitmap.h:35: error: expected ‘=’, ‘,’, ‘;’, ‘asm’ or ‘__attribute__’ before ‘wxBitmap’
./include/wx/gtk/bitmap.h:36: error: expected ‘=’, ‘,’, ‘;’, ‘asm’ or ‘__attribute__’ before ‘wxImage’
./include/wx/gtk/bitmap.h:42: error: expected ‘=’, ‘,’, ‘;’, ‘asm’ or ‘__attribute__’ before ‘wxMask’
./include/wx/gtk/bitmap.h:68: error: expected ‘=’, ‘,’, ‘;’, ‘asm’ or ‘__attribute__’ before ‘wxBitmap’
./include/wx/gtk/bitmap.h:176: error: expected ‘=’, ‘,’, ‘;’, ‘asm’ or ‘__attribute__’ before ‘wxBitmapHandler’
In file included from ./include/wx/icon.h:24,
                 from ./include/wx/gtk/app.h:18,
                 from ./include/wx/app.h:570,
                 from ./include/wx/wx.h:24,
                 from ./include/wx/wxprec.h:54:
./include/wx/gtk/icon.h:26: error: expected ‘=’, ‘,’, ‘;’, ‘asm’ or ‘__attribute__’ before ‘wxIcon’
./include/wx/gtk/icon.h:32: error: expected ‘=’, ‘,’, ‘;’, ‘asm’ or ‘__attribute__’ before ‘wxIcon’
In file included from ./include/wx/app.h:570,
                 from ./include/wx/wx.h:24,
                 from ./include/wx/wxprec.h:54:
./include/wx/gtk/app.h:25: error: expected ‘=’, ‘,’, ‘;’, ‘asm’ or ‘__attribute__’ before ‘wxApp’
./include/wx/gtk/app.h:26: error: expected ‘=’, ‘,’, ‘;’, ‘asm’ or ‘__attribute__’ before ‘wxLog’
./include/wx/gtk/app.h:32: error: expected ‘=’, ‘,’, ‘;’, ‘asm’ or ‘__attribute__’ before ‘wxApp’
In file included from ./include/wx/wx.h:24,
                 from ./include/wx/wxprec.h:54:
./include/wx/app.h:611: error: expected ‘=’, ‘,’, ‘;’, ‘asm’ or ‘__attribute__’ before ‘wxYield’
./include/wx/app.h:624: error: expected ‘=’, ‘,’, ‘;’, ‘asm’ or ‘__attribute__’ before ‘wxAppInitializer’
In file included from ./include/wx/generic/panelg.h:24,
                 from ./include/wx/panel.h:15,
                 from ./include/wx/wx.h:31,
                 from ./include/wx/wxprec.h:54:
./include/wx/containr.h:20: error: expected ‘=’, ‘,’, ‘;’, ‘asm’ or ‘__attribute__’ before ‘wxFocusEvent’
./include/wx/containr.h:21: error: expected ‘=’, ‘,’, ‘;’, ‘asm’ or ‘__attribute__’ before ‘wxNavigationKeyEvent’
./include/wx/containr.h:22: error: expected ‘=’, ‘,’, ‘;’, ‘asm’ or ‘__attribute__’ before ‘wxWindow’
./include/wx/containr.h:23: error: expected ‘=’, ‘,’, ‘;’, ‘asm’ or ‘__attribute__’ before ‘wxWindowBase’
./include/wx/containr.h:38: error: expected ‘=’, ‘,’, ‘;’, ‘asm’ or ‘__attribute__’ before ‘wxControlContainer’
./include/wx/containr.h:102: error: expected ‘=’, ‘,’, ‘;’, ‘asm’ or ‘__attribute__’ before ‘wxSetFocusToChild’
In file included from ./include/wx/panel.h:15,
                 from ./include/wx/wx.h:31,
                 from ./include/wx/wxprec.h:54:
./include/wx/generic/panelg.h:26: error: expected ‘=’, ‘,’, ‘;’, ‘asm’ or ‘__attribute__’ before ‘wxControlContainer’
./include/wx/generic/panelg.h:34: error: expected ‘=’, ‘,’, ‘;’, ‘asm’ or ‘__attribute__’ before ‘wxPanel’
In file included from ./include/wx/dc.h:29,
                 from ./include/wx/wx.h:33,
                 from ./include/wx/wxprec.h:54:
./include/wx/brush.h:20: error: expected ‘=’, ‘,’, ‘;’, ‘asm’ or ‘__attribute__’ before ‘wxBrushBase’
In file included from ./include/wx/brush.h:38,
                 from ./include/wx/dc.h:29,
                 from ./include/wx/wx.h:33,
                 from ./include/wx/wxprec.h:54:
./include/wx/gtk/brush.h:28: error: expected ‘=’, ‘,’, ‘;’, ‘asm’ or ‘__attribute__’ before ‘wxBrush’
./include/wx/gtk/brush.h:34: error: expected ‘=’, ‘,’, ‘;’, ‘asm’ or ‘__attribute__’ before ‘wxBrush’
In file included from ./include/wx/pen.h:22,
                 from ./include/wx/dc.h:30,
                 from ./include/wx/wx.h:33,
                 from ./include/wx/wxprec.h:54:
./include/wx/gtk/pen.h:28: error: expected ‘=’, ‘,’, ‘;’, ‘asm’ or ‘__attribute__’ before ‘wxPen’
./include/wx/gtk/pen.h:40: error: expected ‘=’, ‘,’, ‘;’, ‘asm’ or ‘__attribute__’ before ‘wxPen’
In file included from ./include/wx/wx.h:33,
                 from ./include/wx/wxprec.h:54:
./include/wx/dc.h:36: error: expected ‘=’, ‘,’, ‘;’, ‘asm’ or ‘__attribute__’ before ‘wxDC’
./include/wx/dc.h:37: error: expected ‘=’, ‘,’, ‘;’, ‘asm’ or ‘__attribute__’ before ‘wxDCBase’
./include/wx/dc.h:39: error: expected ‘=’, ‘,’, ‘;’, ‘asm’ or ‘__attribute__’ before ‘wxDrawObject’
./include/wx/dc.h:106: error: expected ‘=’, ‘,’, ‘;’, ‘asm’ or ‘__attribute__’ before ‘wxDCBase’
In file included from ./include/wx/dc.h:812,
                 from ./include/wx/wx.h:33,
                 from ./include/wx/wxprec.h:54:
./include/wx/gtk/dc.h:22: error: expected ‘=’, ‘,’, ‘;’, ‘asm’ or ‘__attribute__’ before ‘wxDC’
./include/wx/gtk/dc.h:43: error: expected ‘=’, ‘,’, ‘;’, ‘asm’ or ‘__attribute__’ before ‘wxDC’
In file included from ./include/wx/wx.h:33,
                 from ./include/wx/wxprec.h:54:
./include/wx/dc.h:830: error: expected ‘=’, ‘,’, ‘;’, ‘asm’ or ‘__attribute__’ before ‘wxDCTextColourChanger’
./include/wx/dc.h:861: error: expected ‘=’, ‘,’, ‘;’, ‘asm’ or ‘__attribute__’ before ‘wxDCClipper’
In file included from ./include/wx/dcclient.h:22,
                 from ./include/wx/wx.h:34,
                 from ./include/wx/wxprec.h:54:
./include/wx/gtk/dcclient.h:24: error: expected ‘=’, ‘,’, ‘;’, ‘asm’ or ‘__attribute__’ before ‘wxWindowDC’
./include/wx/gtk/dcclient.h:25: error: expected ‘=’, ‘,’, ‘;’, ‘asm’ or ‘__attribute__’ before ‘wxPaintDC’
./include/wx/gtk/dcclient.h:26: error: expected ‘=’, ‘,’, ‘;’, ‘asm’ or ‘__attribute__’ before ‘wxClientDC’
./include/wx/gtk/dcclient.h:32: error: expected ‘=’, ‘,’, ‘;’, ‘asm’ or ‘__attribute__’ before ‘wxWindowDC’
./include/wx/gtk/dcclient.h:143: error: expected ‘=’, ‘,’, ‘;’, ‘asm’ or ‘__attribute__’ before ‘wxClientDC’
./include/wx/gtk/dcclient.h:160: error: expected ‘=’, ‘,’, ‘;’, ‘asm’ or ‘__attribute__’ before ‘wxPaintDC’
In file included from ./include/wx/dcmemory.h:22,
                 from ./include/wx/wx.h:35,
                 from ./include/wx/wxprec.h:54:
./include/wx/gtk/dcmemory.h:25: error: expected ‘=’, ‘,’, ‘;’, ‘asm’ or ‘__attribute__’ before ‘wxMemoryDC’
./include/wx/gtk/dcmemory.h:31: error: expected ‘=’, ‘,’, ‘;’, ‘asm’ or ‘__attribute__’ before ‘wxMemoryDC’
In file included from ./include/wx/dcscreen.h:22,
                 from ./include/wx/wx.h:37,
                 from ./include/wx/wxprec.h:54:
./include/wx/gtk/dcscreen.h:19: error: expected ‘=’, ‘,’, ‘;’, ‘asm’ or ‘__attribute__’ before ‘wxScreenDC’
./include/wx/gtk/dcscreen.h:25: error: expected ‘=’, ‘,’, ‘;’, ‘asm’ or ‘__attribute__’ before ‘wxScreenDC’
In file included from ./include/wx/button.h:46,
                 from ./include/wx/wx.h:38,
                 from ./include/wx/wxprec.h:54:
./include/wx/control.h:35: error: expected ‘=’, ‘,’, ‘;’, ‘asm’ or ‘__attribute__’ before ‘wxControlBase’
In file included from ./include/wx/control.h:121,
                 from ./include/wx/button.h:46,
                 from ./include/wx/wx.h:38,
                 from ./include/wx/wxprec.h:54:
./include/wx/gtk/control.h:26: error: expected ‘=’, ‘,’, ‘;’, ‘asm’ or ‘__attribute__’ before ‘wxControl’
./include/wx/gtk/control.h:33: error: expected identifier or ‘(’ before string constant
./include/wx/gtk/control.h:39: error: expected ‘=’, ‘,’, ‘;’, ‘asm’ or ‘__attribute__’ before ‘wxControl’
In file included from ./include/wx/wx.h:38,
                 from ./include/wx/wxprec.h:54:
./include/wx/button.h:48: error: expected ‘=’, ‘,’, ‘;’, ‘asm’ or ‘__attribute__’ before ‘wxBitmap’
./include/wx/button.h:56: error: expected ‘=’, ‘,’, ‘;’, ‘asm’ or ‘__attribute__’ before ‘wxButtonBase’
In file included from ./include/wx/button.h:90,
                 from ./include/wx/wx.h:38,
                 from ./include/wx/wxprec.h:54:
./include/wx/gtk/button.h:26: error: expected ‘=’, ‘,’, ‘;’, ‘asm’ or ‘__attribute__’ before ‘wxButton’
./include/wx/gtk/button.h:38: error: expected ‘=’, ‘,’, ‘;’, ‘asm’ or ‘__attribute__’ before ‘wxButton’
In file included from ./include/wx/menu.h:32,
                 from ./include/wx/wx.h:39,
                 from ./include/wx/wxprec.h:54:
./include/wx/menuitem.h:29: error: expected ‘=’, ‘,’, ‘;’, ‘asm’ or ‘__attribute__’ before ‘wxAcceleratorEntry’
./include/wx/menuitem.h:30: error: expected ‘=’, ‘,’, ‘;’, ‘asm’ or ‘__attribute__’ before ‘wxMenuItem’
./include/wx/menuitem.h:31: error: expected ‘=’, ‘,’, ‘;’, ‘asm’ or ‘__attribute__’ before ‘wxMenu’
./include/wx/menuitem.h:38: error: expected ‘=’, ‘,’, ‘;’, ‘asm’ or ‘__attribute__’ before ‘wxMenuItemBase’
In file included from ./include/wx/menuitem.h:167,
                 from ./include/wx/menu.h:32,
                 from ./include/wx/wx.h:39,
                 from ./include/wx/wxprec.h:54:
./include/wx/gtk/menuitem.h:23: error: expected ‘=’, ‘,’, ‘;’, ‘asm’ or ‘__attribute__’ before ‘wxMenuItem’
In file included from ./include/wx/wx.h:39,
                 from ./include/wx/wxprec.h:54:
./include/wx/menu.h:34: error: expected ‘=’, ‘,’, ‘;’, ‘asm’ or ‘__attribute__’ before ‘wxMenu’
./include/wx/menu.h:35: error: expected ‘=’, ‘,’, ‘;’, ‘asm’ or ‘__attribute__’ before ‘wxMenuBarBase’
./include/wx/menu.h:36: error: expected ‘=’, ‘,’, ‘;’, ‘asm’ or ‘__attribute__’ before ‘wxMenuBar’
./include/wx/menu.h:37: error: expected ‘=’, ‘,’, ‘;’, ‘asm’ or ‘__attribute__’ before ‘wxMenuItem’
./include/wx/menu.h:40: error: expected ‘=’, ‘,’, ‘;’, ‘asm’ or ‘__attribute__’ before ‘_WX_LIST_ITEM_TYPE_wxMenuList’
./include/wx/menu.h:40: warning: type defaults to ‘int’ in declaration of ‘wxMenu’
./include/wx/menu.h:40: error: expected ‘;’, ‘,’ or ‘)’ before ‘*’ token
./include/wx/menu.h:40: error: expected ‘=’, ‘,’, ‘;’, ‘asm’ or ‘__attribute__’ before ‘wxwxMenuListNode’
./include/wx/menu.h:40: error: expected ‘=’, ‘,’, ‘;’, ‘asm’ or ‘__attribute__’ before ‘wxMenuList’
./include/wx/menu.h:41: error: expected ‘=’, ‘,’, ‘;’, ‘asm’ or ‘__attribute__’ before ‘_WX_LIST_ITEM_TYPE_wxMenuItemList’
./include/wx/menu.h:41: warning: type defaults to ‘int’ in declaration of ‘wxMenuItem’
./include/wx/menu.h:41: error: expected ‘;’, ‘,’ or ‘)’ before ‘*’ token
./include/wx/menu.h:41: error: expected ‘=’, ‘,’, ‘;’, ‘asm’ or ‘__attribute__’ before ‘wxwxMenuItemListNode’
./include/wx/menu.h:41: error: expected ‘=’, ‘,’, ‘;’, ‘asm’ or ‘__attribute__’ before ‘wxMenuItemList’
./include/wx/menu.h:47: error: expected ‘=’, ‘,’, ‘;’, ‘asm’ or ‘__attribute__’ before ‘wxMenuBase’
./include/wx/menu.h:379: error: expected ‘=’, ‘,’, ‘;’, ‘asm’ or ‘__attribute__’ before ‘wxMenuBarBase’
In file included from ./include/wx/menu.h:509,
                 from ./include/wx/wx.h:39,
                 from ./include/wx/wxprec.h:54:
./include/wx/gtk/menu.h:21: error: expected ‘=’, ‘,’, ‘;’, ‘asm’ or ‘__attribute__’ before ‘wxMenuBar’
./include/wx/gtk/menu.h:68: error: expected ‘=’, ‘,’, ‘;’, ‘asm’ or ‘__attribute__’ before ‘wxMenu’
In file included from ./include/wx/wx.h:45,
                 from ./include/wx/wxprec.h:54:
./include/wx/dialog.h:23: error: expected ‘=’, ‘,’, ‘;’, ‘asm’ or ‘__attribute__’ before ‘wxSizer’
./include/wx/dialog.h:24: error: expected ‘=’, ‘,’, ‘;’, ‘asm’ or ‘__attribute__’ before ‘wxStdDialogButtonSizer’
./include/wx/dialog.h:36: error: expected ‘=’, ‘,’, ‘;’, ‘asm’ or ‘__attribute__’ before ‘wxDialogBase’
In file included from ./include/wx/dialog.h:101,
                 from ./include/wx/wx.h:45,
                 from ./include/wx/wxprec.h:54:
./include/wx/gtk/dialog.h:24: error: expected ‘=’, ‘,’, ‘;’, ‘asm’ or ‘__attribute__’ before ‘wxDialog’
./include/wx/gtk/dialog.h:36: error: expected ‘=’, ‘,’, ‘;’, ‘asm’ or ‘__attribute__’ before ‘wxDialog’
In file included from ./include/wx/timer.h:27,
                 from ./include/wx/wx.h:46,
                 from ./include/wx/wxprec.h:54:
./include/wx/stopwatch.h:23: error: expected ‘=’, ‘,’, ‘;’, ‘asm’ or ‘__attribute__’ before ‘wxStopWatch’
./include/wx/stopwatch.h:77: error: expected ‘)’ before ‘resetTimer’
./include/wx/stopwatch.h:93: error: expected ‘=’, ‘,’, ‘;’, ‘asm’ or ‘__attribute__’ before ‘wxGetLocalTimeMillis’
In file included from ./include/wx/wx.h:46,
                 from ./include/wx/wxprec.h:54:
./include/wx/timer.h:42: error: expected ‘=’, ‘,’, ‘;’, ‘asm’ or ‘__attribute__’ before ‘wxTimerBase’
In file included from ./include/wx/timer.h:120,
                 from ./include/wx/wx.h:46,
                 from ./include/wx/wxprec.h:54:
./include/wx/gtk/timer.h:22: error: expected ‘=’, ‘,’, ‘;’, ‘asm’ or ‘__attribute__’ before ‘wxTimer’
In file included from ./include/wx/wx.h:46,
                 from ./include/wx/wxprec.h:54:
./include/wx/timer.h:135: error: expected ‘=’, ‘,’, ‘;’, ‘asm’ or ‘__attribute__’ before ‘wxTimerRunner’
./include/wx/timer.h:168: error: expected ‘=’, ‘,’, ‘;’, ‘asm’ or ‘__attribute__’ before ‘wxTimerEvent’
./include/wx/timer.h:190: error: expected ‘)’ before ‘:’ token
In file included from ./include/wx/wx.h:47,
                 from ./include/wx/wxprec.h:54:
./include/wx/settings.h:18: error: expected ‘=’, ‘,’, ‘;’, ‘asm’ or ‘__attribute__’ before ‘wxWindow’
./include/wx/settings.h:160: error: expected ‘=’, ‘,’, ‘;’, ‘asm’ or ‘__attribute__’ before ‘wxSystemSettingsNative’
./include/wx/settings.h:180: error: expected ‘=’, ‘,’, ‘;’, ‘asm’ or ‘__attribute__’ before ‘wxSystemSettings’
In file included from ./include/wx/wx.h:48,
                 from ./include/wx/wxprec.h:54:
./include/wx/msgdlg.h:19: error: expected ‘=’, ‘,’, ‘;’, ‘asm’ or ‘__attribute__’ before ‘wxMessageDialogBase’
In file included from ./include/wx/msgdlg.h:53,
                 from ./include/wx/wx.h:48,
                 from ./include/wx/wxprec.h:54:
./include/wx/gtk/msgdlg.h:27: error: expected ‘=’, ‘,’, ‘;’, ‘asm’ or ‘__attribute__’ before ‘wxMessageDialog’
In file included from ./include/wx/wx.h:48,
                 from ./include/wx/wxprec.h:54:
./include/wx/msgdlg.h:68: warning: type defaults to ‘int’ in declaration of ‘wxString’
./include/wx/msgdlg.h:68: error: expected ‘;’, ‘,’ or ‘)’ before ‘&’ token
In file included from ./include/wx/cmndata.h:21,
                 from ./include/wx/wx.h:49,
                 from ./include/wx/wxprec.h:54:
./include/wx/encinfo.h:37: error: expected specifier-qualifier-list before ‘wxString’
In file included from ./include/wx/wx.h:49,
                 from ./include/wx/wxprec.h:54:
./include/wx/cmndata.h:30: error: expected ‘=’, ‘,’, ‘;’, ‘asm’ or ‘__attribute__’ before ‘wxPrintNativeDataBase’
./include/wx/cmndata.h:33: error: expected ‘=’, ‘,’, ‘;’, ‘asm’ or ‘__attribute__’ before ‘wxColourData’
./include/wx/cmndata.h:61: error: expected ‘=’, ‘,’, ‘;’, ‘asm’ or ‘__attribute__’ before ‘wxFontData’
./include/wx/cmndata.h:172: error: expected ‘=’, ‘,’, ‘;’, ‘asm’ or ‘__attribute__’ before ‘wxPrintData’
./include/wx/cmndata.h:281: error: expected ‘=’, ‘,’, ‘;’, ‘asm’ or ‘__attribute__’ before ‘wxPrintDialogData’
./include/wx/cmndata.h:362: error: expected ‘=’, ‘,’, ‘;’, ‘asm’ or ‘__attribute__’ before ‘wxPageSetupDialogData’
In file included from ./include/wx/wx.h:52,
                 from ./include/wx/wxprec.h:54:
./include/wx/ctrlsub.h:36: error: expected ‘=’, ‘,’, ‘;’, ‘asm’ or ‘__attribute__’ before ‘wxItemContainerImmutable’
./include/wx/ctrlsub.h:77: error: expected ‘=’, ‘,’, ‘;’, ‘asm’ or ‘__attribute__’ before ‘wxItemContainer’
./include/wx/ctrlsub.h:167: error: expected ‘=’, ‘,’, ‘;’, ‘asm’ or ‘__attribute__’ before ‘wxControlWithItems’
In file included from ./include/wx/wx.h:53,
                 from ./include/wx/wxprec.h:54:
./include/wx/bmpbuttn.h:29: error: expected ‘=’, ‘,’, ‘;’, ‘asm’ or ‘__attribute__’ before ‘wxBitmapButtonBase’
In file included from ./include/wx/bmpbuttn.h:93,
                 from ./include/wx/wx.h:53,
                 from ./include/wx/wxprec.h:54:
./include/wx/gtk/bmpbuttn.h:22: error: expected ‘=’, ‘,’, ‘;’, ‘asm’ or ‘__attribute__’ before ‘wxBitmapButton’
In file included from ./include/wx/wx.h:54,
                 from ./include/wx/wxprec.h:54:
./include/wx/checkbox.h:58: error: expected ‘=’, ‘,’, ‘;’, ‘asm’ or ‘__attribute__’ before ‘wxCheckBoxBase’
In file included from ./include/wx/checkbox.h:131,
                 from ./include/wx/wx.h:54,
                 from ./include/wx/wxprec.h:54:
./include/wx/gtk/checkbox.h:21: error: expected ‘=’, ‘,’, ‘;’, ‘asm’ or ‘__attribute__’ before ‘wxCheckBox’
In file included from ./include/wx/checklst.h:17,
                 from ./include/wx/wx.h:55,
                 from ./include/wx/wxprec.h:54:
./include/wx/listbox.h:30: error: expected ‘=’, ‘,’, ‘;’, ‘asm’ or ‘__attribute__’ before ‘wxArrayInt’
./include/wx/listbox.h:31: error: expected ‘=’, ‘,’, ‘;’, ‘asm’ or ‘__attribute__’ before ‘wxArrayString’
./include/wx/listbox.h:43: error: expected ‘=’, ‘,’, ‘;’, ‘asm’ or ‘__attribute__’ before ‘wxListBoxBase’
In file included from ./include/wx/listbox.h:143,
                 from ./include/wx/checklst.h:17,
                 from ./include/wx/wx.h:55,
                 from ./include/wx/wxprec.h:54:
./include/wx/gtk/listbox.h:20: error: expected ‘=’, ‘,’, ‘;’, ‘asm’ or ‘__attribute__’ before ‘wxSortedArrayString’
./include/wx/gtk/listbox.h:26: error: expected ‘=’, ‘,’, ‘;’, ‘asm’ or ‘__attribute__’ before ‘wxListBox’
In file included from ./include/wx/wx.h:55,
                 from ./include/wx/wxprec.h:54:
./include/wx/checklst.h:23: error: expected ‘=’, ‘,’, ‘;’, ‘asm’ or ‘__attribute__’ before ‘wxCheckListBoxBase’
In file included from ./include/wx/checklst.h:42,
                 from ./include/wx/wx.h:55,
                 from ./include/wx/wxprec.h:54:
./include/wx/gtk/checklst.h:35: error: expected ‘=’, ‘,’, ‘;’, ‘asm’ or ‘__attribute__’ before ‘wxCheckListBox’
In file included from ./include/wx/wx.h:56,
                 from ./include/wx/wxprec.h:54:
./include/wx/choice.h:39: error: expected ‘=’, ‘,’, ‘;’, ‘asm’ or ‘__attribute__’ before ‘wxChoiceBase’
In file included from ./include/wx/choice.h:72,
                 from ./include/wx/wx.h:56,
                 from ./include/wx/wxprec.h:54:
./include/wx/gtk/choice.h:17: error: expected ‘=’, ‘,’, ‘;’, ‘asm’ or ‘__attribute__’ before ‘wxSortedArrayString’
./include/wx/gtk/choice.h:18: error: expected ‘=’, ‘,’, ‘;’, ‘asm’ or ‘__attribute__’ before ‘wxArrayString’
./include/wx/gtk/choice.h:24: error: expected ‘=’, ‘,’, ‘;’, ‘asm’ or ‘__attribute__’ before ‘wxChoice’
In file included from ./include/wx/wx.h:57,
                 from ./include/wx/wxprec.h:54:
./include/wx/scrolbar.h:27: error: expected ‘=’, ‘,’, ‘;’, ‘asm’ or ‘__attribute__’ before ‘wxScrollBarBase’
In file included from ./include/wx/scrolbar.h:66,
                 from ./include/wx/wx.h:57,
                 from ./include/wx/wxprec.h:54:
./include/wx/gtk/scrolbar.h:24: error: expected ‘=’, ‘,’, ‘;’, ‘asm’ or ‘__attribute__’ before ‘wxScrollBar’
./include/wx/gtk/scrolbar.h:30: error: expected ‘=’, ‘,’, ‘;’, ‘asm’ or ‘__attribute__’ before ‘wxScrollBar’
In file included from ./include/wx/wx.h:58,
                 from ./include/wx/wxprec.h:54:
./include/wx/stattext.h:23: error: expected ‘=’, ‘,’, ‘;’, ‘asm’ or ‘__attribute__’ before ‘wxStaticTextBase’
In file included from ./include/wx/stattext.h:53,
                 from ./include/wx/wx.h:58,
                 from ./include/wx/wxprec.h:54:
./include/wx/gtk/stattext.h:27: error: expected ‘=’, ‘,’, ‘;’, ‘asm’ or ‘__attribute__’ before ‘wxStaticText’
./include/wx/gtk/stattext.h:37: error: expected ‘=’, ‘,’, ‘;’, ‘asm’ or ‘__attribute__’ before ‘wxStaticText’
In file included from ./include/wx/wx.h:59,
                 from ./include/wx/wxprec.h:54:
./include/wx/statbmp.h:26: error: expected ‘=’, ‘,’, ‘;’, ‘asm’ or ‘__attribute__’ before ‘wxIcon’
./include/wx/statbmp.h:27: error: expected ‘=’, ‘,’, ‘;’, ‘asm’ or ‘__attribute__’ before ‘wxBitmap’
./include/wx/statbmp.h:32: error: expected ‘=’, ‘,’, ‘;’, ‘asm’ or ‘__attribute__’ before ‘wxStaticBitmapBase’
In file included from ./include/wx/statbmp.h:60,
                 from ./include/wx/wx.h:59,
                 from ./include/wx/wxprec.h:54:
./include/wx/gtk/statbmp.h:24: error: expected ‘=’, ‘,’, ‘;’, ‘asm’ or ‘__attribute__’ before ‘wxStaticBitmap’
In file included from ./include/wx/wx.h:60,
                 from ./include/wx/wxprec.h:54:
./include/wx/statbox.h:27: error: expected ‘=’, ‘,’, ‘;’, ‘asm’ or ‘__attribute__’ before ‘wxStaticBoxBase’
In file included from ./include/wx/statbox.h:60,
                 from ./include/wx/wx.h:60,
                 from ./include/wx/wxprec.h:54:
./include/wx/gtk/statbox.h:22: error: expected ‘=’, ‘,’, ‘;’, ‘asm’ or ‘__attribute__’ before ‘wxStaticBox’
In file included from ./include/wx/wx.h:62,
                 from ./include/wx/wxprec.h:54:
./include/wx/radiobox.h:31: error: expected ‘=’, ‘,’, ‘;’, ‘asm’ or ‘__attribute__’ before ‘wxRadioBoxBase’
In file included from ./include/wx/radiobox.h:72,
                 from ./include/wx/wx.h:62,
                 from ./include/wx/wxprec.h:54:
./include/wx/gtk/radiobox.h:24: error: expected ‘=’, ‘,’, ‘;’, ‘asm’ or ‘__attribute__’ before ‘wxRadioBox’
In file included from ./include/wx/radiobut.h:45,
                 from ./include/wx/wx.h:63,
                 from ./include/wx/wxprec.h:54:
./include/wx/gtk/radiobut.h:22: error: expected ‘=’, ‘,’, ‘;’, ‘asm’ or ‘__attribute__’ before ‘wxRadioButton’
In file included from ./include/wx/textctrl.h:40,
                 from ./include/wx/wx.h:64,
                 from ./include/wx/wxprec.h:54:
./include/wx/ioswrap.h:17:23: warning: iostream: No such file or directory
In file included from ./include/wx/wx.h:64,
                 from ./include/wx/wxprec.h:54:
./include/wx/textctrl.h:51: error: expected ‘=’, ‘,’, ‘;’, ‘asm’ or ‘__attribute__’ before ‘wxTextCtrl’
./include/wx/textctrl.h:52: error: expected ‘=’, ‘,’, ‘;’, ‘asm’ or ‘__attribute__’ before ‘wxTextCtrlBase’
./include/wx/textctrl.h:189: error: expected ‘=’, ‘,’, ‘;’, ‘asm’ or ‘__attribute__’ before ‘wxTextAttr’
./include/wx/textctrl.h:268: error: expected ‘=’, ‘,’, ‘;’, ‘asm’ or ‘__attribute__’ before ‘wxTextCtrlBase’
In file included from ./include/wx/textctrl.h:430,
                 from ./include/wx/wx.h:64,
                 from ./include/wx/wxprec.h:54:
./include/wx/gtk/textctrl.h:22: error: expected ‘=’, ‘,’, ‘;’, ‘asm’ or ‘__attribute__’ before ‘wxTextCtrl’
In file included from ./include/wx/wx.h:64,
                 from ./include/wx/wxprec.h:54:
./include/wx/textctrl.h:454: error: expected ‘=’, ‘,’, ‘;’, ‘asm’ or ‘__attribute__’ before ‘wxTextUrlEvent’
./include/wx/textctrl.h:488: error: expected ‘)’ before ‘:’ token
./include/wx/textctrl.h:512: error: expected ‘=’, ‘,’, ‘;’, ‘asm’ or ‘__attribute__’ before ‘wxStreamToTextRedirector’
In file included from ./include/wx/wx.h:65,
                 from ./include/wx/wxprec.h:54:
./include/wx/slider.h:53: error: expected ‘=’, ‘,’, ‘;’, ‘asm’ or ‘__attribute__’ before ‘wxSliderBase’
In file included from ./include/wx/slider.h:134,
                 from ./include/wx/wx.h:65,
                 from ./include/wx/wxprec.h:54:
./include/wx/gtk/slider.h:21: error: expected ‘=’, ‘,’, ‘;’, ‘asm’ or ‘__attribute__’ before ‘wxSlider’
In file included from ./include/wx/wx.h:66,
                 from ./include/wx/wxprec.h:54:
./include/wx/gauge.h:45: error: expected ‘=’, ‘,’, ‘;’, ‘asm’ or ‘__attribute__’ before ‘wxGaugeBase’
In file included from ./include/wx/gauge.h:104,
                 from ./include/wx/wx.h:66,
                 from ./include/wx/wxprec.h:54:
./include/wx/gtk/gauge.h:30: error: expected ‘=’, ‘,’, ‘;’, ‘asm’ or ‘__attribute__’ before ‘wxGauge’
./include/wx/gtk/gauge.h:42: error: expected ‘=’, ‘,’, ‘;’, ‘asm’ or ‘__attribute__’ before ‘wxGauge’
In file included from ./include/wx/wx.h:67,
                 from ./include/wx/wxprec.h:54:
./include/wx/scrolwin.h:17: error: expected ‘=’, ‘,’, ‘;’, ‘asm’ or ‘__attribute__’ before ‘wxScrollHelperEvtHandler’
./include/wx/scrolwin.h:18: error: expected ‘=’, ‘,’, ‘;’, ‘asm’ or ‘__attribute__’ before ‘wxTimer’
In file included from ./include/wx/scrolwin.h:216,
                 from ./include/wx/wx.h:67,
                 from ./include/wx/wxprec.h:54:
./include/wx/gtk/scrolwin.h:37: error: expected ‘=’, ‘,’, ‘;’, ‘asm’ or ‘__attribute__’ before ‘wxScrolledWindow’
In file included from ./include/wx/dirdlg.h:94,
                 from ./include/wx/wx.h:68,
                 from ./include/wx/wxprec.h:54:
./include/wx/generic/dirdlgg.h:22: error: expected ‘=’, ‘,’, ‘;’, ‘asm’ or ‘__attribute__’ before ‘wxGenericDirCtrl’
./include/wx/generic/dirdlgg.h:23: error: expected ‘=’, ‘,’, ‘;’, ‘asm’ or ‘__attribute__’ before ‘wxTextCtrl’
./include/wx/generic/dirdlgg.h:24: error: expected ‘=’, ‘,’, ‘;’, ‘asm’ or ‘__attribute__’ before ‘wxTreeEvent’
In file included from ./include/wx/dirdlg.h:94,
                 from ./include/wx/wx.h:68,
                 from ./include/wx/wxprec.h:54:
./include/wx/generic/dirdlgg.h:46: error: expected ‘=’, ‘,’, ‘;’, ‘asm’ or ‘__attribute__’ before ‘wxGenericDirDialog’
In file included from ./include/wx/wx.h:68,
                 from ./include/wx/wxprec.h:54:
./include/wx/dirdlg.h:104: error: expected ‘=’, ‘,’, ‘;’, ‘asm’ or ‘__attribute__’ before ‘wxDirSelector’
In file included from ./include/wx/toolbar.h:56,
                 from ./include/wx/wx.h:69,
                 from ./include/wx/wxprec.h:54:
./include/wx/tbarbase.h:31: error: expected ‘=’, ‘,’, ‘;’, ‘asm’ or ‘__attribute__’ before ‘wxToolBarBase’
./include/wx/tbarbase.h:32: error: expected ‘=’, ‘,’, ‘;’, ‘asm’ or ‘__attribute__’ before ‘wxToolBarToolBase’
./include/wx/tbarbase.h:33: error: expected ‘=’, ‘,’, ‘;’, ‘asm’ or ‘__attribute__’ before ‘wxImage’
./include/wx/tbarbase.h:40: error: expected ‘=’, ‘,’, ‘;’, ‘asm’ or ‘__attribute__’ before ‘wxDefaultSize’
./include/wx/tbarbase.h:41: error: expected ‘=’, ‘,’, ‘;’, ‘asm’ or ‘__attribute__’ before ‘wxDefaultPosition’
./include/wx/tbarbase.h:61: error: expected ‘=’, ‘,’, ‘;’, ‘asm’ or ‘__attribute__’ before ‘wxToolBarToolBase’
./include/wx/tbarbase.h:244: error: expected ‘=’, ‘,’, ‘;’, ‘asm’ or ‘__attribute__’ before ‘_WX_LIST_ITEM_TYPE_wxToolBarToolsList’
./include/wx/tbarbase.h:244: warning: type defaults to ‘int’ in declaration of ‘wxToolBarToolBase’
./include/wx/tbarbase.h:244: error: expected ‘;’, ‘,’ or ‘)’ before ‘*’ token
./include/wx/tbarbase.h:244: error: expected ‘=’, ‘,’, ‘;’, ‘asm’ or ‘__attribute__’ before ‘wxwxToolBarToolsListNode’
./include/wx/tbarbase.h:244: error: expected ‘=’, ‘,’, ‘;’, ‘asm’ or ‘__attribute__’ before ‘wxToolBarToolsList’
./include/wx/tbarbase.h:250: error: expected ‘=’, ‘,’, ‘;’, ‘asm’ or ‘__attribute__’ before ‘wxToolBarBase’
./include/wx/tbarbase.h:607: error: expected ‘=’, ‘,’, ‘;’, ‘asm’ or ‘__attribute__’ before ‘wxCreateGreyedImage’
In file included from ./include/wx/toolbar.h:71,
                 from ./include/wx/wx.h:69,
                 from ./include/wx/wxprec.h:54:
./include/wx/gtk/tbargtk.h:23: error: expected ‘=’, ‘,’, ‘;’, ‘asm’ or ‘__attribute__’ before ‘wxToolBar’
In file included from ./include/wx/wx.h:70,
                 from ./include/wx/wxprec.h:54:
./include/wx/combobox.h:28: error: expected ‘=’, ‘,’, ‘;’, ‘asm’ or ‘__attribute__’ before ‘wxComboBoxBase’
In file included from ./include/wx/combobox.h:79,
                 from ./include/wx/wx.h:70,
                 from ./include/wx/wxprec.h:54:
./include/wx/gtk/combobox.h:29: error: expected ‘=’, ‘,’, ‘;’, ‘asm’ or ‘__attribute__’ before ‘wxComboBox’
./include/wx/gtk/combobox.h:42: error: expected ‘=’, ‘,’, ‘;’, ‘asm’ or ‘__attribute__’ before ‘wxComboBox’
In file included from ./include/wx/wx.h:71,
                 from ./include/wx/wxprec.h:54:
./include/wx/layout.h:37: error: expected ‘=’, ‘,’, ‘;’, ‘asm’ or ‘__attribute__’ before ‘wxWindowBase’
./include/wx/layout.h:38: error: expected ‘=’, ‘,’, ‘;’, ‘asm’ or ‘__attribute__’ before ‘wxLayoutConstraints’
./include/wx/layout.h:69: error: expected ‘=’, ‘,’, ‘;’, ‘asm’ or ‘__attribute__’ before ‘wxIndividualLayoutConstraint’
./include/wx/layout.h:160: error: expected ‘=’, ‘,’, ‘;’, ‘asm’ or ‘__attribute__’ before ‘wxLayoutConstraints’
In file included from ./include/wx/sizer.h:25,
                 from ./include/wx/wx.h:72,
                 from ./include/wx/wxprec.h:54:
./include/wx/bookctrl.h:30: error: expected ‘=’, ‘,’, ‘;’, ‘asm’ or ‘__attribute__’ before ‘*’ token
./include/wx/bookctrl.h:30: error: ‘_wxArraywxArrayPages’ undeclared here (not in a function)
./include/wx/bookctrl.h:30: error: expected ‘)’ before ‘:’ token
./include/wx/bookctrl.h:30: error: bit-field ‘TypeTooBigToBeStoredInwxBaseArrayPtrVoid’ width not an integer constant
./include/wx/bookctrl.h:30: error: expected ‘)’ before ‘*’ token
./include/wx/bookctrl.h:30: error: expected ‘=’, ‘,’, ‘;’, ‘asm’ or ‘__attribute__’ before ‘wxArrayPages’
./include/wx/bookctrl.h:32: error: expected ‘=’, ‘,’, ‘;’, ‘asm’ or ‘__attribute__’ before ‘wxImageList’
./include/wx/bookctrl.h:38: error: expected ‘=’, ‘,’, ‘;’, ‘asm’ or ‘__attribute__’ before ‘wxBookCtrlBase’
./include/wx/bookctrl.h:215: error: expected ‘=’, ‘,’, ‘;’, ‘asm’ or ‘__attribute__’ before ‘wxBookCtrlBaseEvent’
In file included from ./include/wx/bookctrl.h:242,
                 from ./include/wx/sizer.h:25,
                 from ./include/wx/wx.h:72,
                 from ./include/wx/wxprec.h:54:
./include/wx/notebook.h:42: error: expected ‘=’, ‘,’, ‘;’, ‘asm’ or ‘__attribute__’ before ‘wxNotebookPage’
./include/wx/notebook.h:54: error: expected ‘=’, ‘,’, ‘;’, ‘asm’ or ‘__attribute__’ before ‘wxNotebookBase’
./include/wx/notebook.h:113: error: expected ‘=’, ‘,’, ‘;’, ‘asm’ or ‘__attribute__’ before ‘wxNotebookEvent’
./include/wx/notebook.h:131: error: expected ‘)’ before ‘:’ token
In file included from ./include/wx/notebook.h:153,
                 from ./include/wx/bookctrl.h:242,
                 from ./include/wx/sizer.h:25,
                 from ./include/wx/wx.h:72,
                 from ./include/wx/wxprec.h:54:
./include/wx/gtk/notebook.h:22: error: expected ‘=’, ‘,’, ‘;’, ‘asm’ or ‘__attribute__’ before ‘wxGtkNotebookPage’
./include/wx/gtk/notebook.h:25: error: expected ‘=’, ‘,’, ‘;’, ‘asm’ or ‘__attribute__’ before ‘_WX_LIST_ITEM_TYPE_wxGtkNotebookPagesList’
./include/wx/gtk/notebook.h:25: warning: type defaults to ‘int’ in declaration of ‘wxGtkNotebookPage’
./include/wx/gtk/notebook.h:25: error: expected ‘;’, ‘,’ or ‘)’ before ‘*’ token
./include/wx/gtk/notebook.h:25: error: expected ‘=’, ‘,’, ‘;’, ‘asm’ or ‘__attribute__’ before ‘wxwxGtkNotebookPagesListNode’
./include/wx/gtk/notebook.h:25: error: expected ‘=’, ‘,’, ‘;’, ‘asm’ or ‘__attribute__’ before ‘wxGtkNotebookPagesList’
./include/wx/gtk/notebook.h:31: error: expected ‘=’, ‘,’, ‘;’, ‘asm’ or ‘__attribute__’ before ‘wxNotebook’
In file included from ./include/wx/wx.h:72,
                 from ./include/wx/wxprec.h:54:
./include/wx/sizer.h:31: error: expected ‘=’, ‘,’, ‘;’, ‘asm’ or ‘__attribute__’ before ‘wxSizerItem’
./include/wx/sizer.h:32: error: expected ‘=’, ‘,’, ‘;’, ‘asm’ or ‘__attribute__’ before ‘wxSizer’
./include/wx/sizer.h:33: error: expected ‘=’, ‘,’, ‘;’, ‘asm’ or ‘__attribute__’ before ‘wxBoxSizer’
./include/wx/sizer.h:40: error: expected ‘=’, ‘,’, ‘;’, ‘asm’ or ‘__attribute__’ before ‘wxSizerFlags’
./include/wx/sizer.h:109: error: expected ‘=’, ‘,’, ‘;’, ‘asm’ or ‘__attribute__’ before ‘wxSizerSpacer’
./include/wx/sizer.h:132: error: expected ‘=’, ‘,’, ‘;’, ‘asm’ or ‘__attribute__’ before ‘wxSizerItem’
./include/wx/sizer.h:306: error: expected ‘=’, ‘,’, ‘;’, ‘asm’ or ‘__attribute__’ before ‘_WX_LIST_ITEM_TYPE_wxSizerItemList’
./include/wx/sizer.h:306: warning: type defaults to ‘int’ in declaration of ‘wxSizerItem’
./include/wx/sizer.h:306: error: expected ‘;’, ‘,’ or ‘)’ before ‘*’ token
./include/wx/sizer.h:306: error: expected ‘=’, ‘,’, ‘;’, ‘asm’ or ‘__attribute__’ before ‘wxwxSizerItemListNode’
./include/wx/sizer.h:306: error: expected ‘=’, ‘,’, ‘;’, ‘asm’ or ‘__attribute__’ before ‘wxSizerItemList’
./include/wx/sizer.h:313: error: expected ‘=’, ‘,’, ‘;’, ‘asm’ or ‘__attribute__’ before ‘wxSizer’
./include/wx/sizer.h:513: error: expected ‘=’, ‘,’, ‘;’, ‘asm’ or ‘__attribute__’ before ‘wxGridSizer’
./include/wx/sizer.h:564: error: expected ‘=’, ‘,’, ‘;’, ‘asm’ or ‘__attribute__’ before ‘wxFlexGridSizer’
./include/wx/sizer.h:635: error: expected ‘=’, ‘,’, ‘;’, ‘asm’ or ‘__attribute__’ before ‘wxBoxSizer’
./include/wx/sizer.h:667: error: expected ‘=’, ‘,’, ‘;’, ‘asm’ or ‘__attribute__’ before ‘wxStaticBox’
./include/wx/sizer.h:669: error: expected ‘=’, ‘,’, ‘;’, ‘asm’ or ‘__attribute__’ before ‘wxStaticBoxSizer’
./include/wx/sizer.h:696: error: expected ‘=’, ‘,’, ‘;’, ‘asm’ or ‘__attribute__’ before ‘wxStdDialogButtonSizer’
./include/wx/sizer.h:754: error: expected ‘=’, ‘,’, ‘;’, ‘asm’ or ‘__attribute__’ before ‘wxBookCtrlBase’
./include/wx/sizer.h:756: error: expected ‘=’, ‘,’, ‘;’, ‘asm’ or ‘__attribute__’ before ‘wxBookCtrlSizer’
./include/wx/sizer.h:783: error: expected ‘=’, ‘,’, ‘;’, ‘asm’ or ‘__attribute__’ before ‘wxNotebook’
./include/wx/sizer.h:785: error: expected ‘=’, ‘,’, ‘;’, ‘asm’ or ‘__attribute__’ before ‘wxNotebookSizer’
./include/wx/sizer.h:807: error: expected ‘=’, ‘,’, ‘;’, ‘asm’ or ‘__attribute__’ before ‘*’ token
./include/wx/sizer.h:813: error: expected ‘=’, ‘,’, ‘;’, ‘asm’ or ‘__attribute__’ before ‘*’ token
./include/wx/sizer.h:819: error: expected ‘=’, ‘,’, ‘;’, ‘asm’ or ‘__attribute__’ before ‘*’ token
./include/wx/sizer.h:825: error: expected ‘=’, ‘,’, ‘;’, ‘asm’ or ‘__attribute__’ before ‘*’ token
./include/wx/sizer.h:831: error: expected ‘=’, ‘,’, ‘;’, ‘asm’ or ‘__attribute__’ before ‘*’ token
./include/wx/sizer.h:837: error: expected ‘=’, ‘,’, ‘;’, ‘asm’ or ‘__attribute__’ before ‘*’ token
./include/wx/sizer.h:843: error: expected ‘=’, ‘,’, ‘;’, ‘asm’ or ‘__attribute__’ before ‘*’ token
./include/wx/sizer.h:849: error: expected ‘=’, ‘,’, ‘;’, ‘asm’ or ‘__attribute__’ before ‘*’ token
./include/wx/sizer.h:855: error: expected ‘=’, ‘,’, ‘;’, ‘asm’ or ‘__attribute__’ before ‘*’ token
./include/wx/sizer.h:861: error: expected ‘=’, ‘,’, ‘;’, ‘asm’ or ‘__attribute__’ before ‘*’ token
./include/wx/sizer.h:867: error: expected ‘=’, ‘,’, ‘;’, ‘asm’ or ‘__attribute__’ before ‘*’ token
./include/wx/sizer.h:873: error: expected ‘=’, ‘,’, ‘;’, ‘asm’ or ‘__attribute__’ before ‘*’ token
./include/wx/sizer.h:879: error: expected ‘=’, ‘,’, ‘;’, ‘asm’ or ‘__attribute__’ before ‘*’ token
./include/wx/sizer.h:885: error: expected ‘=’, ‘,’, ‘;’, ‘asm’ or ‘__attribute__’ before ‘*’ token
./include/wx/sizer.h:891: error: expected ‘=’, ‘,’, ‘;’, ‘asm’ or ‘__attribute__’ before ‘*’ token
./include/wx/sizer.h:897: error: expected ‘=’, ‘,’, ‘;’, ‘asm’ or ‘__attribute__’ before ‘*’ token
./include/wx/sizer.h:903: error: expected ‘=’, ‘,’, ‘;’, ‘asm’ or ‘__attribute__’ before ‘*’ token
./include/wx/sizer.h:914: error: expected ‘=’, ‘,’, ‘;’, ‘asm’ or ‘__attribute__’ before ‘*’ token
./include/wx/sizer.h:925: error: expected ‘=’, ‘,’, ‘;’, ‘asm’ or ‘__attribute__’ before ‘*’ token
./include/wx/sizer.h:937: error: expected ‘=’, ‘,’, ‘;’, ‘asm’ or ‘__attribute__’ before ‘*’ token
./include/wx/sizer.h:943: error: expected ‘=’, ‘,’, ‘;’, ‘asm’ or ‘__attribute__’ before ‘*’ token
./include/wx/sizer.h:949: error: expected ‘=’, ‘,’, ‘;’, ‘asm’ or ‘__attribute__’ before ‘*’ token
./include/wx/sizer.h:955: error: expected ‘=’, ‘,’, ‘;’, ‘asm’ or ‘__attribute__’ before ‘*’ token
In file included from ./include/wx/mdi.h:26,
                 from ./include/wx/wx.h:74,
                 from ./include/wx/wxprec.h:54:
./include/wx/gtk/mdi.h:30: error: expected ‘=’, ‘,’, ‘;’, ‘asm’ or ‘__attribute__’ before ‘wxMDIParentFrame’
./include/wx/gtk/mdi.h:31: error: expected ‘=’, ‘,’, ‘;’, ‘asm’ or ‘__attribute__’ before ‘wxMDIClientWindow’
./include/wx/gtk/mdi.h:32: error: expected ‘=’, ‘,’, ‘;’, ‘asm’ or ‘__attribute__’ before ‘wxMDIChildFrame’
./include/wx/gtk/mdi.h:45: error: expected ‘=’, ‘,’, ‘;’, ‘asm’ or ‘__attribute__’ before ‘wxMDIParentFrame’
./include/wx/gtk/mdi.h:105: error: expected ‘=’, ‘,’, ‘;’, ‘asm’ or ‘__attribute__’ before ‘wxMDIChildFrame’
./include/wx/gtk/mdi.h:208: error: expected ‘=’, ‘,’, ‘;’, ‘asm’ or ‘__attribute__’ before ‘wxMDIClientWindow’
In file included from ./include/wx/wx.h:75,
                 from ./include/wx/wxprec.h:54:
./include/wx/statusbr.h:26: error: expected ‘=’, ‘,’, ‘;’, ‘asm’ or ‘__attribute__’ before ‘_WX_LIST_ITEM_TYPE_wxListString’
./include/wx/statusbr.h:26: warning: type defaults to ‘int’ in declaration of ‘wxString’
./include/wx/statusbr.h:26: error: expected ‘;’, ‘,’ or ‘)’ before ‘*’ token
./include/wx/statusbr.h:26: error: expected ‘=’, ‘,’, ‘;’, ‘asm’ or ‘__attribute__’ before ‘wxwxListStringNode’
./include/wx/statusbr.h:26: error: expected ‘=’, ‘,’, ‘;’, ‘asm’ or ‘__attribute__’ before ‘wxListString’
./include/wx/statusbr.h:41: error: expected ‘=’, ‘,’, ‘;’, ‘asm’ or ‘__attribute__’ before ‘wxStatusBarBase’
In file included from ./include/wx/statusbr.h:169,
                 from ./include/wx/wx.h:75,
                 from ./include/wx/wxprec.h:54:
./include/wx/generic/statusbr.h:26: error: expected ‘=’, ‘,’, ‘;’, ‘asm’ or ‘__attribute__’ before ‘wxStatusBar’
In file included from ./include/wx/choicdlg.h:17,
                 from ./include/wx/wx.h:77,
                 from ./include/wx/wxprec.h:54:
./include/wx/generic/choicdgg.h:22: error: expected ‘=’, ‘,’, ‘;’, ‘asm’ or ‘__attribute__’ before ‘wxListBox’
./include/wx/generic/choicdgg.h:43: error: expected ‘=’, ‘,’, ‘;’, ‘asm’ or ‘__attribute__’ before ‘wxAnyChoiceDialog’
./include/wx/generic/choicdgg.h:96: error: expected ‘=’, ‘,’, ‘;’, ‘asm’ or ‘__attribute__’ before ‘wxSingleChoiceDialog’
./include/wx/generic/choicdgg.h:160: error: expected ‘=’, ‘,’, ‘;’, ‘asm’ or ‘__attribute__’ before ‘wxMultiChoiceDialog’
./include/wx/generic/choicdgg.h:217: error: expected ‘=’, ‘,’, ‘;’, ‘asm’ or ‘__attribute__’ before ‘wxGetSingleChoice’
./include/wx/generic/choicdgg.h:227: error: expected ‘=’, ‘,’, ‘;’, ‘asm’ or ‘__attribute__’ before ‘wxGetSingleChoice’
./include/wx/generic/choicdgg.h:239: warning: type defaults to ‘int’ in declaration of ‘wxString’
./include/wx/generic/choicdgg.h:239: error: expected ‘;’, ‘,’ or ‘)’ before ‘&’ token
./include/wx/generic/choicdgg.h:249: warning: type defaults to ‘int’ in declaration of ‘wxString’
./include/wx/generic/choicdgg.h:249: error: expected ‘;’, ‘,’ or ‘)’ before ‘&’ token
./include/wx/generic/choicdgg.h:260: warning: type defaults to ‘int’ in declaration of ‘wxString’
./include/wx/generic/choicdgg.h:260: error: expected ‘;’, ‘,’ or ‘)’ before ‘&’ token
./include/wx/generic/choicdgg.h:271: warning: type defaults to ‘int’ in declaration of ‘wxString’
./include/wx/generic/choicdgg.h:271: error: expected ‘;’, ‘,’ or ‘)’ before ‘&’ token
./include/wx/generic/choicdgg.h:285: error: expected ‘)’ before ‘&’ token
./include/wx/generic/choicdgg.h:296: error: expected ‘)’ before ‘&’ token
In file included from ./include/wx/generic/textdlgg.h:26,
                 from ./include/wx/textdlg.h:15,
                 from ./include/wx/wx.h:78,
                 from ./include/wx/wxprec.h:54:
./include/wx/valtext.h:36: error: expected ‘=’, ‘,’, ‘;’, ‘asm’ or ‘__attribute__’ before ‘wxTextValidator’
In file included from ./include/wx/textdlg.h:15,
                 from ./include/wx/wx.h:78,
                 from ./include/wx/wxprec.h:54:
./include/wx/generic/textdlgg.h:29: error: expected ‘=’, ‘,’, ‘;’, ‘asm’ or ‘__attribute__’ before ‘wxTextCtrl’
./include/wx/generic/textdlgg.h:40: error: expected ‘=’, ‘,’, ‘;’, ‘asm’ or ‘__attribute__’ before ‘wxTextEntryDialog’
./include/wx/generic/textdlgg.h:78: error: expected ‘=’, ‘,’, ‘;’, ‘asm’ or ‘__attribute__’ before ‘wxPasswordEntryDialog’
./include/wx/generic/textdlgg.h:97: error: expected ‘=’, ‘,’, ‘;’, ‘asm’ or ‘__attribute__’ before ‘wxGetTextFromUser’
./include/wx/generic/textdlgg.h:106: error: expected ‘=’, ‘,’, ‘;’, ‘asm’ or ‘__attribute__’ before ‘wxGetPasswordFromUser’
In file included from ./include/wx/numdlg.h:17,
                 from ./include/wx/textdlg.h:19,
                 from ./include/wx/wx.h:78,
                 from ./include/wx/wxprec.h:54:
./include/wx/generic/numdlgg.h:26: error: expected ‘=’, ‘,’, ‘;’, ‘asm’ or ‘__attribute__’ before ‘wxSpinCtrl’
./include/wx/generic/numdlgg.h:35: error: expected ‘=’, ‘,’, ‘;’, ‘asm’ or ‘__attribute__’ before ‘wxNumberEntryDialog’
./include/wx/generic/numdlgg.h:72: warning: type defaults to ‘int’ in declaration of ‘wxString’
./include/wx/generic/numdlgg.h:72: error: expected ‘;’, ‘,’ or ‘)’ before ‘&’ token
In file included from ./include/wx/wx.h:79,
                 from ./include/wx/wxprec.h:54:
./include/wx/filedlg.h:50: error: expected ‘=’, ‘,’, ‘;’, ‘asm’ or ‘__attribute__’ before ‘wxFileDialogBase’
./include/wx/filedlg.h:135: error: expected ‘=’, ‘,’, ‘;’, ‘asm’ or ‘__attribute__’ before ‘wxFileSelector’
./include/wx/filedlg.h:146: error: expected ‘=’, ‘,’, ‘;’, ‘asm’ or ‘__attribute__’ before ‘wxFileSelectorEx’
./include/wx/filedlg.h:157: error: expected ‘=’, ‘,’, ‘;’, ‘asm’ or ‘__attribute__’ before ‘wxLoadFileSelector’
./include/wx/filedlg.h:164: error: expected ‘=’, ‘,’, ‘;’, ‘asm’ or ‘__attribute__’ before ‘wxSaveFileSelector’
In file included from ./include/wx/listctrl.h:23,
                 from ./include/wx/generic/filedlgg.h:19,
                 from ./include/wx/gtk/filedlg.h:18,
                 from ./include/wx/filedlg.h:177,
                 from ./include/wx/wx.h:79,
                 from ./include/wx/wxprec.h:54:
./include/wx/listbase.h:167: error: expected ‘=’, ‘,’, ‘;’, ‘asm’ or ‘__attribute__’ before ‘wxListItemAttr’
./include/wx/listbase.h:201: error: expected ‘=’, ‘,’, ‘;’, ‘asm’ or ‘__attribute__’ before ‘wxListItem’
./include/wx/listbase.h:344: error: expected ‘=’, ‘,’, ‘;’, ‘asm’ or ‘__attribute__’ before ‘wxListEvent’
./include/wx/listbase.h:446: error: expected ‘)’ before ‘:’ token
In file included from ./include/wx/generic/listctrl.h:23,
                 from ./include/wx/listctrl.h:38,
                 from ./include/wx/generic/filedlgg.h:19,
                 from ./include/wx/gtk/filedlg.h:18,
                 from ./include/wx/filedlg.h:177,
                 from ./include/wx/wx.h:79,
                 from ./include/wx/wxprec.h:54:
./include/wx/generic/imaglist.h:22: error: expected ‘=’, ‘,’, ‘;’, ‘asm’ or ‘__attribute__’ before ‘wxDC’
./include/wx/generic/imaglist.h:23: error: expected ‘=’, ‘,’, ‘;’, ‘asm’ or ‘__attribute__’ before ‘wxBitmap’
./include/wx/generic/imaglist.h:24: error: expected ‘=’, ‘,’, ‘;’, ‘asm’ or ‘__attribute__’ before ‘wxColour’
./include/wx/generic/imaglist.h:57: error: expected ‘=’, ‘,’, ‘;’, ‘asm’ or ‘__attribute__’ before ‘wxGenericImageList’
./include/wx/generic/imaglist.h:99: error: expected ‘=’, ‘,’, ‘;’, ‘asm’ or ‘__attribute__’ before ‘wxImageList’
In file included from ./include/wx/listctrl.h:38,
                 from ./include/wx/generic/filedlgg.h:19,
                 from ./include/wx/gtk/filedlg.h:18,
                 from ./include/wx/filedlg.h:177,
                 from ./include/wx/wx.h:79,
                 from ./include/wx/wxprec.h:54:
./include/wx/generic/listctrl.h:34: error: expected ‘=’, ‘,’, ‘;’, ‘asm’ or ‘__attribute__’ before ‘wxDropTarget’
./include/wx/generic/listctrl.h:41: error: expected ‘=’, ‘,’, ‘;’, ‘asm’ or ‘__attribute__’ before ‘wxListItem’
./include/wx/generic/listctrl.h:42: error: expected ‘=’, ‘,’, ‘;’, ‘asm’ or ‘__attribute__’ before ‘wxListEvent’
./include/wx/generic/listctrl.h:45: error: expected ‘=’, ‘,’, ‘;’, ‘asm’ or ‘__attribute__’ before ‘wxListCtrl’
./include/wx/generic/listctrl.h:55: error: expected ‘=’, ‘,’, ‘;’, ‘asm’ or ‘__attribute__’ before ‘wxListHeaderData’
./include/wx/generic/listctrl.h:56: error: expected ‘=’, ‘,’, ‘;’, ‘asm’ or ‘__attribute__’ before ‘wxListItemData’
./include/wx/generic/listctrl.h:57: error: expected ‘=’, ‘,’, ‘;’, ‘asm’ or ‘__attribute__’ before ‘wxListLineData’
./include/wx/generic/listctrl.h:59: error: expected ‘=’, ‘,’, ‘;’, ‘asm’ or ‘__attribute__’ before ‘wxListHeaderWindow’
./include/wx/generic/listctrl.h:60: error: expected ‘=’, ‘,’, ‘;’, ‘asm’ or ‘__attribute__’ before ‘wxListMainWindow’
./include/wx/generic/listctrl.h:62: error: expected ‘=’, ‘,’, ‘;’, ‘asm’ or ‘__attribute__’ before ‘wxListRenameTimer’
./include/wx/generic/listctrl.h:63: error: expected ‘=’, ‘,’, ‘;’, ‘asm’ or ‘__attribute__’ before ‘wxListTextCtrl’
./include/wx/generic/listctrl.h:69: error: expected ‘=’, ‘,’, ‘;’, ‘asm’ or ‘__attribute__’ before ‘wxGenericListCtrl’
./include/wx/generic/listctrl.h:274: error: expected ‘=’, ‘,’, ‘;’, ‘asm’ or ‘__attribute__’ before ‘wxListCtrl’
In file included from ./include/wx/generic/filedlgg.h:19,
                 from ./include/wx/gtk/filedlg.h:18,
                 from ./include/wx/filedlg.h:177,
                 from ./include/wx/wx.h:79,
                 from ./include/wx/wxprec.h:54:
./include/wx/listctrl.h:45: error: expected ‘=’, ‘,’, ‘;’, ‘asm’ or ‘__attribute__’ before ‘wxListView’
In file included from ./include/wx/generic/filedlgg.h:20,
                 from ./include/wx/gtk/filedlg.h:18,
                 from ./include/wx/filedlg.h:177,
                 from ./include/wx/wx.h:79,
                 from ./include/wx/wxprec.h:54:
./include/wx/datetime.h:34: error: expected ‘=’, ‘,’, ‘;’, ‘asm’ or ‘__attribute__’ before ‘wxDateTime’
./include/wx/datetime.h:35: error: expected ‘=’, ‘,’, ‘;’, ‘asm’ or ‘__attribute__’ before ‘wxTimeSpan’
./include/wx/datetime.h:36: error: expected ‘=’, ‘,’, ‘;’, ‘asm’ or ‘__attribute__’ before ‘wxDateSpan’
./include/wx/datetime.h:111: error: expected ‘=’, ‘,’, ‘;’, ‘asm’ or ‘__attribute__’ before ‘wxDateTime’
./include/wx/datetime.h:115: error: expected ‘=’, ‘,’, ‘;’, ‘asm’ or ‘__attribute__’ before ‘wxDefaultDateTime’
./include/wx/datetime.h:123: error: expected ‘=’, ‘,’, ‘;’, ‘asm’ or ‘__attribute__’ before ‘wxDateTime’
./include/wx/datetime.h:1093: error: expected ‘=’, ‘,’, ‘;’, ‘asm’ or ‘__attribute__’ before ‘wxTimeSpan’
./include/wx/datetime.h:1315: error: expected ‘=’, ‘,’, ‘;’, ‘asm’ or ‘__attribute__’ before ‘wxDateSpan’
./include/wx/datetime.h:1446: error: expected ‘=’, ‘,’, ‘;’, ‘asm’ or ‘__attribute__’ before ‘_wxObjArraywxDateTimeArray’
./include/wx/datetime.h:1446: error: expected ‘)’ before ‘*’ token
./include/wx/datetime.h:1446: error: expected ‘=’, ‘,’, ‘;’, ‘asm’ or ‘__attribute__’ before ‘wxDateTimeArray’
./include/wx/datetime.h:1457: error: expected ‘=’, ‘,’, ‘;’, ‘asm’ or ‘__attribute__’ before ‘wxDateTimeHolidayAuthority’
./include/wx/datetime.h:1458: error: expected ‘=’, ‘,’, ‘;’, ‘asm’ or ‘__attribute__’ before ‘*’ token
./include/wx/datetime.h:1458: error: ‘_wxArraywxHolidayAuthoritiesArray’ undeclared here (not in a function)
./include/wx/datetime.h:1458: error: expected ‘)’ before ‘:’ token
./include/wx/datetime.h:1458: error: bit-field ‘TypeTooBigToBeStoredInwxBaseArrayPtrVoid’ width not an integer constant
./include/wx/datetime.h:1458: error: expected ‘)’ before ‘*’ token
./include/wx/datetime.h:1458: error: expected ‘=’, ‘,’, ‘;’, ‘asm’ or ‘__attribute__’ before ‘wxHolidayAuthoritiesArray’
./include/wx/datetime.h:1462: error: expected ‘=’, ‘,’, ‘;’, ‘asm’ or ‘__attribute__’ before ‘wxDateTimeHolidaysModule’
./include/wx/datetime.h:1463: error: expected ‘=’, ‘,’, ‘;’, ‘asm’ or ‘__attribute__’ before ‘wxDateTimeHolidayAuthority’
./include/wx/datetime.h:1508: error: expected ‘=’, ‘,’, ‘;’, ‘asm’ or ‘__attribute__’ before ‘wxDateTimeWorkDays’
./include/wx/datetime.h:1540: error: expected ‘=’, ‘,’, ‘;’, ‘asm’ or ‘__attribute__’ before ‘wxDateTime’
./include/wx/datetime.h:1546: error: expected ‘=’, ‘,’, ‘;’, ‘asm’ or ‘__attribute__’ before ‘wxDateTime’
./include/wx/datetime.h:1552: error: expected ‘=’, ‘,’, ‘;’, ‘asm’ or ‘__attribute__’ before ‘wxDateTime’
./include/wx/datetime.h:1561: error: expected ‘=’, ‘,’, ‘;’, ‘asm’ or ‘__attribute__’ before ‘&’ token
./include/wx/datetime.h:1571: error: expected ‘=’, ‘,’, ‘;’, ‘asm’ or ‘__attribute__’ before ‘&’ token
./include/wx/datetime.h:1578: error: expected ‘=’, ‘,’, ‘;’, ‘asm’ or ‘__attribute__’ before ‘:’ token
./include/wx/datetime.h:1584: error: expected ‘=’, ‘,’, ‘;’, ‘asm’ or ‘__attribute__’ before ‘:’ token
./include/wx/datetime.h:1589: error: expected ‘=’, ‘,’, ‘;’, ‘asm’ or ‘__attribute__’ before ‘:’ token
./include/wx/datetime.h:1594: error: expected ‘=’, ‘,’, ‘;’, ‘asm’ or ‘__attribute__’ before ‘:’ token
./include/wx/datetime.h:1599: error: expected ‘=’, ‘,’, ‘;’, ‘asm’ or ‘__attribute__’ before ‘&’ token
./include/wx/datetime.h:1607: error: expected ‘=’, ‘,’, ‘;’, ‘asm’ or ‘__attribute__’ before ‘:’ token
./include/wx/datetime.h:1615: error: expected ‘=’, ‘,’, ‘;’, ‘asm’ or ‘__attribute__’ before ‘:’ token
./include/wx/datetime.h:1630: error: expected ‘=’, ‘,’, ‘;’, ‘asm’ or ‘__attribute__’ before ‘wxDateTime’
./include/wx/datetime.h:1637: error: expected ‘=’, ‘,’, ‘;’, ‘asm’ or ‘__attribute__’ before ‘:’ token
./include/wx/datetime.h:1648: error: expected ‘=’, ‘,’, ‘;’, ‘asm’ or ‘__attribute__’ before ‘wxDateTime’
./include/wx/datetime.h:1656: error: expected ‘=’, ‘,’, ‘;’, ‘asm’ or ‘__attribute__’ before ‘wxDateTime’
./include/wx/datetime.h:1662: error: expected ‘=’, ‘,’, ‘;’, ‘asm’ or ‘__attribute__’ before ‘wxDateTime’
./include/wx/datetime.h:1667: error: expected ‘=’, ‘,’, ‘;’, ‘asm’ or ‘__attribute__’ before ‘wxDateTime’
./include/wx/datetime.h:1672: error: expected ‘=’, ‘,’, ‘;’, ‘asm’ or ‘__attribute__’ before ‘wxDateTime’
./include/wx/datetime.h:1682: error: expected ‘=’, ‘,’, ‘;’, ‘asm’ or ‘__attribute__’ before ‘wxDateTime’
./include/wx/datetime.h:1691: error: expected ‘=’, ‘,’, ‘;’, ‘asm’ or ‘__attribute__’ before ‘wxDateTime’
./include/wx/datetime.h:1696: error: expected ‘=’, ‘,’, ‘;’, ‘asm’ or ‘__attribute__’ before ‘wxDateTime’
./include/wx/datetime.h:1705: error: expected ‘=’, ‘,’, ‘;’, ‘asm’ or ‘__attribute__’ before ‘wxDateTime’
./include/wx/datetime.h:1712: error: expected ‘=’, ‘,’, ‘;’, ‘asm’ or ‘__attribute__’ before ‘wxDateTime’
./include/wx/datetime.h:1719: error: expected ‘=’, ‘,’, ‘;’, ‘asm’ or ‘__attribute__’ before ‘wxDateTime’
./include/wx/datetime.h:1726: error: expected ‘=’, ‘,’, ‘;’, ‘asm’ or ‘__attribute__’ before ‘wxDateTime’
./include/wx/datetime.h:1733: error: expected ‘=’, ‘,’, ‘;’, ‘asm’ or ‘__attribute__’ before ‘wxDateTime’
./include/wx/datetime.h:1740: error: expected ‘=’, ‘,’, ‘;’, ‘asm’ or ‘__attribute__’ before ‘wxDateTime’
./include/wx/datetime.h:1750: error: expected ‘=’, ‘,’, ‘;’, ‘asm’ or ‘__attribute__’ before ‘wxDateTime’
./include/wx/datetime.h:1766: error: expected ‘=’, ‘,’, ‘;’, ‘asm’ or ‘__attribute__’ before ‘wxDateTime’
./include/wx/datetime.h:1776: error: expected ‘=’, ‘,’, ‘;’, ‘asm’ or ‘__attribute__’ before ‘wxDateTime’
./include/wx/datetime.h:1783: error: expected ‘=’, ‘,’, ‘;’, ‘asm’ or ‘__attribute__’ before ‘&’ token
./include/wx/datetime.h:1792: error: expected ‘=’, ‘,’, ‘;’, ‘asm’ or ‘__attribute__’ before ‘&’ token
./include/wx/datetime.h:1797: error: expected ‘=’, ‘,’, ‘;’, ‘asm’ or ‘__attribute__’ before ‘wxDateTime’
./include/wx/datetime.h:1804: error: expected ‘=’, ‘,’, ‘;’, ‘asm’ or ‘__attribute__’ before ‘&’ token
./include/wx/datetime.h:1813: error: expected ‘=’, ‘,’, ‘;’, ‘asm’ or ‘__attribute__’ before ‘&’ token
./include/wx/datetime.h:1818: error: expected ‘=’, ‘,’, ‘;’, ‘asm’ or ‘__attribute__’ before ‘wxDateTime’
./include/wx/datetime.h:1825: error: expected ‘=’, ‘,’, ‘;’, ‘asm’ or ‘__attribute__’ before ‘wxDateTime’
./include/wx/datetime.h:1830: error: expected ‘=’, ‘,’, ‘;’, ‘asm’ or ‘__attribute__’ before ‘wxDateTime’
./include/wx/datetime.h:1835: error: expected ‘=’, ‘,’, ‘;’, ‘asm’ or ‘__attribute__’ before ‘&’ token
./include/wx/datetime.h:1840: error: expected ‘=’, ‘,’, ‘;’, ‘asm’ or ‘__attribute__’ before ‘wxDateTime’
./include/wx/datetime.h:1845: error: expected ‘=’, ‘,’, ‘;’, ‘asm’ or ‘__attribute__’ before ‘&’ token
./include/wx/datetime.h:1850: error: expected ‘=’, ‘,’, ‘;’, ‘asm’ or ‘__attribute__’ before ‘&’ token
./include/wx/datetime.h:1860: error: expected ‘=’, ‘,’, ‘;’, ‘asm’ or ‘__attribute__’ before ‘wxDateTime’
./include/wx/datetime.h:1868: error: expected ‘=’, ‘,’, ‘;’, ‘asm’ or ‘__attribute__’ before ‘wxDateTime’
./include/wx/datetime.h:1879: error: expected ‘=’, ‘,’, ‘;’, ‘asm’ or ‘__attribute__’ before ‘:’ token
./include/wx/datetime.h:1898: error: expected ‘=’, ‘,’, ‘;’, ‘asm’ or ‘__attribute__’ before ‘wxTimeSpan’
./include/wx/datetime.h:1903: error: expected ‘=’, ‘,’, ‘;’, ‘asm’ or ‘__attribute__’ before ‘:’ token
./include/wx/datetime.h:1908: error: expected ‘=’, ‘,’, ‘;’, ‘asm’ or ‘__attribute__’ before ‘:’ token
./include/wx/datetime.h:1913: error: expected ‘=’, ‘,’, ‘;’, ‘asm’ or ‘__attribute__’ before ‘:’ token
./include/wx/datetime.h:1918: error: expected ‘=’, ‘,’, ‘;’, ‘asm’ or ‘__attribute__’ before ‘:’ token
./include/wx/datetime.h:1927: error: expected ‘=’, ‘,’, ‘;’, ‘asm’ or ‘__attribute__’ before ‘wxTimeSpan’
./include/wx/datetime.h:1932: error: expected ‘=’, ‘,’, ‘;’, ‘asm’ or ‘__attribute__’ before ‘&’ token
./include/wx/datetime.h:1939: error: expected ‘=’, ‘,’, ‘;’, ‘asm’ or ‘__attribute__’ before ‘wxTimeSpan’
./include/wx/datetime.h:1944: error: expected ‘=’, ‘,’, ‘;’, ‘asm’ or ‘__attribute__’ before ‘&’ token
./include/wx/datetime.h:1951: error: expected ‘=’, ‘,’, ‘;’, ‘asm’ or ‘__attribute__’ before ‘&’ token
./include/wx/datetime.h:1958: error: expected ‘=’, ‘,’, ‘;’, ‘asm’ or ‘__attribute__’ before ‘wxTimeSpan’
./include/wx/datetime.h:1963: error: expected ‘=’, ‘,’, ‘;’, ‘asm’ or ‘__attribute__’ before ‘wxTimeSpan’
./include/wx/datetime.h:1968: error: expected ‘=’, ‘,’, ‘;’, ‘asm’ or ‘__attribute__’ before ‘wxTimeSpan’
./include/wx/datetime.h:1973: error: expected ‘=’, ‘,’, ‘;’, ‘asm’ or ‘__attribute__’ before ‘wxTimeSpan’
./include/wx/datetime.h:1982: error: expected ‘=’, ‘,’, ‘;’, ‘asm’ or ‘__attribute__’ before ‘&’ token
./include/wx/datetime.h:1992: error: expected ‘=’, ‘,’, ‘;’, ‘asm’ or ‘__attribute__’ before ‘&’ token
./include/wx/datetime.h:1997: error: expected ‘=’, ‘,’, ‘;’, ‘asm’ or ‘__attribute__’ before ‘wxDateSpan’
./include/wx/datetime.h:2004: error: expected ‘=’, ‘,’, ‘;’, ‘asm’ or ‘__attribute__’ before ‘&’ token
./include/wx/datetime.h:2014: error: expected ‘=’, ‘,’, ‘;’, ‘asm’ or ‘__attribute__’ before ‘wxDateSpan’
./include/wx/datetime.h:2021: error: expected ‘=’, ‘,’, ‘;’, ‘asm’ or ‘__attribute__’ before ‘wxDateSpan’
./include/wx/datetime.h:2026: error: expected ‘=’, ‘,’, ‘;’, ‘asm’ or ‘__attribute__’ before ‘&’ token
./include/wx/datetime.h:2036: error: expected ‘=’, ‘,’, ‘;’, ‘asm’ or ‘__attribute__’ before ‘&’ token
./include/wx/datetime.h:2041: error: expected ‘=’, ‘,’, ‘;’, ‘asm’ or ‘__attribute__’ before ‘&’ token
./include/wx/datetime.h:2046: error: expected ‘=’, ‘,’, ‘;’, ‘asm’ or ‘__attribute__’ before ‘wxDateSpan’
./include/wx/datetime.h:2065: error: expected ‘=’, ‘,’, ‘;’, ‘asm’ or ‘__attribute__’ before ‘operator’
./include/wx/datetime.h:2071: error: expected ‘=’, ‘,’, ‘;’, ‘asm’ or ‘__attribute__’ before ‘operator’
./include/wx/datetime.h:2083: error: expected ‘)’ before ‘:’ token
./include/wx/datetime.h:2084: error: expected ‘)’ before ‘:’ token
./include/wx/datetime.h:2085: error: expected ‘)’ before ‘:’ token
./include/wx/datetime.h:2086: error: expected ‘)’ before ‘:’ token
In file included from ./include/wx/gtk/filedlg.h:18,
                 from ./include/wx/filedlg.h:177,
                 from ./include/wx/wx.h:79,
                 from ./include/wx/wxprec.h:54:
./include/wx/generic/filedlgg.h:26: error: expected ‘=’, ‘,’, ‘;’, ‘asm’ or ‘__attribute__’ before ‘wxBitmapButton’
./include/wx/generic/filedlgg.h:27: error: expected ‘=’, ‘,’, ‘;’, ‘asm’ or ‘__attribute__’ before ‘wxCheckBox’
./include/wx/generic/filedlgg.h:28: error: expected ‘=’, ‘,’, ‘;’, ‘asm’ or ‘__attribute__’ before ‘wxChoice’
./include/wx/generic/filedlgg.h:29: error: expected ‘=’, ‘,’, ‘;’, ‘asm’ or ‘__attribute__’ before ‘wxFileData’
./include/wx/generic/filedlgg.h:30: error: expected ‘=’, ‘,’, ‘;’, ‘asm’ or ‘__attribute__’ before ‘wxFileCtrl’
./include/wx/generic/filedlgg.h:31: error: expected ‘=’, ‘,’, ‘;’, ‘asm’ or ‘__attribute__’ before ‘wxGenericFileDialog’
./include/wx/generic/filedlgg.h:32: error: expected ‘=’, ‘,’, ‘;’, ‘asm’ or ‘__attribute__’ before ‘wxListEvent’
./include/wx/generic/filedlgg.h:33: error: expected ‘=’, ‘,’, ‘;’, ‘asm’ or ‘__attribute__’ before ‘wxListItem’
./include/wx/generic/filedlgg.h:34: error: expected ‘=’, ‘,’, ‘;’, ‘asm’ or ‘__attribute__’ before ‘wxStaticText’
./include/wx/generic/filedlgg.h:35: error: expected ‘=’, ‘,’, ‘;’, ‘asm’ or ‘__attribute__’ before ‘wxTextCtrl’
./include/wx/generic/filedlgg.h:45: error: expected ‘=’, ‘,’, ‘;’, ‘asm’ or ‘__attribute__’ before ‘wxGenericFileDialog’
./include/wx/generic/filedlgg.h:157: error: expected ‘=’, ‘,’, ‘;’, ‘asm’ or ‘__attribute__’ before ‘wxFileData’
./include/wx/generic/filedlgg.h:252: error: expected ‘=’, ‘,’, ‘;’, ‘asm’ or ‘__attribute__’ before ‘wxFileCtrl’
In file included from ./include/wx/filedlg.h:177,
                 from ./include/wx/wx.h:79,
                 from ./include/wx/wxprec.h:54:
./include/wx/gtk/filedlg.h:24: error: expected ‘=’, ‘,’, ‘;’, ‘asm’ or ‘__attribute__’ before ‘wxFileDialog’
distcc[9548] ERROR: compile (null) on localhost failed
make: *** [.pch/wxprec_basedll/wx/wxprec.h.gch] Error 1
distcc[9569] ERROR: compile (null) on localhost failed
make: *** [.pch/wxprec_coredll/wx/wxprec.h.gch] Error 1