This file contains any messages produced by compilers while
running configure, to aid debugging if configure makes a mistake.
configure:579: checking whether to use symlinks for manpages
configure:591: checking whether to compress the manpages
configure:614: checking whether to add a package name suffix for the manpages
configure:642: checking for gcc
configure:755: checking whether the C compiler (gcc ) works
configure:771: gcc -o conftest conftest.c 1>&5
configure:797: checking whether the C compiler (gcc ) is a cross-compiler
configure:802: checking whether we are using GNU C
configure:811: gcc -E conftest.c
configure:830: checking whether gcc accepts -g
configure:868: checking for building with threads
configure:1411: checking if the compiler understands -pipe
configure:1422: gcc -pipe -c conftest.c 1>&5
configure:1441: checking how to run the C preprocessor
configure:1462: gcc -pipe -E conftest.c >/dev/null 2>conftest.out
configure:1529: checking for sin
configure:1557: gcc -pipe -o conftest conftest.c 1>&5
configure:1541: warning: conflicting types for built-in function 'sin'
/tmp/ccPphbDk.o: In function `main':
conftest.c:(.text+0x1d): undefined reference to `sin'
collect2: ld returned 1 exit status
configure: failed program was:
#line 1534 "configure"
#include "confdefs.h"
/* System header to define __stub macros and hopefully few prototypes,
which can conflict with char sin(); below. */
#include <assert.h>
/* Override any gcc2 internal prototype to avoid an error. */
/* We use char because int might match the return type of a gcc2
builtin and then its argument prototype would still apply. */
char sin();
int main() {
/* The GNU C library defines this for functions which it implements
to always fail with ENOSYS. Some functions are actually named
something starting with __ and the normal name is an alias. */
#if defined (__stub_sin) || defined (__stub___sin)
choke me
#else
sin();
#endif
; return 0; }
configure:1578: checking for main in -lieee
configure:1593: gcc -pipe -o conftest conftest.c -lieee 1>&5
configure:1620: checking for main in -linet
configure:1635: gcc -pipe -o conftest conftest.c -linet 1>&5
/usr/bin/ld: cannot find -linet
collect2: ld returned 1 exit status
configure: failed program was:
#line 1628 "configure"
#include "confdefs.h"
int main() {
main()
; return 0; }
configure:1657: checking for net/errno.h
configure:1667: gcc -pipe -E conftest.c >/dev/null 2>conftest.out
configure:1663:23: net/errno.h: No such file or directory
configure: failed program was:
#line 1662 "configure"
#include "confdefs.h"
#include <net/errno.h>
configure:1712: checking for connect
configure:1740: gcc -pipe -o conftest conftest.c 1>&5
configure:1905: checking for gethostbyname
configure:1933: gcc -pipe -o conftest conftest.c 1>&5
configure:2007: checking how to build libraries
configure:2046: checking for ranlib
configure:2078: checking if 64bit support is requested
configure:2098: checking if 64bit Sparc VIS support is requested
configure:2122: checking system version (for dynamic loading)
configure:2148: checking for dlopen in -ldl
configure:2167: gcc -pipe -o conftest conftest.c -ldl 1>&5
configure:2215: checking for ar
configure:3611: checking for build with symbols
configure:3672: checking for required early compiler flags
configure:3686: gcc -pipe -c conftest.c 1>&5
configure:3735: gcc -pipe -c conftest.c 1>&5
configure: In function `main':
configure:3731: error: storage size of 'buf' isn't known
configure: failed program was:
#line 3728 "configure"
#include "confdefs.h"
#include <sys/stat.h>
int main() {
struct stat64 buf; int i = stat64("/", &buf);
; return 0; }
configure:3751: gcc -pipe -c conftest.c 1>&5
configure:3780: checking for 64-bit integer type
configure:3795: gcc -pipe -c conftest.c 1>&5
configure: In function `main':
configure:3791: error: `__int64' undeclared (first use in this function)
configure:3791: error: (Each undeclared identifier is reported only once
configure:3791: error: for each function it appears in.)
configure:3791: error: parse error before "value"
configure: failed program was:
#line 3788 "configure"
#include "confdefs.h"
int main() {
__int64 value = (__int64) 0;
; return 0; }
configure:3818: gcc -pipe -c conftest.c 1>&5
configure:3843: checking for struct dirent64
configure:3857: gcc -pipe -c conftest.c 1>&5
configure:3851:24: sys/dirent.h: No such file or directory
configure: In function `main':
configure:3853: error: storage size of 'p' isn't known
configure: failed program was:
#line 3849 "configure"
#include "confdefs.h"
#include <sys/types.h>
#include <sys/dirent.h>
int main() {
struct dirent64 p;
; return 0; }
configure:3878: checking for struct stat64
configure:3892: gcc -pipe -c conftest.c 1>&5
configure:3913: checking for off64_t
configure:3927: gcc -pipe -c conftest.c 1>&5
configure:3942: checking for open64
configure:3970: gcc -pipe -o conftest -Wl,--export-dynamic conftest.c 1>&5
configure:3942: checking for lseek64
configure:3970: gcc -pipe -o conftest -Wl,--export-dynamic conftest.c 1>&5
configure:4013: checking whether byte ordering is bigendian
configure:4031: gcc -pipe -c conftest.c 1>&5
configure:4046: gcc -pipe -c conftest.c 1>&5
configure: In function `main':
configure:4041: error: `not' undeclared (first use in this function)
configure:4041: error: (Each undeclared identifier is reported only once
configure:4041: error: for each function it appears in.)
configure:4041: error: parse error before "big"
configure: failed program was:
#line 4035 "configure"
#include "confdefs.h"
#include <sys/types.h>
#include <sys/param.h>
int main() {
#if BYTE_ORDER != BIG_ENDIAN
not big endian
#endif
; return 0; }
configure:4112: checking for getcwd
configure:4140: gcc -pipe -o conftest -Wl,--export-dynamic conftest.c 1>&5
configure:4174: checking for opendir
configure:4202: gcc -pipe -o conftest -Wl,--export-dynamic conftest.c 1>&5
configure:4174: checking for strstr
configure:4202: gcc -pipe -o conftest -Wl,--export-dynamic conftest.c 1>&5
configure:4186: warning: conflicting types for built-in function 'strstr'
configure:4232: checking for strtol
configure:4260: gcc -pipe -o conftest -Wl,--export-dynamic conftest.c 1>&5
configure:4232: checking for strtoll
configure:4260: gcc -pipe -o conftest -Wl,--export-dynamic conftest.c 1>&5
configure:4232: checking for strtoull
configure:4260: gcc -pipe -o conftest -Wl,--export-dynamic conftest.c 1>&5
configure:4232: checking for tmpnam
configure:4260: gcc -pipe -o conftest -Wl,--export-dynamic conftest.c 1>&5
/tmp/ccbXUBcU.o: In function `main':
conftest.c:(.text+0x1d): warning: the use of `tmpnam' is dangerous, better use `mkstemp'
configure:4232: checking for waitpid
configure:4260: gcc -pipe -o conftest -Wl,--export-dynamic conftest.c 1>&5
configure:4287: checking for strerror
configure:4315: gcc -pipe -o conftest -Wl,--export-dynamic conftest.c 1>&5
configure:4339: checking for getwd
configure:4367: gcc -pipe -o conftest -Wl,--export-dynamic conftest.c 1>&5
/tmp/ccXKog1m.o: In function `main':
conftest.c:(.text+0x1d): warning: the `getwd' function is dangerous and should not be used.
configure:4391: checking for wait3
configure:4419: gcc -pipe -o conftest -Wl,--export-dynamic conftest.c 1>&5
configure:4443: checking for uname
configure:4471: gcc -pipe -o conftest -Wl,--export-dynamic conftest.c 1>&5
configure:4495: checking for realpath
configure:4523: gcc -pipe -o conftest -Wl,--export-dynamic conftest.c 1>&5
configure:4558: checking dirent.h
configure:4586: gcc -pipe -o conftest -Wl,--export-dynamic conftest.c 1>&5
configure:4607: checking for errno.h
configure:4617: gcc -pipe -E conftest.c >/dev/null 2>conftest.out
configure:4644: checking for float.h
configure:4654: gcc -pipe -E conftest.c >/dev/null 2>conftest.out
configure:4681: checking for values.h
configure:4691: gcc -pipe -E conftest.c >/dev/null 2>conftest.out
configure:4718: checking for limits.h
configure:4728: gcc -pipe -E conftest.c >/dev/null 2>conftest.out
configure:4758: checking for stdlib.h
configure:4768: gcc -pipe -E conftest.c >/dev/null 2>conftest.out
configure:4840: checking for string.h
configure:4850: gcc -pipe -E conftest.c >/dev/null 2>conftest.out
configure:4913: checking for sys/wait.h
configure:4923: gcc -pipe -E conftest.c >/dev/null 2>conftest.out
configure:4950: checking for dlfcn.h
configure:4960: gcc -pipe -E conftest.c >/dev/null 2>conftest.out
configure:4992: checking for unistd.h
configure:5002: gcc -pipe -E conftest.c >/dev/null 2>conftest.out
configure:4992: checking for sys/param.h
configure:5002: gcc -pipe -E conftest.c >/dev/null 2>conftest.out
configure:5042: checking for sys/modem.h
configure:5052: gcc -pipe -E conftest.c >/dev/null 2>conftest.out
configure:5048:23: sys/modem.h: No such file or directory
configure: failed program was:
#line 5047 "configure"
#include "confdefs.h"
#include <sys/modem.h>
configure:5079: checking termios vs. termio vs. sgtty
configure:5314: checking for fd_set in sys/types
configure:5326: gcc -pipe -c conftest.c 1>&5
configure:5384: checking whether struct tm is in sys/time.h or time.h
configure:5397: gcc -pipe -c conftest.c 1>&5
configure:5422: checking for sys/time.h
configure:5432: gcc -pipe -E conftest.c >/dev/null 2>conftest.out
configure:5459: checking whether time.h and sys/time.h may both be included
configure:5473: gcc -pipe -c conftest.c 1>&5
configure:5494: checking for tm_zone in struct tm
configure:5507: gcc -pipe -c conftest.c 1>&5
configure:5567: checking for gmtime_r
configure:5595: gcc -pipe -o conftest -Wl,--export-dynamic conftest.c 1>&5
configure:5567: checking for localtime_r
configure:5595: gcc -pipe -o conftest -Wl,--export-dynamic conftest.c 1>&5
configure:5621: checking tm_tzadj in struct tm
configure:5633: gcc -pipe -c conftest.c 1>&5
configure: In function `main':
configure:5629: error: structure has no member named `tm_tzadj'
configure: failed program was:
#line 5626 "configure"
#include "confdefs.h"
#include <time.h>
int main() {
struct tm tm; tm.tm_tzadj;
; return 0; }
configure:5654: checking tm_gmtoff in struct tm
configure:5666: gcc -pipe -c conftest.c 1>&5
configure:5691: checking long timezone variable
configure:5705: gcc -pipe -c conftest.c 1>&5
configure:5769: checking for st_blksize in struct stat
configure:5782: gcc -pipe -c conftest.c 1>&5
configure:5803: checking for fstatfs
configure:5831: gcc -pipe -o conftest -Wl,--export-dynamic conftest.c 1>&5
configure:5860: checking for 8-bit clean memcmp
configure:5902: checking for memmove
configure:5930: gcc -pipe -o conftest -Wl,--export-dynamic conftest.c 1>&5
configure:5914: warning: conflicting types for built-in function 'memmove'
configure:5963: checking proper strstr implementation
configure:6004: checking for strtoul
configure:6032: gcc -pipe -o conftest -Wl,--export-dynamic conftest.c 1>&5
configure:6095: checking for strtod
configure:6123: gcc -pipe -o conftest -Wl,--export-dynamic conftest.c 1>&5
configure:6189: checking for strtod
configure:6239: checking for Solaris2.4/Tru64 strtod bugs
configure:6304: checking for ANSI C header files
configure:6317: gcc -pipe -E conftest.c >/dev/null 2>conftest.out
configure:6408: checking for mode_t
configure:6441: checking for pid_t
configure:6474: checking for size_t
configure:6507: checking for uid_t in sys/types.h
configure:6542: checking for socklen_t
configure:6586: checking for opendir
configure:6647: checking union wait
configure:6664: gcc -pipe -o conftest -Wl,--export-dynamic conftest.c 1>&5
configure:6691: checking for strncasecmp
configure:6719: gcc -pipe -o conftest -Wl,--export-dynamic conftest.c 1>&5
configure:6841: checking for BSDgettimeofday
configure:6869: gcc -pipe -o conftest -Wl,--export-dynamic conftest.c 1>&5
/tmp/ccl2Scqd.o: In function `main':
conftest.c:(.text+0x1d): undefined reference to `BSDgettimeofday'
collect2: ld returned 1 exit status
configure: failed program was:
#line 6846 "configure"
#include "confdefs.h"
/* System header to define __stub macros and hopefully few prototypes,
which can conflict with char BSDgettimeofday(); below. */
#include <assert.h>
/* Override any gcc2 internal prototype to avoid an error. */
/* We use char because int might match the return type of a gcc2
builtin and then its argument prototype would still apply. */
char BSDgettimeofday();
int main() {
/* The GNU C library defines this for functions which it implements
to always fail with ENOSYS. Some functions are actually named
something starting with __ and the normal name is an alias. */
#if defined (__stub_BSDgettimeofday) || defined (__stub___BSDgettimeofday)
choke me
#else
BSDgettimeofday();
#endif
; return 0; }
configure:6891: checking for gettimeofday
configure:6919: gcc -pipe -o conftest -Wl,--export-dynamic conftest.c 1>&5
configure:6946: checking for gettimeofday declaration
configure:6982: checking whether char is unsigned
configure:7045: checking signed char declarations
configure:7060: gcc -pipe -c conftest.c 1>&5
configure:7085: checking for a putenv() that copies the buffer
configure:7157: checking for langinfo.h
configure:7167: gcc -pipe -E conftest.c >/dev/null 2>conftest.out
configure:7192: checking whether to use nl_langinfo
configure:7202: gcc -pipe -c conftest.c 1>&5
configure:7237: checking for sys/ioctl.h
configure:7247: gcc -pipe -E conftest.c >/dev/null 2>conftest.out
configure:7277: checking for sys/filio.h
configure:7287: gcc -pipe -E conftest.c >/dev/null 2>conftest.out
configure:7283:23: sys/filio.h: No such file or directory
configure: failed program was:
#line 7282 "configure"
#include "confdefs.h"
#include <sys/filio.h>
configure:7314: checking FIONBIO vs. O_NONBLOCK for nonblocking I/O
configure:7377: checking how to package libraries
lfs@AARICIA:/mnt/lfs/sources/tcl8.4.9/unix$ make
...
gcc -pipe -c -O2 -DTCL_DBGX= -Wall -Wno-implicit-int -fno-strict-aliasing -fPIC -I./../generic -I. -DPEEK_XCLOSEIM=1 -D_LARGEFILE64_SOURCE=1 -DTCL_WIDE_INT_TYPE=long\ long -DHAVE_STRUCT_STAT64=1 -DHAVE_OPEN64=1 -DHAVE_LSEEK64=1 -DHAVE_TYPE_OFF64_T=1 -DHAVE_GETCWD=1 -DHAVE_OPENDIR=1 -DHAVE_STRSTR=1 -DHAVE_STRTOL=1 -DHAVE_STRTOLL=1 -DHAVE_STRTOULL=1 -DHAVE_TMPNAM=1 -DHAVE_WAITPID=1 -DHAVE_LIMITS_H=1 -DHAVE_UNISTD_H=1 -DHAVE_SYS_PARAM_H=1 -DHAVE_SYS_TIME_H=1 -DTIME_WITH_SYS_TIME=1 -DHAVE_TM_ZONE=1 -DHAVE_GMTIME_R=1 -DHAVE_LOCALTIME_R=1 -DHAVE_TM_GMTOFF=1 -DHAVE_TIMEZONE_VAR=1 -DHAVE_ST_BLKSIZE=1 -Dstrtod=fixstrtod -DSTDC_HEADERS=1 -DHAVE_SIGNED_CHAR=1 -DHAVE_LANGINFO=1 -DHAVE_SYS_IOCTL_H=1 -DTCL_SHLIB_EXT=\".so\" ./../compat/strstr.c
./../compat/strstr.c: In function `strstr':
./../compat/strstr.c:67: error: `NULL' undeclared (first use in this function)
./../compat/strstr.c:67: error: (Each undeclared identifier is reported only once
./../compat/strstr.c:67: error: for each function it appears in.)
make: *** [strstr.o] Error 1