All pastes #363963 Raw Edit

Untitled

public text v1 · immutable
#363963 ·published 2007-02-19 20:49 UTC
rendered paste body
Processing file ../../../include/orbit/orb-core/../../../src/orb/orb-core/orbit-interface.idl
cc1: note: obsolete option -I- used, please use -iquote instead

** (orbit-idl-2:14836): WARNING **: ../../../include/orbit/orb-core/../../../src/orb/orb-core/orbit-interface.idl compilation failed
make[3]: *** [../../../include/orbit/orb-core/orbit-interface.h] Error 1
make[3]: Leaving directory `/var/tmp/portage/gnome-base/orbit-2.14.2/work/ORBit2-2.14.2/src/orb/orb-core'
make[2]: *** [install-recursive] Error 1
make[2]: Leaving directory `/var/tmp/portage/gnome-base/orbit-2.14.2/work/ORBit2-2.14.2/src/orb'
make[1]: *** [install-recursive] Error 1
make[1]: Leaving directory `/var/tmp/portage/gnome-base/orbit-2.14.2/work/ORBit2-2.14.2/src'
make: *** [install-recursive] Error 1

!!! ERROR: gnome-base/orbit-2.14.2 failed.
Call stack:
  ebuild.sh, line 1614:   Called dyn_install
  ebuild.sh, line 1060:   Called qa_call 'src_install'
  environment, line 1789:   Called src_install
  ebuild.sh, line 1304:   Called gnome2_src_install
  gnome2.eclass, line 85:   Called die

!!! install failed
!!! If you need support, post the topmost build error, and the call stack if relevant.
!!! A complete build log is located at '/var/tmp/portage/gnome-base/orbit-2.14.2/temp/build.log'.