All pastes #363958 Raw Edit

Unnamed

public text v1 · immutable
#363958 ·published 2007-02-19 20:46 UTC
rendered paste body
`/var/cache/qrm/busybox/1.01_NONE_i686/busybox' -> `/var/tmp/qrm/busybox'
==> Starting build of hooks
preparing the source files in hooks directory
==> Starting build of include
compiling source files in include directory
==> Starting build of tomcat
Downloading tomcat, jsr223
Executing all
Building tomcat
Package apache-tomcat already installed
Building sjp (jsr 223)
Package sjp already installed
==> Starting build of java
Filling repository. Actual compilation will be done during 'install'
all -c /var/cache/qrm/java -t /var/tmp/qrm/java -d /usr/local/src/openqrm-3.1.3/
out/qrm/java -w /usr/local/src/openqrm-3.1.3/out/qrm/usr/tomcat --
Setting up [repository=/var/cache/qrm/java/repository]
MAVEN plugin:download -Dmaven.build.dir=/var/tmp/qrm/java/core -DartifactId=maven-xdoclet-plugin -DgroupId=xdoclet -Dversion=1.2 -Dqrm.deploy.dir=/usr/local/src/openqrm-3.1.3/out/qrm/java -Dqrm.overlay.deploy.dir=/usr/local/src/openqrm-3.1.3/out/qrm/usr/tomcat -Dqrm.plugins.deploy.dir=/usr/local/src/openqrm-3.1.3/out/qrm/java/plugins -Dqrm.webapp.deploy.dir=/usr/local/src/openqrm-3.1.3/out/qrm/java/webapp -Dmaven.home.local=/var/cache/qrm/java
[INFO] Scanning for projects...
[INFO] Searching repository for plugin with prefix: 'plugin'.
[INFO] org.apache.maven.plugins: checking for updates from central
[INFO] org.codehaus.mojo: checking for updates from central
[INFO] org.codehaus.mojo: checking for updates from central
[INFO] artifact org.apache.maven.plugins:maven-plugin-plugin: checking for updates from central
Downloading: http://repo1.maven.org/maven2/org/apache/maven/plugins/maven-plugin-plugin/2.2/maven-plugin-plugin-2.2.pom
5K downloaded
Downloading: http://repo1.maven.org/maven2/org/apache/maven/plugins/maven-plugins/7/maven-plugins-7.pom
13K downloaded
Downloading: http://repo1.maven.org/maven2/org/apache/maven/maven-plugin-surrogate-parent/5/maven-plugin-surrogate-parent-5.pom
10K downloaded
Downloading: http://repo1.maven.org/maven2/org/apache/apache/3/apache-3.pom
3K downloaded
Downloading: http://repo1.maven.org/maven2/org/apache/maven/plugins/maven-plugin-plugin/2.2/maven-plugin-plugin-2.2.jar
17K downloaded
[INFO] ------------------------------------------------------------------------
[ERROR] BUILD FAILURE
[INFO] ------------------------------------------------------------------------
[INFO] Required goal not found: plugin:download
[INFO] ------------------------------------------------------------------------
[INFO] For more information, run Maven with the -e switch
[INFO] ------------------------------------------------------------------------
[INFO] Total time: 4 seconds
[INFO] Finished at: Fri Feb 16 23:48:56 CET 2007
[INFO] Final Memory: 1M/3M
[INFO] ------------------------------------------------------------------------
ERROR: Maven run failed, please check!
ERROR: Failed to download xdoclet plugin
make[2]: *** [all] Error 1
make[1]: *** [java/Makefile] Error 2
make: *** [base/Makefile] Error 2