All pastes #363944 Raw Edit

cinelerra compile

public shellscript v1 · immutable
#363944 ·published 2007-02-19 20:35 UTC
rendered paste body
make -f build/Makefile.cinelerrash: Syntax error: end of file unexpected (expecting "then")make[1]: Entering directory `/home/jason/Desktop/cinelerra-2.1'gcc -c -O2 -fomit-frame-pointer -falign-loops=2 -falign-jumps=2 -falign-functions=2 -D_LARGEFILE_SOURCE -D_LARGEFILE64_SOURCE -D_FILE_OFFSET_BITS=64 -I../../freetype-2.1.4/include -I../../ -DHAVE_OSS -DHAVE_FIREWIRE  soundtest.c -o i686/soundtest.osoundtest.c:13:27: error: sys/soundcard.h: No such file or directorysoundtest.c:14:19: error: stdio.h: No such file or directorysoundtest.c:15:20: error: stdlib.h: No such file or directorysoundtest.c:16:20: error: unistd.h: No such file or directorysoundtest.c:17:19: error: fcntl.h: No such file or directorysoundtest.c:18:23: error: sys/ioctl.h: No such file or directorysoundtest.c:19:18: error: math.h: No such file or directorysoundtest.c: In function ‘main’:soundtest.c:24: error: ‘audio_buf_info’ undeclared (first use in this function)soundtest.c:24: error: (Each undeclared identifier is reported only oncesoundtest.c:24: error: for each function it appears in.)soundtest.c:24: error: expected ‘;’ before ‘playinfo’soundtest.c:28: error: ‘AFMT_S16_LE’ undeclared (first use in this function)soundtest.c:40: warning: incompatible implicit declaration of built-in function ‘log’soundtest.c:94: warning: incompatible implicit declaration of built-in function ‘printf’soundtest.c:96: error: ‘O_WRONLY’ undeclared (first use in this function)soundtest.c:102: error: ‘SNDCTL_DSP_SETFRAGMENT’ undeclared (first use in this function)soundtest.c:105: error: ‘SNDCTL_DSP_SETDUPLEX’ undeclared (first use in this function)soundtest.c:110: error: ‘SNDCTL_DSP_SETFMT’ undeclared (first use in this function)soundtest.c:112: error: ‘SNDCTL_DSP_CHANNELS’ undeclared (first use in this function)soundtest.c:114: error: ‘SNDCTL_DSP_SPEED’ undeclared (first use in this function)soundtest.c:117: error: ‘SNDCTL_DSP_GETOSPACE’ undeclared (first use in this function)soundtest.c:117: error: ‘playinfo’ undeclared (first use in this function)soundtest.c:126: error: ‘O_RDONLY’ undeclared (first use in this function)soundtest.c:157: error: ‘SNDCTL_DSP_GETISPACE’ undeclared (first use in this function)soundtest.c:157: error: ‘recinfo’ undeclared (first use in this function)soundtest.c:162: error: ‘SNDCTL_DSP_RESET’ undeclared (first use in this function)make[1]: *** [i686/soundtest.o] Error 1